aries-dev mailing list archives

Site index · List index
Message view « Date » · « Thread »
Top « Date » · « Thread »
From Apache Jenkins Server <jenk...@builds.apache.org>
Subject Build failed in Jenkins: Aries #1665
Date Wed, 05 Sep 2012 09:59:21 GMT
See <https://builds.apache.org/job/Aries/1665/changes>

Changes:

[cumminsh] [ARIES-862][maven-release-plugin]prepare for next development iteration

[cumminsh] [ARIES-862][maven-release-plugin]prepare release org.apache.aries.blueprint.annotation.itests-1.0.0

[cumminsh] [ARIES-862][maven-release-plugin]prepare for next development iteration

[cumminsh] [ARIES-862][maven-release-plugin]prepare release org.apache.aries.application.resolve.transform.cm.itests-1.0.0

[cumminsh] [ARIES-862][maven-release-plugin]prepare for next development iteration

[cumminsh] [ARIES-862][maven-release-plugin]prepare release application-modeller-common-test-1.0.0

[cumminsh] [ARIES-862] Adding missing copyright statements to application modelling tests

[cumminsh] [ARIES-862][maven-release-plugin]prepare for next development iteration

[cumminsh] [ARIES-862][maven-release-plugin]prepare release org.apache.aries.application.runtime.isolated.itests-1.0.0

[cumminsh] [ARIES-862][maven-release-plugin]prepare for next development iteration

[cumminsh] [ARIES-862][maven-release-plugin]prepare release org.apache.aries.ejb.openejb.extender.itest-1.0.0

[cumminsh] [ARIES-862] Adding missing copyright statements to ejb tests

------------------------------------------
[...truncated 13695 lines...]
[INFO] Using 'UTF-8' encoding to copy filtered resources.
[INFO] skip non existing resourceDirectory <https://builds.apache.org/job/Aries/ws/aries/subsystem/subsystem-core/src/test/resources>
[INFO] skip non existing resourceDirectory <https://builds.apache.org/job/Aries/ws/aries/subsystem/subsystem-core/src/test/filtered-resources>
[INFO] Copying 3 resources
[INFO] [compiler:testCompile {execution: default-testCompile}]
[INFO] Compiling 1 source file to <https://builds.apache.org/job/Aries/ws/aries/subsystem/subsystem-core/target/test-classes>
[INFO] [surefire:test {execution: default-test}]
[INFO] Surefire report directory: <https://builds.apache.org/job/Aries/ws/aries/subsystem/subsystem-core/target/surefire-reports>

-------------------------------------------------------
 T E S T S
-------------------------------------------------------
Running org.apache.aries.subsystem.core.archive.ImportPackageHeaderTest
Tests run: 2, Failures: 0, Errors: 0, Skipped: 0, Time elapsed: 0.034 sec

Results :

Tests run: 2, Failures: 0, Errors: 0, Skipped: 0

[JENKINS] Recording test results
[INFO] [bundle:bundle {execution: default-bundle}]
[WARNING] Warning building bundle org.apache.aries.subsystem:org.apache.aries.subsystem.core:bundle:1.0.0-SNAPSHOT
: Instructions in Private-Package, or -testpackages that are never used: org\.apache\.aries\.subsystem\.core
Classpath: Jar:.,Jar:org.apache.aries.subsystem.api,Jar:org.apache.aries.util,Jar:org.apache.aries.application.api,Jar:org.apache.aries.application.utils,Jar:org.osgi.core,Jar:org.osgi.enterprise,Jar:org.eclipse.equinox.coordinator,Jar:org.eclipse.equinox.region,Jar:slf4j-api

[INFO] [ianal:verify-legal-files {execution: default}]
[INFO] Checking legal files in: org.apache.aries.subsystem.core-1.0.0-SNAPSHOT.jar
[INFO] [install:install {execution: default-install}]
[INFO] Installing <https://builds.apache.org/job/Aries/ws/aries/subsystem/subsystem-core/target/org.apache.aries.subsystem.core-1.0.0-SNAPSHOT.jar>
to /home/hudson/hudson-slave/maven-repositories/1/org/apache/aries/subsystem/org.apache.aries.subsystem.core/1.0.0-SNAPSHOT/org.apache.aries.subsystem.core-1.0.0-SNAPSHOT.jar
[INFO] [bundle:install {execution: default-install}]
[INFO] Installing org/apache/aries/subsystem/org.apache.aries.subsystem.core/1.0.0-SNAPSHOT/org.apache.aries.subsystem.core-1.0.0-SNAPSHOT.jar
[INFO] Writing OBR metadata
[JENKINS] Archiving <https://builds.apache.org/job/Aries/ws/aries/subsystem/subsystem-core/pom.xml>
to /home/hudson/hudson/jobs/Aries/modules/org.apache.aries.subsystem$org.apache.aries.subsystem.core/builds/2012-09-05_08-54-31/archive/org.apache.aries.subsystem/org.apache.aries.subsystem.core/1.0.0-SNAPSHOT/org.apache.aries.subsystem.core-1.0.0-SNAPSHOT.pom
[JENKINS] Archiving <https://builds.apache.org/job/Aries/ws/aries/subsystem/subsystem-core/target/org.apache.aries.subsystem.core-1.0.0-SNAPSHOT.jar>
to /home/hudson/hudson/jobs/Aries/modules/org.apache.aries.subsystem$org.apache.aries.subsystem.core/builds/2012-09-05_08-54-31/archive/org.apache.aries.subsystem/org.apache.aries.subsystem.core/1.0.0-SNAPSHOT/org.apache.aries.subsystem.core-1.0.0-SNAPSHOT.jar
[INFO] ------------------------------------------------------------------------
[INFO] Building Apache Aries Subsystem iTests interfaces bundle
[INFO]    task-segment: [clean, install]
[INFO] ------------------------------------------------------------------------
[INFO] [clean:clean {execution: default-clean}]
[INFO] [enforcer:enforce {execution: default}]
[INFO] [remote-resources:process {execution: default}]
[INFO] [resources:resources {execution: default-resources}]
[INFO] Using 'UTF-8' encoding to copy filtered resources.
[INFO] skip non existing resourceDirectory <https://builds.apache.org/job/Aries/ws/aries/subsystem/subsystem-itests-api-bundle/src/main/resources>
[INFO] skip non existing resourceDirectory <https://builds.apache.org/job/Aries/ws/aries/subsystem/subsystem-itests-api-bundle/src/main/filtered-resources>
[INFO] Copying 0 resource
[INFO] Copying 3 resources
[INFO] [compiler:compile {execution: default-compile}]
[INFO] Compiling 1 source file to <https://builds.apache.org/job/Aries/ws/aries/subsystem/subsystem-itests-api-bundle/target/classes>
[INFO] [resources:testResources {execution: default-testResources}]
[INFO] Using 'UTF-8' encoding to copy filtered resources.
[INFO] skip non existing resourceDirectory <https://builds.apache.org/job/Aries/ws/aries/subsystem/subsystem-itests-api-bundle/src/test/resources>
[INFO] skip non existing resourceDirectory <https://builds.apache.org/job/Aries/ws/aries/subsystem/subsystem-itests-api-bundle/src/test/filtered-resources>
[INFO] Copying 3 resources
[INFO] [compiler:testCompile {execution: default-testCompile}]
[INFO] No sources to compile
[INFO] [surefire:test {execution: default-test}]
[INFO] Surefire report directory: <https://builds.apache.org/job/Aries/ws/aries/subsystem/subsystem-itests-api-bundle/target/surefire-reports>

-------------------------------------------------------
 T E S T S
-------------------------------------------------------
There are no tests to run.

Results :

Tests run: 0, Failures: 0, Errors: 0, Skipped: 0

[JENKINS] Recording test results[INFO] [bundle:bundle {execution: default-bundle}]
[WARNING] Warning building bundle org.apache.aries.subsystem:org.apache.aries.subsystem.itest.interfaces:bundle:1.0.0-SNAPSHOT
: Did not find matching referal for org.apache.aries.*

[INFO] [ianal:verify-legal-files {execution: default}]
[INFO] Checking legal files in: org.apache.aries.subsystem.itest.interfaces-1.0.0-SNAPSHOT.jar
[INFO] [install:install {execution: default-install}]
[INFO] Installing <https://builds.apache.org/job/Aries/ws/aries/subsystem/subsystem-itests-api-bundle/target/org.apache.aries.subsystem.itest.interfaces-1.0.0-SNAPSHOT.jar>
to /home/hudson/hudson-slave/maven-repositories/1/org/apache/aries/subsystem/org.apache.aries.subsystem.itest.interfaces/1.0.0-SNAPSHOT/org.apache.aries.subsystem.itest.interfaces-1.0.0-SNAPSHOT.jar
[INFO] [bundle:install {execution: default-install}]
[INFO] Installing org/apache/aries/subsystem/org.apache.aries.subsystem.itest.interfaces/1.0.0-SNAPSHOT/org.apache.aries.subsystem.itest.interfaces-1.0.0-SNAPSHOT.jar
[INFO] Writing OBR metadata
[JENKINS] Archiving <https://builds.apache.org/job/Aries/ws/aries/subsystem/subsystem-itests-api-bundle/pom.xml>
to /home/hudson/hudson/jobs/Aries/modules/org.apache.aries.subsystem$org.apache.aries.subsystem.itest.interfaces/builds/2012-09-05_08-54-31/archive/org.apache.aries.subsystem/org.apache.aries.subsystem.itest.interfaces/1.0.0-SNAPSHOT/org.apache.aries.subsystem.itest.interfaces-1.0.0-SNAPSHOT.pom
[JENKINS] Archiving <https://builds.apache.org/job/Aries/ws/aries/subsystem/subsystem-itests-api-bundle/target/org.apache.aries.subsystem.itest.interfaces-1.0.0-SNAPSHOT.jar>
to /home/hudson/hudson/jobs/Aries/modules/org.apache.aries.subsystem$org.apache.aries.subsystem.itest.interfaces/builds/2012-09-05_08-54-31/archive/org.apache.aries.subsystem/org.apache.aries.subsystem.itest.interfaces/1.0.0-SNAPSHOT/org.apache.aries.subsystem.itest.interfaces-1.0.0-SNAPSHOT.jar
[INFO] ------------------------------------------------------------------------
[INFO] Building Apache Aries Subsystem iTests
[INFO]    task-segment: [clean, install]
[INFO] ------------------------------------------------------------------------
[INFO] [clean:clean {execution: default-clean}]
[INFO] snapshot org.apache.felix:org.apache.felix.resolver:0.1.0-SNAPSHOT: checking for updates
from codehaus.snapshots
[INFO] snapshot org.apache.felix:org.apache.felix.resolver:0.1.0-SNAPSHOT: checking for updates
from EclipseLink Repo
[INFO] snapshot org.apache.felix:org.apache.felix.resolver:0.1.0-SNAPSHOT: checking for updates
from apache.snapshots
[INFO] snapshot org.apache.aries.subsystem:org.apache.aries.subsystem.core:1.0.0-SNAPSHOT:
checking for updates from codehaus.snapshots
[INFO] snapshot org.apache.aries.proxy:org.apache.aries.proxy:1.0.1-SNAPSHOT: checking for
updates from codehaus.snapshots
[INFO] snapshot org.apache.aries.subsystem:org.apache.aries.subsystem.core:1.0.0-SNAPSHOT:
checking for updates from EclipseLink Repo
[INFO] snapshot org.apache.aries.proxy:org.apache.aries.proxy:1.0.1-SNAPSHOT: checking for
updates from EclipseLink Repo
[INFO] snapshot org.apache.aries.subsystem:org.apache.aries.subsystem.core:1.0.0-SNAPSHOT:
checking for updates from apache.snapshots
[INFO] snapshot org.apache.aries.proxy:org.apache.aries.proxy:1.0.1-SNAPSHOT: checking for
updates from apache.snapshots
[INFO] snapshot org.apache.aries.subsystem:org.apache.aries.subsystem.itest.interfaces:1.0.0-SNAPSHOT:
checking for updates from codehaus.snapshots
[INFO] snapshot org.apache.aries.subsystem:org.apache.aries.subsystem.itest.interfaces:1.0.0-SNAPSHOT:
checking for updates from EclipseLink Repo
[INFO] snapshot org.apache.aries.subsystem:org.apache.aries.subsystem.itest.interfaces:1.0.0-SNAPSHOT:
checking for updates from apache.snapshots
[INFO] [enforcer:enforce {execution: default}]
[INFO] [build-helper:add-test-source {execution: add-source-tb1}]
[INFO] Test Source directory: <https://builds.apache.org/job/Aries/ws/aries/subsystem/subsystem-itests/src/test/bundles/tb1>
added.
[INFO] [build-helper:add-test-source {execution: add-source-tb2}]
[INFO] Test Source directory: <https://builds.apache.org/job/Aries/ws/aries/subsystem/subsystem-itests/src/test/bundles/tb2>
added.
[INFO] [build-helper:add-test-source {execution: add-source-tb3}]
[INFO] Test Source directory: <https://builds.apache.org/job/Aries/ws/aries/subsystem/subsystem-itests/src/test/bundles/tb3>
added.
[INFO] [build-helper:add-test-source {execution: add-source-helloImpl}]
[INFO] Test Source directory: <https://builds.apache.org/job/Aries/ws/aries/subsystem/subsystem-itests/src/test/bundles/helloImpl>
added.
[INFO] [build-helper:add-test-source {execution: add-source-dynamicImport}]
[INFO] Test Source directory: <https://builds.apache.org/job/Aries/ws/aries/subsystem/subsystem-itests/src/test/bundles/dynamicImport>
added.
[INFO] [build-helper:add-test-source {execution: add-source-blueprint}]
[INFO] Test Source directory: <https://builds.apache.org/job/Aries/ws/aries/subsystem/subsystem-itests/src/test/bundles/blueprint>
added.
[INFO] [remote-resources:process {execution: default}]
[INFO] [paxexam:generate-depends-file {execution: generate-config}]
[INFO] Created: <https://builds.apache.org/job/Aries/ws/aries/subsystem/subsystem-itests/target/test-classes/META-INF/maven/dependencies.properties>
[INFO] [resources:resources {execution: default-resources}]
[INFO] Using 'UTF-8' encoding to copy filtered resources.
[INFO] skip non existing resourceDirectory <https://builds.apache.org/job/Aries/ws/aries/subsystem/subsystem-itests/src/main/resources>
[INFO] skip non existing resourceDirectory <https://builds.apache.org/job/Aries/ws/aries/subsystem/subsystem-itests/src/main/filtered-resources>
[INFO] skip non existing resourceDirectory <https://builds.apache.org/job/Aries/ws/aries/subsystem/subsystem-itests/src/main/java>
[INFO] Copying 3 resources
[INFO] [compiler:compile {execution: default-compile}]
[INFO] No sources to compile
[INFO] [resources:testResources {execution: default-testResources}]
[INFO] Using 'UTF-8' encoding to copy filtered resources.
[INFO] Copying 17 resources
[INFO] skip non existing resourceDirectory <https://builds.apache.org/job/Aries/ws/aries/subsystem/subsystem-itests/src/test/filtered-resources>
[INFO] Copying 3 resources
[INFO] [compiler:testCompile {execution: default-testCompile}]
[INFO] Compiling 51 source files to <https://builds.apache.org/job/Aries/ws/aries/subsystem/subsystem-itests/target/test-classes>
[INFO] [jar:jar {execution: tb1-application1}]
[INFO] Building jar: <https://builds.apache.org/job/Aries/ws/aries/subsystem/subsystem-itests/target/test-classes/application1/tb1.jar>
[INFO] [jar:jar {execution: tb1-feature1}]
[INFO] Building jar: <https://builds.apache.org/job/Aries/ws/aries/subsystem/subsystem-itests/target/test-classes/feature1/tb1.jar>
[INFO] [jar:jar {execution: tb2-feature2}]
[INFO] Building jar: <https://builds.apache.org/job/Aries/ws/aries/subsystem/subsystem-itests/target/test-classes/feature2/tb2.jar>
[INFO] [jar:jar {execution: tb3-feature1}]
[INFO] Building jar: <https://builds.apache.org/job/Aries/ws/aries/subsystem/subsystem-itests/target/test-classes/feature1/tb3.jar>
[INFO] [jar:jar {execution: tb3-feature2}]
[INFO] Building jar: <https://builds.apache.org/job/Aries/ws/aries/subsystem/subsystem-itests/target/test-classes/feature2/tb3.jar>
[INFO] [jar:jar {execution: tb3-feature3}]
[INFO] Building jar: <https://builds.apache.org/job/Aries/ws/aries/subsystem/subsystem-itests/target/test-classes/feature3/tb3.jar>
[INFO] [jar:jar {execution: hello-impl}]
[INFO] Building jar: <https://builds.apache.org/job/Aries/ws/aries/subsystem/subsystem-itests/target/test-classes/hello/helloImpl.jar>
[INFO] [jar:jar {execution: dynamic-import-impl}]
[INFO] Building jar: <https://builds.apache.org/job/Aries/ws/aries/subsystem/subsystem-itests/target/test-classes/dynamicImport/dynamicImport.jar>
[INFO] [jar:jar {execution: basic-blueprint-application}]
[INFO] Building jar: <https://builds.apache.org/job/Aries/ws/aries/subsystem/subsystem-itests/target/test-classes/blueprint/blueprint.jar>
[INFO] [surefire:test {execution: default-test}]
[INFO] Surefire report directory: <https://builds.apache.org/job/Aries/ws/aries/subsystem/subsystem-itests/target/surefire-reports>

-------------------------------------------------------
 T E S T S
-------------------------------------------------------
Running org.apache.aries.subsystem.itests.CompositeTest
Tests run: 4, Failures: 0, Errors: 0, Skipped: 0, Time elapsed: 879.024 sec
Running org.apache.aries.subsystem.ctt.itests.SubsystemDependency_4BTest
Tests run: 4, Failures: 0, Errors: 2, Skipped: 0, Time elapsed: 71.174 sec <<< FAILURE!
Running org.apache.aries.subsystem.ctt.itests.SubsystemDependency_4E2Test
Tests run: 9, Failures: 0, Errors: 3, Skipped: 0, Time elapsed: 157.371 sec <<< FAILURE!
Running org.apache.aries.subsystem.itests.OptionalDependenciesTest
Tests run: 1, Failures: 0, Errors: 0, Skipped: 0, Time elapsed: 20.65 sec
Running org.apache.aries.subsystem.itests.RootSubsystemTest
Tests run: 6, Failures: 0, Errors: 0, Skipped: 0, Time elapsed: 102.15 sec
Running org.apache.aries.subsystem.ctt.itests.SubsystemDependency_4ATest
Tests run: 4, Failures: 0, Errors: 1, Skipped: 0, Time elapsed: 67.219 sec <<< FAILURE!
Running org.apache.aries.subsystem.itests.DependencyLifeCycleTest
Tests run: 4, Failures: 0, Errors: 1, Skipped: 0, Time elapsed: 71.879 sec <<< FAILURE!
Running org.apache.aries.subsystem.itests.HelloWorldTest
Tests run: 1, Failures: 0, Errors: 1, Skipped: 0, Time elapsed: 17.494 sec <<< FAILURE!
Running org.apache.aries.subsystem.itests.InstallTest
Tests run: 1, Failures: 0, Errors: 0, Skipped: 0, Time elapsed: 17.935 sec
Running org.apache.aries.subsystem.itests.NoRequirementFilterTest
Tests run: 1, Failures: 0, Errors: 0, Skipped: 0, Time elapsed: 17.759 sec
Running org.apache.aries.subsystem.ctt.itests.SubsystemDependency_4DTest
Tests run: 4, Failures: 0, Errors: 0, Skipped: 0, Time elapsed: 70.365 sec
Running org.apache.aries.subsystem.ctt.itests.SubsystemDependency_4CTest
Tests run: 4, Failures: 0, Errors: 1, Skipped: 0, Time elapsed: 70.031 sec <<< FAILURE!
Running org.apache.aries.subsystem.itests.ApplicationTest
Tests run: 3, Failures: 0, Errors: 1, Skipped: 0, Time elapsed: 51.255 sec <<< FAILURE!
Running org.apache.aries.subsystem.itests.AutostartTest
Tests run: 7, Failures: 0, Errors: 2, Skipped: 0, Time elapsed: 125.328 sec <<< FAILURE!
Running org.apache.aries.subsystem.itests.FeatureTest
Tests run: 3, Failures: 0, Errors: 0, Skipped: 0, Time elapsed: 52.788 sec
Running org.apache.aries.subsystem.itests.BasicTest
Tests run: 3, Failures: 0, Errors: 0, Skipped: 0, Time elapsed: 51.473 sec
Running org.apache.aries.subsystem.ctt.itests.SubsystemDependency_4E1Test
Tests run: 10, Failures: 0, Errors: 3, Skipped: 0, Time elapsed: 169.722 sec <<<
FAILURE!
Running org.apache.aries.subsystem.itests.ProvisionPolicyTest
Tests run: 4, Failures: 0, Errors: 0, Skipped: 0, Time elapsed: 70.244 sec
Running org.apache.aries.subsystem.itests.DynamicImportTest
Tests run: 2, Failures: 0, Errors: 1, Skipped: 0, Time elapsed: 33.973 sec <<< FAILURE!
Running org.apache.aries.subsystem.itests.BlueprintTest
Tests run: 1, Failures: 0, Errors: 0, Skipped: 0, Time elapsed: 20.152 sec

Results :

Tests in error: 

Tests run: 76, Failures: 0, Errors: 16, Skipped: 0

[ERROR] There are test failures.

Please refer to <https://builds.apache.org/job/Aries/ws/aries/subsystem/subsystem-itests/target/surefire-reports>
for the individual test results.
[JENKINS] Recording test results
[JENKINS] Archiving <https://builds.apache.org/job/Aries/ws/aries/subsystem/subsystem-itests/pom.xml>
to /home/hudson/hudson/jobs/Aries/modules/org.apache.aries.subsystem$org.apache.aries.subsystem.itests/builds/2012-09-05_08-54-31/archive/org.apache.aries.subsystem/org.apache.aries.subsystem.itests/1.0.0-SNAPSHOT/org.apache.aries.subsystem.itests-1.0.0-SNAPSHOT.pom
[JENKINS] Archiving <https://builds.apache.org/job/Aries/ws/aries/subsystem/subsystem-itests/target/test-classes/blueprint/blueprint.jar>
to /home/hudson/hudson/jobs/Aries/modules/org.apache.aries.subsystem$org.apache.aries.subsystem.itests/builds/2012-09-05_08-54-31/archive/org.apache.aries.subsystem/org.apache.aries.subsystem.itests/1.0.0-SNAPSHOT/org.apache.aries.subsystem.itests-1.0.0-SNAPSHOT.jar
[INFO] ------------------------------------------------------------------------
[ERROR] FATAL ERROR
[INFO] ------------------------------------------------------------------------
[INFO] Java heap space
[INFO] ------------------------------------------------------------------------
[INFO] Trace
java.lang.OutOfMemoryError: Java heap space
	at java.util.Arrays.copyOf(Arrays.java:2882)
	at java.lang.AbstractStringBuilder.expandCapacity(AbstractStringBuilder.java:100)
	at java.lang.AbstractStringBuilder.append(AbstractStringBuilder.java:515)
	at java.lang.StringBuffer.append(StringBuffer.java:306)
	at java.io.StringWriter.write(StringWriter.java:77)
	at org.apache.commons.io.IOUtils.copyLarge(IOUtils.java:1129)
	at org.apache.commons.io.IOUtils.copy(IOUtils.java:1104)
	at org.apache.commons.io.IOUtils.copy(IOUtils.java:1050)
	at org.apache.commons.io.IOUtils.copy(IOUtils.java:1075)
	at org.apache.commons.io.IOUtils.toString(IOUtils.java:382)
	at org.apache.commons.io.FileUtils.readFileToString(FileUtils.java:1103)
	at org.apache.commons.io.FileUtils.readFileToString(FileUtils.java:1120)
	at hudson.tasks.junit.SuiteResult.<init>(SuiteResult.java:195)
	at hudson.tasks.junit.SuiteResult.parseSuite(SuiteResult.java:130)
	at hudson.tasks.junit.SuiteResult.parse(SuiteResult.java:115)
	at hudson.tasks.junit.TestResult.parse(TestResult.java:227)
	at hudson.tasks.junit.TestResult.parse(TestResult.java:163)
	at hudson.maven.reporters.SurefireArchiver.postExecute(SurefireArchiver.java:141)
	at hudson.maven.Maven2Builder.postExecute(Maven2Builder.java:155)
	at hudson.maven.MavenBuilder$Adapter.postExecute(MavenBuilder.java:310)
	at hudson.maven.agent.PluginManagerInterceptor$1MojoIntercepterImpl.callPost(PluginManagerInterceptor.java:170)
	at hudson.maven.agent.PluginManagerInterceptor.executeMojo(PluginManagerInterceptor.java:183)
	at org.apache.maven.lifecycle.DefaultLifecycleExecutor.executeGoals(DefaultLifecycleExecutor.java:694)
	at org.apache.maven.lifecycle.DefaultLifecycleExecutor.executeGoalWithLifecycle(DefaultLifecycleExecutor.java:556)
	at org.apache.maven.lifecycle.DefaultLifecycleExecutor.executeGoal(DefaultLifecycleExecutor.java:535)
	at org.apache.maven.lifecycle.DefaultLifecycleExecutor.executeGoalAndHandleFailures(DefaultLifecycleExecutor.java:387)
	at org.apache.maven.lifecycle.DefaultLifecycleExecutor.executeTaskSegments(DefaultLifecycleExecutor.java:348)
	at org.apache.maven.lifecycle.DefaultLifecycleExecutor.execute(DefaultLifecycleExecutor.java:180)
	at org.apache.maven.lifecycle.LifecycleExecutorInterceptor.execute(LifecycleExecutorInterceptor.java:65)
	at org.apache.maven.DefaultMaven.doExecute(DefaultMaven.java:328)
	at org.apache.maven.DefaultMaven.execute(DefaultMaven.java:138)
	at org.apache.maven.cli.MavenCli.main(MavenCli.java:362)
[INFO] ------------------------------------------------------------------------
[INFO] Total time: 64 minutes 15 seconds
[INFO] Finished at: Wed Sep 05 09:59:15 UTC 2012
[INFO] Final Memory: 179M/895M
[INFO] ------------------------------------------------------------------------
channel stopped

Mime
View raw message