aries-dev mailing list archives

Site index · List index
Message view « Date » · « Thread »
Top « Date » · « Thread »
From Daniel Kulp <dk...@apache.org>
Subject Re: Build failed in Jenkins: AriesWithSnapshotDependencies #329
Date Fri, 04 Jan 2013 17:04:19 GMT

On Jan 3, 2013, at 1:29 PM, Holly Cummins <holly.k.cummins@googlemail.com> wrote:

> I've tried a few things to fix the issue without luck so far, including changing all
the parts of the build which don't require maven 2 to maven 3. I'll have another look tomorrow
and see if I can figure out a solution.

My gut feeling is that the best course of action is to get the 0.1 version of the plugin released
ASAP so we can get the snapshot of it out of the build.  

Besides, we need to get that done so we can get the blueprint and other things released anyway.


Dan



> On 3 Jan 2013, at 12:47, John W Ross <jwross@us.ibm.com> wrote:
> 
>> 
>> Note that the AriesWithSnapshotDependencies build continues to fail due to
>> some issue related to the semantic versioning plugin and is not related to
>> the referenced changes. I'm pretty sure I saw an email a while back about
>> this and that it is a known issue.
>> 
>> John
>> 
>> [aries-current-snapshots]
>> $ /home/hudson/tools/maven/apache-maven-3.0.3/bin/mvn
>> -Dmaven.repo.local=/home/jenkins/jenkins-slave/workspace/AriesWithSnapshotDependencies/.repository
>> versions:use-latest-versions -Dincludes=org.apache.aries*:*:*:*
>> -DexcludeReactor=false -DallowSnapshots=true -DallowMajorUpdates=true
>> -DallowMinorUpdates=true
>> [INFO] Scanning for projects...
>> [ERROR] The projects in the reactor contain a cyclic reference: Edge
>> between 'Vertex
>> {label='org.apache.aries.versioning:org.apache.aries.versioning.plugin:0.1.0-SNAPSHOT'}'
>> and 'Vertex
>> {label='org.apache.aries.versioning:org.apache.aries.versioning.checker:0.1.0-SNAPSHOT'}'
>> introduces to cycle in the graph
>> org.apache.aries.versioning:org.apache.aries.versioning.checker:0.1.0-SNAPSHOT
>> --> org.apache.aries:org.apache.aries.util:1.1.0-SNAPSHOT -->
>> org.apache.aries.versioning:org.apache.aries.versioning.plugin:0.1.0-SNAPSHOT
>> -->
>> org.apache.aries.versioning:org.apache.aries.versioning.checker:0.1.0-SNAPSHOT
>> -> [Help 1]
>> [ERROR]
>> [ERROR] To see the full stack trace of the errors, re-run Maven with the -e
>> switch.
>> [ERROR] Re-run Maven using the -X switch to enable full debug logging.
>> [ERROR]
>> [ERROR] For more information about the errors and possible solutions,
>> please read the following articles:
>> [ERROR] [Help 1]
>> http://cwiki.apache.org/confluence/display/MAVEN/ProjectCycleException
>> Build step 'Invoke top-level Maven targets' marked build as failure
>> 
>>> 
>>> Build failed in Jenkins: AriesWithSnapshotDependencies #329
>> 
>>> 
>>> See
>> <https://builds.apache.org/job/AriesWithSnapshotDependencies/329/changes>
>>> 
>>> Changes:
>>> 
>>> [jwross] [ARIES-992] Get an IllegalStateException in
>>> BundleEventHook.handleExplicitlyInstalledBundleBundleContext
>>> 
>>> This happens when explicitly installing or uninstalling bundles
>>> while the subsystems bundle is deactivating.
>>> The bundle event hook must be blocked while the root subsystem is
>>> being stopped. The blocked events then proceed
>>> once deactivation is complete which results in the exception since
>>> the activator instance is no longer valid.
>>> Events are now queued while subsystems is shutting down, as they are
>>> during initialization. Once the shutdown is
>>> complete and the event hook has been unregistered, any remaining
>>> events are processed prior to returning from the
>>> BundleActivator.stop() method.
>>> 
>>> ------------------------------------------
>>> [...truncated 33881 lines...]
>>> [INFO]
>>> [INFO] --- versions-maven-plugin:1.1:use-latest-versions (default-
>>> cli) @ org.apache.aries.samples.blueprint.idverifier.client ---
>>> [INFO]
>> 
>>> [INFO]
>>> ------------------------------------------------------------------------
>>> [INFO] Building Apache Aries Blueprint Sample - ID Verifier Assembly
>>> 1.0.1-SNAPSHOT
>>> [INFO]
>>> ------------------------------------------------------------------------
>>> [INFO]
>>> [INFO] --- versions-maven-plugin:1.1:use-latest-versions (default-
>>> cli) @ org.apache.aries.samples.blueprint.idverifier.assembly ---
>>> [INFO]
>> 
>>> [INFO]
>>> ------------------------------------------------------------------------
>>> [INFO] Building Apache Aries Twitter sample 1.0.1-SNAPSHOT
>>> [INFO]
>>> ------------------------------------------------------------------------
>>> [INFO]
>>> [INFO] --- versions-maven-plugin:1.1:use-latest-versions (default-
>>> cli) @ twitter ---
>>> [INFO]
>> 
>>> [INFO]
>>> ------------------------------------------------------------------------
>>> [INFO] Building Apache Aries Bundlise Twitter4j 1.0.1-SNAPSHOT
>>> [INFO]
>>> ------------------------------------------------------------------------
>>> [INFO]
>>> [INFO] --- versions-maven-plugin:1.1:use-latest-versions (default-
>>> cli) @ org.apache.aries.samples.twitter.twitter4j ---
>>> [INFO]
>> 
>>> [INFO]
>>> ------------------------------------------------------------------------
>>> [INFO] Building Apache Aries Twitter bundle 1.0.1-SNAPSHOT
>>> [INFO]
>>> ------------------------------------------------------------------------
>>> [INFO]
>>> [INFO] --- versions-maven-plugin:1.1:use-latest-versions (default-
>>> cli) @ org.apache.aries.samples.twitter.bundle ---
>>> [INFO]
>> 
>>> [INFO]
>>> ------------------------------------------------------------------------
>>> [INFO] Building Apache Aries Twitter EBA 1.0.1-SNAPSHOT
>>> [INFO]
>>> ------------------------------------------------------------------------
>>> [INFO]
>>> [INFO] --- versions-maven-plugin:1.1:use-latest-versions (default-
>>> cli) @ org.apache.aries.samples.twitter.eba ---
>>> [INFO]
>> 
>>> [INFO]
>>> ------------------------------------------------------------------------
>>> [INFO] Building Apache Aries Twitter sample integration tests
>> 1.0.1-SNAPSHOT
>>> [INFO]
>>> ------------------------------------------------------------------------
>>> [INFO]
>>> [INFO] --- versions-maven-plugin:1.1:use-latest-versions (default-
>>> cli) @ org.apache.aries.samples.twitter.itests ---
>>> [INFO] Updated
>>> org.apache.aries.proxy:org.apache.aries.proxy:jar:null:1.0.0 to
>>> version 1.0.1-SNAPSHOT
>>> [INFO]
>> 
>>> [INFO]
>>> ------------------------------------------------------------------------
>>> [INFO] Building Apache Aries 1.0.0-SNAPSHOT
>>> [INFO]
>>> ------------------------------------------------------------------------
>>> [INFO]
>>> [INFO] --- versions-maven-plugin:2.0:use-latest-versions (default-
>>> cli) @ aries ---
>>> [INFO] Major version changes allowed
>>> [INFO]
>>> ------------------------------------------------------------------------
>>> [INFO] Reactor Summary:
>>> [INFO]
>>> [INFO] Aries :: Top Parent POM ........................... SUCCESS
>> [0.629s]
>>> [INFO] Aries :: Default Parent POM ....................... SUCCESS
>> [0.349s]
>>> [INFO] Aries :: Java 5 Parent POM ........................ SUCCESS
>> [0.054s]
>>> [INFO] Aries :: Java 6 Parent POM ........................ SUCCESS
>> [0.008s]
>>> [INFO] Aries Maven EBA Plugin ............................ SUCCESS
>> [0.015s]
>>> [INFO] Apache Aries Unit Test Support .................... SUCCESS
>> [0.010s]
>>> [INFO] Apache Aries Test Support ......................... SUCCESS
>> [0.008s]
>>> [INFO] Apache Aries Util classes compiled under r 42 framework
>>> SUCCESS [0.045s]
>>> [INFO] org.apache.aries.versioning.checker ............... SUCCESS
>> [0.021s]
>>> [INFO] Apache Aries Semantic Versioning Checker .......... SUCCESS
>> [0.008s]
>>> [INFO] org.apache.aries.versioning.plugin Maven Mojo ..... SUCCESS
>> [0.015s]
>>> [INFO] Apache Aries Util ................................. SUCCESS
>> [0.065s]
>>> [INFO] Apache Aries Util ................................. SUCCESS
>> [0.007s]
>>> [INFO] Apache Aries Proxy API ............................ SUCCESS
>> [0.011s]
>>> [INFO] Apache Aries Proxy Service ........................ SUCCESS
>> [0.022s]
>>> [INFO] Apache Aries Proxy Bundle ......................... SUCCESS
>> [0.014s]
>>> [INFO] Apache Aries Proxy iTests ......................... SUCCESS
>> [0.049s]
>>> [INFO] Apache Aries Class Proxy .......................... SUCCESS
>> [0.007s]
>>> [INFO] Apache Aries Quiesce API .......................... SUCCESS
>> [0.006s]
>>> [INFO] Apache Aries Quiesce Manager ...................... SUCCESS
>> [0.014s]
>>> [INFO] Aries Quiesce Manager iTests ...................... SUCCESS
>> [0.033s]
>>> [INFO] Apache Aries Quiesce .............................. SUCCESS
>> [0.007s]
>>> [INFO] Apache Aries Blueprint API ........................ SUCCESS
>> [0.007s]
>>> [INFO] Apache Aries Blueprint Parser ..................... SUCCESS
>> [0.009s]
>>> [INFO] Apache Aries Blueprint Core ....................... SUCCESS
>> [0.052s]
>>> [INFO] Apache Aries Blueprint CM ......................... SUCCESS
>> [0.023s]
>>> [INFO] Apache Aries Blueprint Bundle ..................... SUCCESS
>> [0.044s]
>>> [INFO] Apache Aries Blueprint Compatiblity Fragment Bundle  SUCCESS
>> [0.010s]
>>> [INFO] Apache Aries Blueprint Core Compatiblity Fragment Bundle
>>> SUCCESS [0.009s]
>>> [INFO] Apache Aries Blueprint JEXL evaluator ............. SUCCESS
>> [0.008s]
>>> [INFO] Apache Aries Blueprint Sample ..................... SUCCESS
>> [0.008s]
>>> [INFO] Apache Aries Blueprint Annotation API ............. SUCCESS
>> [0.006s]
>>> [INFO] Apache Aries Blueprint Annotation Impl ............ SUCCESS
>> [0.011s]
>>> [INFO] Apache Aries Blueprint Sample for Testing Annotation  SUCCESS
>> [0.010s]
>>> [INFO] Apache Aries Blueprint Sample Fragment for Testing Annotation
>>> SUCCESS [0.010s]
>>> [INFO] Apache Aries Blueprint Test Bundle A .............. SUCCESS
>> [0.010s]
>>> [INFO] Apache Aries Blueprint Test Bundle B .............. SUCCESS
>> [0.012s]
>>> [INFO] Apache Aries Blueprint Test Quiesce Bundle ........ SUCCESS
>> [0.010s]
>>> [INFO] Apache Aries Blueprint iTests ..................... SUCCESS
>> [0.050s]
>>> [INFO] Apache Aries Blueprint Annotation iTests .......... SUCCESS
>> [0.026s]
>>> [INFO] Apache Aries Blueprint ............................ SUCCESS
>> [0.007s]
>>> [INFO] Apache Aries JNDI API ............................. SUCCESS
>> [0.005s]
>>> [INFO] Apache Aries JNDI Core ............................ SUCCESS
>> [0.012s]
>>> [INFO] Apache Aries JNDI URL Handler ..................... SUCCESS
>> [0.015s]
>>> [INFO] Apache Aries JNDI RMI Handler ..................... SUCCESS
>> [0.009s]
>>> [INFO] Apache Aries JNDI Bundle .......................... SUCCESS
>> [0.015s]
>>> [INFO] Apache Aries JNDI Support for Legacy Runtimes ..... SUCCESS
>> [0.006s]
>>> [INFO] Apache Aries JNDI "business logic" test bundle for Aries
>>> jndi-url iTests  SUCCESS [0.005s]
>>> [INFO] Apache Aries JNDI Test Bundle for Aries jndi-url iTests
>>> SUCCESS [0.006s]
>>> [INFO] Apache Aries JNDI iTests for jndi-url ............. SUCCESS
>> [0.026s]
>>> [INFO] Apache Aries JNDI ................................. SUCCESS
>> [0.006s]
>>> [INFO] Apache Aries Transaction Manager .................. SUCCESS
>> [0.012s]
>>> [INFO] Apache Aries Transaction Blueprint ................ SUCCESS
>> [0.010s]
>>> [INFO] Apache Aries Transaction Enlisting JDBC Datasource  SUCCESS
>> [0.019s]
>>> [INFO] Apache Aries JMS Pool ............................. SUCCESS
>> [0.031s]
>>> [INFO] Apache Aries Transaction Integration Tests ........ SUCCESS
>> [0.023s]
>>> [INFO] Apache Aries Transaction Test Bundle .............. SUCCESS
>> [0.006s]
>>> [INFO] Apache Aries Transaction Test Datasource Configuration
>>> SUCCESS [0.005s]
>>> [INFO] Apache Aries Transaction - reactor pom ............ SUCCESS
>> [0.006s]
>>> [INFO] Apache Aries Web Url handler ...................... SUCCESS
>> [0.007s]
>>> [INFO] Apache Aries Web integration tests ................ SUCCESS
>> [0.016s]
>>> [INFO] Apache Aries Web Component ........................ SUCCESS
>> [0.005s]
>>> [INFO] Apache Aries Application API ...................... SUCCESS
>> [0.007s]
>>> [INFO] Apache Aries Application Utils .................... SUCCESS
>> [0.011s]
>>> [INFO] Apache Aries Application Bundle ................... SUCCESS
>> [0.014s]
>>> [INFO] Apache Aries Application Converters ............... SUCCESS
>> [0.011s]
>>> [INFO] Apache Aries Application Default local platform ... SUCCESS
>> [0.007s]
>>> [INFO] Apache Aries Application Deployment Management .... SUCCESS
>> [0.013s]
>>> [INFO] Apache Aries Application Installer ................ SUCCESS
>> [0.011s]
>>> [INFO] Apache Aries Application itests sample application interface
>>> SUCCESS [0.006s]
>>> [INFO] Apache Aries Application integration tests ........ SUCCESS
>> [0.047s]
>>> [INFO] Apache Aries Application Management ............... SUCCESS
>> [0.010s]
>>> [INFO] Apache Aries Application Modelling ................ SUCCESS
>> [0.016s]
>>> [INFO] Apache Aries Application Modelling Standalone ..... SUCCESS
>> [0.016s]
>>> [INFO] Apache Aries Application Modelling tests .......... SUCCESS
>> [0.010s]
>>> [INFO] Apache Aries Application No-op Resolver ........... SUCCESS
>> [0.007s]
>>> [INFO] Apache Aries Application OBR Resolver ............. SUCCESS
>> [0.010s]
>>> [INFO] Apache Aries Application Resolve CM Transform ..... SUCCESS
>> [0.009s]
>>> [INFO] Apache Aries Application Resolve CM Transform iTests  SUCCESS
>> [0.019s]
>>> [INFO] Apache Aries Application Runtime .................. SUCCESS
>> [0.009s]
>>> [INFO] Apache Aries Isolated Application Runtime ......... SUCCESS
>> [0.010s]
>>> [INFO] Apache Aries Bundle Framework provider ............ SUCCESS
>> [0.010s]
>>> [INFO] Apache Aries Bundle Framework Manager provider .... SUCCESS
>> [0.011s]
>>> [INFO] Apache Aries repository generator tool ............ SUCCESS
>> [0.038s]
>>> [INFO] Apache Aries Bundle Repository provider ........... SUCCESS
>> [0.010s]
>>> [INFO] Application distribution .......................... SUCCESS
>> [0.017s]
>>> [INFO] Application distribution for isolated application support
>>> SUCCESS [0.022s]
>>> [INFO] Apache Aries Application .......................... SUCCESS
>> [0.005s]
>>> [INFO] Apache Aries Subsystem API ........................ SUCCESS
>> [0.007s]
>>> [INFO] Apache Aries Subsystem Core ....................... SUCCESS
>> [0.012s]
>>> [INFO] Apache Aries Subsystem OBR ........................ SUCCESS
>> [0.008s]
>>> [INFO] Apache Aries Subsystem iTests interfaces bundle ... SUCCESS
>> [0.005s]
>>> [INFO] Apache Aries Subsystem iTests ..................... SUCCESS
>> [0.060s]
>>> [INFO] Apache Aries Subsystems Bundle .................... SUCCESS
>> [0.019s]
>>> [INFO] Apache Aries Subsystem ............................ SUCCESS
>> [0.005s]
>>> [INFO] Aries EJB Modelling Integration ................... SUCCESS
>> [0.012s]
>>> [INFO] Aries EJB Modelling iTests ........................ SUCCESS
>> [0.035s]
>>> [INFO] Aries OpenEJB Runtime Extender .................... SUCCESS
>> [0.012s]
>>> [INFO] Aries EJB Extender iTests ......................... SUCCESS
>> [0.031s]
>>> [INFO] Aries EJB Component ............................... SUCCESS
>> [0.005s]
>>> [INFO] Apache Aries JMX API .............................. SUCCESS
>> [0.005s]
>>> [INFO] Apache Aries JMX Blueprint API .................... SUCCESS
>> [0.006s]
>>> [INFO] Apache Aries JMX Core ............................. SUCCESS
>> [0.009s]
>>> [INFO] Apache Aries JMX Core via Whiteboards ............. SUCCESS
>> [0.009s]
>>> [INFO] Apache Aries Whiteboard support for JMX DynamicMBean services
>>> SUCCESS [0.007s]
>>> [INFO] Apache Aries JMX Blueprint Core ................... SUCCESS
>> [0.008s]
>>> [INFO] Apache Aries JMX Bundle ........................... SUCCESS
>> [0.009s]
>>> [INFO] Apache Aries JMX Blueprint Bundle ................. SUCCESS
>> [0.007s]
>>> [INFO] Apache Aries JMX integration tests ................ SUCCESS
>> [0.020s]
>>> [INFO] Apache Aries JMX .................................. SUCCESS
>> [0.005s]
>>> [INFO] Aries JPA Container API ........................... SUCCESS
>> [0.005s]
>>> [INFO] Aries JPA Container ............................... SUCCESS
>> [0.010s]
>>> [INFO] Aries JPA Container Managed Contexts .............. SUCCESS
>> [0.012s]
>>> [INFO] Aries JPA Container blueprint integration for Aries blueprint
>>> SUCCESS [0.009s]
>>> [INFO] Test Bundle for Aries JPA Container iTests ........ SUCCESS
>> [0.005s]
>>> [INFO] Test Bundle for Aries JPA Container advanced iTests  SUCCESS
>> [0.005s]
>>> [INFO] Aries JPA iTests .................................. SUCCESS
>> [0.065s]
>>> [INFO] Test Bundle for Aries JPA Blueprint iTests ........ SUCCESS
>> [0.005s]
>>> [INFO] Aries JPA Component ............................... SUCCESS
>> [0.005s]
>>> [INFO] Apache Aries SPI Fly Core (internal module) ....... SUCCESS
>> [0.006s]
>>> [INFO] Apache Aries SPI Fly Weaver (internal module) ..... SUCCESS
>> [0.006s]
>>> [INFO] Apache Aries SPI Fly Dynamic Weaving Bundle ....... SUCCESS
>> [0.006s]
>>> [INFO] Apache Aries SPI Fly Static Weaving Tool .......... SUCCESS
>> [0.007s]
>>> [INFO] Apache Aries SPI Fly Static Weaving Bundle ........ SUCCESS
>> [0.006s]
>>> [INFO] Apache Aries SPI Fly Examples ..................... SUCCESS
>> [0.004s]
>>> [INFO] Apache Aries Example SPI Interface ................ SUCCESS
>> [0.005s]
>>> [INFO] Apache Aries Example SPI Provider Jar 1 ........... SUCCESS
>> [0.005s]
>>> [INFO] Apache Aries Example SPI Provider Bundle 1 ........ SUCCESS
>> [0.007s]
>>> [INFO] Apache Aries Example SPI Provider Bundle 2 ........ SUCCESS
>> [0.005s]
>>> [INFO] Apache Aries Example SPI Client Jar 1 ............. SUCCESS
>> [0.006s]
>>> [INFO] Apache Aries Example SPI Client Bundle 1 .......... SUCCESS
>> [0.006s]
>>> [INFO] Apache Aries Example SPI Client Bundle 2 .......... SUCCESS
>> [0.006s]
>>> [INFO] Apache Aries Example Resource Provider Bundle ..... SUCCESS
>> [0.004s]
>>> [INFO] Apache Aries Example Resource Client Bundle ....... SUCCESS
>> [0.005s]
>>> [INFO] Apache Aries SPI Fly .............................. SUCCESS
>> [0.004s]
>>> [INFO] Apache Aries Samples .............................. SUCCESS
>> [0.154s]
>>> [INFO] Apache Aries blog sample .......................... SUCCESS
>> [0.081s]
>>> [INFO] Apache Aries blog sample API ...................... SUCCESS
>> [0.070s]
>>> [INFO] Apache Aries blog sample transaction enlisting JDBC
>>> datasource  SUCCESS [0.074s]
>>> [INFO] Apache Aries blog sample assembly ................. SUCCESS
>> [0.152s]
>>> [INFO] Apache Aries blog sample .......................... SUCCESS
>> [0.071s]
>>> [INFO] Apache Aries blog sample web component ............ SUCCESS
>> [0.074s]
>>> [INFO] Apache Aries blog sample persistence .............. SUCCESS
>> [0.071s]
>>> [INFO] Apache Aries Blog Sample EBA using JDBC ........... SUCCESS
>> [0.373s]
>>> [INFO] Apache Aries blog sample persistence .............. SUCCESS
>> [0.080s]
>>> [INFO] Apache Aries Blog Sample EBA using JPA ............ SUCCESS
>> [0.115s]
>>> [INFO] Apache Aries blog sample commenting EJB ........... SUCCESS
>> [0.094s]
>>> [INFO] Apache Aries Blog sample iTests ................... SUCCESS
>> [0.165s]
>>> [INFO] AriesTrader :: Performance Benchmark Sample ....... SUCCESS
>> [0.058s]
>>> [INFO] AriesTrader :: Modules ............................ SUCCESS
>> [0.074s]
>>> [INFO] AriesTrader :: Modules - Util ..................... SUCCESS
>> [0.065s]
>>> [INFO] AriesTrader :: Modules - API ...................... SUCCESS
>> [0.067s]
>>> [INFO] AriesTrader :: Modules - Core ..................... SUCCESS
>> [0.070s]
>>> [INFO] AriesTrader :: Modules - Web ...................... SUCCESS
>> [0.091s]
>>> [INFO] AriesTrader :: Modules - Beans .................... SUCCESS
>> [0.067s]
>>> [INFO] AriesTrader :: Modules - Entities ................. SUCCESS
>> [0.077s]
>>> [INFO] AriesTrader :: Modules - Derby DataSource ......... SUCCESS
>> [0.063s]
>>> [INFO] AriesTrader :: Modules - Persist JDBC ............. SUCCESS
>> [0.067s]
>>> [INFO] AriesTrader :: Modules - Persist JPA App Managed .. SUCCESS
>> [0.067s]
>>> [INFO] AriesTrader :: Modules - Persist JPA Container Managed
>>> SUCCESS [0.066s]
>>> [INFO] AriesTrader :: Assemblies ......................... SUCCESS
>> [0.067s]
>>> [INFO] AriesTrader :: Assemblies - EBA - JDBC ............ SUCCESS
>> [0.107s]
>>> [INFO] AriesTrader :: Assemblies - EBA - ALL ............. SUCCESS
>> [0.126s]
>>> [INFO] Equinox test harness that can be used to install sample EBAs
>>> SUCCESS [0.114s]
>>> [INFO] Apache Aries Blueprint samples .................... SUCCESS
>> [0.051s]
>>> [INFO] Apache Aries Blueprint HelloWorld ................. SUCCESS
>> [0.059s]
>>> [INFO] Apache Aries Blueprint HelloWorld API ............. SUCCESS
>> [0.051s]
>>> [INFO] Apache Aries Blueprint HelloWorldServer ........... SUCCESS
>> [0.053s]
>>> [INFO] Apache Aries Blueprint HelloWorldClient ........... SUCCESS
>> [0.053s]
>>> [INFO] Apache Aries Blueprint HelloWorld Assembly ........ SUCCESS
>> [0.066s]
>>> [INFO] Apache Aries Blueprint HelloWorld EBA ............. SUCCESS
>> [0.065s]
>>> [INFO] Apache Aries Blueprint sample iTests .............. SUCCESS
>> [0.107s]
>>> [INFO] Apache Aries Blueprint Sample - ID Verifier ....... SUCCESS
>> [0.054s]
>>> [INFO] Apache Aries Blueprint Sample - ID Verifier API ... SUCCESS
>> [0.051s]
>>> [INFO] Apache Aries Blueprint Sample - ID Verifier Server  SUCCESS
>> [0.055s]
>>> [INFO] Apache Aries Blueprint Sample - ID Verifier Client  SUCCESS
>> [0.055s]
>>> [INFO] Apache Aries Blueprint Sample - ID Verifier Assembly  SUCCESS
>> [0.068s]
>>> [INFO] Apache Aries Twitter sample ....................... SUCCESS
>> [0.051s]
>>> [INFO] Apache Aries Bundlise Twitter4j ................... SUCCESS
>> [0.321s]
>>> [INFO] Apache Aries Twitter bundle ....................... SUCCESS
>> [0.054s]
>>> [INFO] Apache Aries Twitter EBA .......................... SUCCESS
>> [0.054s]
>>> [INFO] Apache Aries Twitter sample integration tests ..... SUCCESS
>> [0.133s]
>>> [INFO] Apache Aries ...................................... SUCCESS
>> [0.279s]
>>> [INFO]
>>> ------------------------------------------------------------------------
>>> [INFO] BUILD SUCCESS
>>> [INFO]
>>> ------------------------------------------------------------------------
>>> [INFO] Total time: 11.563s
>>> [INFO] Finished at: Wed Jan 02 22:11:03 UTC 2013
>>> [INFO] Final Memory: 63M/387M
>>> [INFO]
>>> ------------------------------------------------------------------------
>>> [aries-current-snapshots] $ /home/hudson/tools/maven/apache-maven-3.
>>> 0.3/bin/mvn -Dmaven.repo.local=<https://builds.apache.org/job/
>>> AriesWithSnapshotDependencies/ws/.repository> versions:use-latest-
>>> versions -Dincludes=org.apache.aries*:*:*:* -DexcludeReactor=false -
>>> DallowSnapshots=true -DallowMajorUpdates=true -DallowMinorUpdates=true
>>> [INFO] Scanning for projects...
>>> [ERROR] The projects in the reactor contain a cyclic reference: Edge
>>> between 'Vertex
>>> {label='org.apache.aries.versioning:org.apache.aries.versioning.plugin:
>>> 0.1.0-SNAPSHOT'}' and 'Vertex
>>> {label='org.apache.aries.versioning:org.apache.aries.versioning.checker:
>>> 0.1.0-SNAPSHOT'}' introduces to cycle in the graph
>>> org.apache.aries.versioning:org.apache.aries.versioning.checker:0.1.
>>> 0-SNAPSHOT --> org.apache.aries:org.apache.aries.util:1.1.0-SNAPSHOT
>>> --> org.apache.aries.versioning:org.apache.aries.versioning.plugin:
>>> 0.1.0-SNAPSHOT -->
>>> org.apache.aries.versioning:org.apache.aries.versioning.checker:0.1.
>>> 0-SNAPSHOT -> [Help 1]
>>> [ERROR]
>>> [ERROR] To see the full stack trace of the errors, re-run Maven with
>>> the -e switch.
>>> [ERROR] Re-run Maven using the -X switch to enable full debug logging.
>>> [ERROR]
>>> [ERROR] For more information about the errors and possible
>>> solutions, please read the following articles:
>>> [ERROR] [Help 1] http://cwiki.apache.org/confluence/display/MAVEN/
>>> ProjectCycleException
>>> Build step 'Invoke top-level Maven targets' marked build as failure

-- 
Daniel Kulp
dkulp@apache.org - http://dankulp.com/blog
Talend Community Coder - http://coders.talend.com


Mime
View raw message