aries-dev mailing list archives

Site index · List index
Message view « Date » · « Thread »
Top « Date » · « Thread »
From Apache Jenkins Server <jenk...@builds.apache.org>
Subject Build failed in Jenkins: AriesWithSnapshotDependencies #521
Date Wed, 09 Jul 2014 21:03:02 GMT
See <https://builds.apache.org/job/AriesWithSnapshotDependencies/521/changes>

Changes:

[tjwatson] ARIES-1222: Should make osgi.ee and osgi.native capabilities available to all subsystems

------------------------------------------
[...truncated 16239 lines...]
[WARNING] The POM for org.apache.aries.spifly:org.apache.aries.spifly.core-internal:jar:1.0.1
is missing, no dependency information available
Downloading: http://download.eclipse.org/rt/eclipselink/maven.repo/org/apache/aries/spifly/org.apache.aries.spifly.core-internal/1.0.1/org.apache.aries.spifly.core-internal-1.0.1.jar
Downloading: http://repo1.maven.org/maven2/org/apache/aries/spifly/org.apache.aries.spifly.core-internal/1.0.1/org.apache.aries.spifly.core-internal-1.0.1.jar
[INFO] ------------------------------------------------------------------------
[INFO] Reactor Summary:
[INFO] 
[INFO] Aries :: Parent POM ............................... SUCCESS [1.796s]
[INFO] Aries Maven EBA Plugin ............................ SUCCESS [16.760s]
[INFO] Apache Aries Unit Test Support .................... SUCCESS [4.864s]
[INFO] Apache Aries Test Support ......................... SUCCESS [0.020s]
[INFO] Apache Aries Util classes compiled under r 42 framework  SUCCESS [11.465s]
[INFO] Apache Aries Util ................................. SUCCESS [8.921s]
[INFO] Apache Aries Util ................................. SUCCESS [0.016s]
[INFO] Apache Aries Proxy API ............................ SUCCESS [1.490s]
[INFO] Apache Aries Proxy Service ........................ SUCCESS [4.695s]
[INFO] Apache Aries Proxy Bundle ......................... SUCCESS [3.085s]
[INFO] Apache Aries Proxy iTests ......................... SUCCESS [28.329s]
[INFO] Apache Aries Class Proxy .......................... SUCCESS [0.017s]
[INFO] Apache Aries Quiesce API .......................... SUCCESS [0.216s]
[INFO] Apache Aries Quiesce Manager ...................... SUCCESS [0.906s]
[INFO] Aries Quiesce Manager iTests ...................... SUCCESS [5.123s]
[INFO] Apache Aries Quiesce .............................. SUCCESS [0.026s]
[INFO] Apache Aries Blueprint API ........................ SUCCESS [0.392s]
[INFO] Apache Aries Blueprint Parser ..................... SUCCESS [0.705s]
[INFO] Apache Aries Blueprint Core ....................... SUCCESS [6.770s]
[INFO] Apache Aries Blueprint CM ......................... SUCCESS [6.924s]
[INFO] Apache Aries Blueprint Bundle ..................... SUCCESS [3.583s]
[INFO] Apache Aries Blueprint Compatiblity Fragment Bundle  SUCCESS [0.468s]
[INFO] Apache Aries Blueprint Core Compatiblity Fragment Bundle  SUCCESS [0.561s]
[INFO] Apache Aries Blueprint no-OSGI .................... SUCCESS [1.356s]
[INFO] Apache Aries Blueprint Web ........................ SUCCESS [3.181s]
[INFO] Apache Aries Blueprint Web OSGI ................... SUCCESS [1.294s]
[INFO] Apache Aries Blueprint JEXL evaluator ............. SUCCESS [1.058s]
[INFO] Apache Aries Blueprint Sample ..................... SUCCESS [0.517s]
[INFO] Apache Aries Blueprint Annotation API ............. SUCCESS [0.274s]
[INFO] Apache Aries Blueprint Annotation Impl ............ SUCCESS [3.540s]
[INFO] Apache Aries Blueprint Sample for Testing Annotation  SUCCESS [0.710s]
[INFO] Apache Aries Blueprint Sample Fragment for Testing Annotation  SUCCESS [0.622s]
[INFO] Apache Aries Blueprint WAR Sample ................. SUCCESS [3.596s]
[INFO] Apache Aries Blueprint Test Bundle A .............. SUCCESS [1.019s]
[INFO] Apache Aries Blueprint Test Bundle B .............. SUCCESS [0.930s]
[INFO] Apache Aries Blueprint Test Quiesce Bundle ........ SUCCESS [0.759s]
[INFO] Apache Aries Blueprint iTests ..................... SUCCESS [11.682s]
[INFO] Apache Aries Blueprint ............................ SUCCESS [0.014s]
[INFO] Apache Aries JNDI API ............................. SUCCESS [0.224s]
[INFO] Apache Aries JNDI Core ............................ SUCCESS [0.742s]
[INFO] Apache Aries JNDI URL Handler ..................... SUCCESS [0.975s]
[INFO] Apache Aries JNDI RMI Handler ..................... SUCCESS [0.250s]
[INFO] Apache Aries JNDI Bundle .......................... SUCCESS [1.502s]
[INFO] Apache Aries JNDI Support for Legacy Runtimes ..... SUCCESS [0.259s]
[INFO] Apache Aries JNDI "business logic" test bundle for Aries jndi-url iTests  SUCCESS [0.651s]
[INFO] Apache Aries JNDI Test Bundle for Aries jndi-url iTests  SUCCESS [0.740s]
[INFO] Apache Aries JNDI iTests for jndi-url ............. SUCCESS [12.715s]
[INFO] Apache Aries JNDI ................................. SUCCESS [0.013s]
[INFO] Apache Aries Transaction Manager .................. SUCCESS [13.475s]
[INFO] Apache Aries Transaction Blueprint ................ SUCCESS [0.316s]
[INFO] Apache Aries Transaction Enlisting JDBC Datasource  SUCCESS [7.889s]
[INFO] Apache Aries JMS Pool ............................. SUCCESS [3.849s]
[INFO] Apache Aries Transaction Test Datasource Configuration  SUCCESS [1.869s]
[INFO] Apache Aries Transaction Test Bundle .............. SUCCESS [0.606s]
[INFO] Apache Aries Transaction Integration Tests ........ SUCCESS [1.077s]
[INFO] Apache Aries Transaction - reactor pom ............ SUCCESS [0.018s]
[INFO] Apache Aries Web Url handler ...................... SUCCESS [0.453s]
[INFO] Apache Aries Web integration tests ................ SUCCESS [1.373s]
[INFO] Apache Aries Web Component ........................ SUCCESS [0.013s]
[INFO] Apache Aries Application API ...................... SUCCESS [0.453s]
[INFO] Apache Aries Application Utils .................... SUCCESS [0.933s]
[INFO] Apache Aries Application Bundle ................... SUCCESS [5.035s]
[INFO] Apache Aries Application Converters ............... SUCCESS [1.446s]
[INFO] Apache Aries Application Default local platform ... SUCCESS [0.428s]
[INFO] Apache Aries Application Deployment Management .... SUCCESS [0.312s]
[INFO] Apache Aries Application Installer ................ SUCCESS [1.872s]
[INFO] Apache Aries Application itests sample application interface  SUCCESS [0.578s]
[INFO] Apache Aries Application integration tests ........ SUCCESS [5.978s]
[INFO] Apache Aries Application Management ............... SUCCESS [0.324s]
[INFO] Apache Aries Application Modelling ................ SUCCESS [0.340s]
[INFO] Apache Aries Application Modelling Standalone ..... SUCCESS [38.545s]
[INFO] Apache Aries Application Modelling tests .......... SUCCESS [1.271s]
[INFO] Apache Aries Application No-op Resolver ........... SUCCESS [0.206s]
[INFO] Apache Aries Application OBR Resolver ............. SUCCESS [0.302s]
[INFO] Apache Aries Application Resolve CM Transform ..... SUCCESS [0.179s]
[INFO] Apache Aries Application Resolve CM Transform iTests  SUCCESS [0.669s]
[INFO] Apache Aries Application Runtime .................. SUCCESS [0.293s]
[INFO] Apache Aries Isolated Application Runtime ......... SUCCESS [0.205s]
[INFO] Apache Aries Bundle Framework provider ............ SUCCESS [0.217s]
[INFO] Apache Aries Bundle Framework Manager provider .... SUCCESS [0.232s]
[INFO] Apache Aries repository generator tool ............ SUCCESS [4.436s]
[INFO] Apache Aries Bundle Repository provider ........... SUCCESS [0.196s]
[INFO] Application distribution .......................... SUCCESS [3.008s]
[INFO] Application distribution for isolated application support  SUCCESS [0.921s]
[INFO] Apache Aries Application .......................... SUCCESS [0.018s]
[INFO] Apache Aries Subsystem API ........................ SUCCESS [1.445s]
[INFO] Apache Aries Subsystem Core ....................... SUCCESS [5.239s]
[INFO] Apache Aries Subsystem OBR ........................ SUCCESS [0.559s]
[INFO] Apache Aries Subsystem iTests interfaces bundle ... SUCCESS [0.131s]
[INFO] Apache Aries Subsystem iTests ..................... SUCCESS [15.238s]
[INFO] Apache Aries Subsystems Bundle .................... SUCCESS [2.934s]
[INFO] Apache Aries Subsystem ............................ SUCCESS [0.012s]
[INFO] Aries EJB Modelling Integration ................... SUCCESS [13.572s]
[INFO] Aries EJB Modelling iTests ........................ SUCCESS [16.698s]
[INFO] Aries OpenEJB Runtime Extender .................... SUCCESS [0.786s]
[INFO] Aries EJB Extender iTests ......................... SUCCESS [8.959s]
[INFO] Aries EJB Component ............................... SUCCESS [0.013s]
[INFO] Apache Aries JMX API .............................. SUCCESS [0.316s]
[INFO] Apache Aries JMX Blueprint API .................... SUCCESS [0.325s]
[INFO] Apache Aries JMX Core ............................. SUCCESS [2.650s]
[INFO] Apache Aries JMX Core via Whiteboards ............. SUCCESS [1.648s]
[INFO] Apache Aries Whiteboard support for JMX DynamicMBean services  SUCCESS [15.115s]
[INFO] Apache Aries JMX Blueprint Core ................... SUCCESS [4.910s]
[INFO] Apache Aries JMX Bundle ........................... SUCCESS [3.140s]
[INFO] Apache Aries JMX Blueprint Bundle ................. SUCCESS [1.148s]
[INFO] Apache Aries JMX integration tests ................ SUCCESS [0.678s]
[INFO] Apache Aries JMX .................................. SUCCESS [0.011s]
[INFO] Aries JPA Container API ........................... SUCCESS [0.231s]
[INFO] Aries JPA Container ............................... SUCCESS [0.526s]
[INFO] Aries JPA Container Managed Contexts .............. SUCCESS [0.366s]
[INFO] Aries JPA Container blueprint integration for Aries blueprint  SUCCESS [0.999s]
[INFO] Test Bundle for Aries JPA Container iTests ........ SUCCESS [1.404s]
[INFO] Test Bundle for Aries JPA Container advanced iTests  SUCCESS [0.635s]
[INFO] Test Bundle for Aries JPA Blueprint iTests ........ SUCCESS [0.670s]
[INFO] Aries JPA iTests .................................. SUCCESS [4.550s]
[INFO] Aries JPA Component ............................... SUCCESS [0.010s]
[INFO] Apache Aries SPI Fly Core (internal module) ....... SUCCESS [1.957s]
[INFO] Apache Aries SPI Fly Weaver (internal module) ..... FAILURE [0.617s]
[INFO] Apache Aries SPI Fly Dynamic Weaving Bundle ....... SKIPPED
[INFO] Apache Aries SPI Fly Static Weaving Tool .......... SKIPPED
[INFO] Apache Aries SPI Fly Static Weaving Bundle ........ SKIPPED
[INFO] Apache Aries SPI Fly Examples ..................... SKIPPED
[INFO] Apache Aries Example SPI Interface ................ SKIPPED
[INFO] Apache Aries Example SPI Provider Jar 1 ........... SKIPPED
[INFO] Apache Aries Example SPI Provider Bundle 1 ........ SKIPPED
[INFO] Apache Aries Example SPI Provider Bundle 2 ........ SKIPPED
[INFO] Apache Aries Example SPI Client Jar 1 ............. SKIPPED
[INFO] Apache Aries Example SPI Client Bundle 1 .......... SKIPPED
[INFO] Apache Aries Example SPI Client Bundle 2 .......... SKIPPED
[INFO] Apache Aries Example SPI Provider Consumer Bundle . SKIPPED
[INFO] Apache Aries Example Resource Provider Bundle ..... SKIPPED
[INFO] Apache Aries Example Resource Client Bundle ....... SKIPPED
[INFO] Apache Aries SPI Fly .............................. SKIPPED
[INFO] Apache Aries Samples .............................. SKIPPED
[INFO] Apache Aries blog sample .......................... SKIPPED
[INFO] Apache Aries blog sample API ...................... SKIPPED
[INFO] Apache Aries blog sample transaction enlisting JDBC datasource  SKIPPED
[INFO] Apache Aries blog sample assembly ................. SKIPPED
[INFO] Apache Aries blog sample .......................... SKIPPED
[INFO] Apache Aries blog sample web component ............ SKIPPED
[INFO] Apache Aries blog sample persistence .............. SKIPPED
[INFO] Apache Aries Blog Sample EBA using JDBC ........... SKIPPED
[INFO] Apache Aries blog sample persistence .............. SKIPPED
[INFO] Apache Aries Blog Sample EBA using JPA ............ SKIPPED
[INFO] Apache Aries blog sample commenting EJB ........... SKIPPED
[INFO] Apache Aries Blog sample iTests ................... SKIPPED
[INFO] AriesTrader :: Performance Benchmark Sample ....... SKIPPED
[INFO] AriesTrader :: Modules ............................ SKIPPED
[INFO] AriesTrader :: Modules - Util ..................... SKIPPED
[INFO] AriesTrader :: Modules - API ...................... SKIPPED
[INFO] AriesTrader :: Modules - Core ..................... SKIPPED
[INFO] AriesTrader :: Modules - Web ...................... SKIPPED
[INFO] AriesTrader :: Modules - Beans .................... SKIPPED
[INFO] AriesTrader :: Modules - Entities ................. SKIPPED
[INFO] AriesTrader :: Modules - Derby DataSource ......... SKIPPED
[INFO] AriesTrader :: Modules - Persist JDBC ............. SKIPPED
[INFO] AriesTrader :: Modules - Persist JPA App Managed .. SKIPPED
[INFO] AriesTrader :: Modules - Persist JPA Container Managed  SKIPPED
[INFO] AriesTrader :: Assemblies ......................... SKIPPED
[INFO] AriesTrader :: Assemblies - EBA - JDBC ............ SKIPPED
[INFO] AriesTrader :: Assemblies - EBA - ALL ............. SKIPPED
[INFO] Equinox test harness that can be used to install sample EBAs  SKIPPED
[INFO] Apache Aries Blueprint samples .................... SKIPPED
[INFO] Apache Aries Blueprint HelloWorld ................. SKIPPED
[INFO] Apache Aries Blueprint HelloWorld API ............. SKIPPED
[INFO] Apache Aries Blueprint HelloWorldServer ........... SKIPPED
[INFO] Apache Aries Blueprint HelloWorldClient ........... SKIPPED
[INFO] Apache Aries Blueprint HelloWorld Assembly ........ SKIPPED
[INFO] Apache Aries Blueprint HelloWorld EBA ............. SKIPPED
[INFO] Apache Aries Blueprint sample iTests .............. SKIPPED
[INFO] Apache Aries Blueprint Sample - ID Verifier ....... SKIPPED
[INFO] Apache Aries Blueprint Sample - ID Verifier API ... SKIPPED
[INFO] Apache Aries Blueprint Sample - ID Verifier Server  SKIPPED
[INFO] Apache Aries Blueprint Sample - ID Verifier Client  SKIPPED
[INFO] Apache Aries Blueprint Sample - ID Verifier Assembly  SKIPPED
[INFO] Apache Aries Twitter sample ....................... SKIPPED
[INFO] Apache Aries Bundlise Twitter4j ................... SKIPPED
[INFO] Apache Aries Twitter bundle ....................... SKIPPED
[INFO] Apache Aries Twitter EBA .......................... SKIPPED
[INFO] Apache Aries Twitter sample integration tests ..... SKIPPED
[INFO] Apache Aries ...................................... SKIPPED
[INFO] ------------------------------------------------------------------------
[INFO] BUILD FAILURE
[INFO] ------------------------------------------------------------------------
[INFO] Total time: 6:11.429s
[INFO] Finished at: Wed Jul 09 21:03:00 UTC 2014
[INFO] Final Memory: 133M/588M
[INFO] ------------------------------------------------------------------------
[ERROR] Failed to execute goal on project org.apache.aries.spifly.weaver-internal: Could not
resolve dependencies for project org.apache.aries.spifly:org.apache.aries.spifly.weaver-internal:jar:1.0.2-SNAPSHOT:
Could not find artifact org.apache.aries.spifly:org.apache.aries.spifly.core-internal:jar:1.0.1
in EclipseLink Repo (http://download.eclipse.org/rt/eclipselink/maven.repo/) -> [Help 1]
org.apache.maven.lifecycle.LifecycleExecutionException: Failed to execute goal on project
org.apache.aries.spifly.weaver-internal: Could not resolve dependencies for project org.apache.aries.spifly:org.apache.aries.spifly.weaver-internal:jar:1.0.2-SNAPSHOT:
Could not find artifact org.apache.aries.spifly:org.apache.aries.spifly.core-internal:jar:1.0.1
in EclipseLink Repo (http://download.eclipse.org/rt/eclipselink/maven.repo/)
	at org.apache.maven.lifecycle.internal.LifecycleDependencyResolver.getDependencies(LifecycleDependencyResolver.java:196)
	at org.apache.maven.lifecycle.internal.LifecycleDependencyResolver.resolveProjectDependencies(LifecycleDependencyResolver.java:108)
	at org.apache.maven.lifecycle.internal.MojoExecutor.ensureDependenciesAreResolved(MojoExecutor.java:258)
	at org.apache.maven.lifecycle.internal.MojoExecutor.execute(MojoExecutor.java:201)
	at org.apache.maven.lifecycle.internal.MojoExecutor.execute(MojoExecutor.java:153)
	at org.apache.maven.lifecycle.internal.MojoExecutor.execute(MojoExecutor.java:145)
	at org.apache.maven.lifecycle.internal.LifecycleModuleBuilder.buildProject(LifecycleModuleBuilder.java:84)
	at org.apache.maven.lifecycle.internal.LifecycleModuleBuilder.buildProject(LifecycleModuleBuilder.java:59)
	at org.apache.maven.lifecycle.internal.LifecycleStarter.singleThreadedBuild(LifecycleStarter.java:183)
	at org.apache.maven.lifecycle.internal.LifecycleStarter.execute(LifecycleStarter.java:161)
	at org.apache.maven.DefaultMaven.doExecute(DefaultMaven.java:319)
	at org.apache.maven.DefaultMaven.execute(DefaultMaven.java:156)
	at org.apache.maven.cli.MavenCli.execute(MavenCli.java:537)
	at org.apache.maven.cli.MavenCli.doMain(MavenCli.java:196)
	at org.apache.maven.cli.MavenCli.main(MavenCli.java:141)
	at sun.reflect.NativeMethodAccessorImpl.invoke0(Native Method)
	at sun.reflect.NativeMethodAccessorImpl.invoke(NativeMethodAccessorImpl.java:57)
	at sun.reflect.DelegatingMethodAccessorImpl.invoke(DelegatingMethodAccessorImpl.java:43)
	at java.lang.reflect.Method.invoke(Method.java:606)
	at org.codehaus.plexus.classworlds.launcher.Launcher.launchEnhanced(Launcher.java:290)
	at org.codehaus.plexus.classworlds.launcher.Launcher.launch(Launcher.java:230)
	at org.codehaus.plexus.classworlds.launcher.Launcher.mainWithExitCode(Launcher.java:409)
	at org.codehaus.plexus.classworlds.launcher.Launcher.main(Launcher.java:352)
Caused by: org.apache.maven.project.DependencyResolutionException: Could not resolve dependencies
for project org.apache.aries.spifly:org.apache.aries.spifly.weaver-internal:jar:1.0.2-SNAPSHOT:
Could not find artifact org.apache.aries.spifly:org.apache.aries.spifly.core-internal:jar:1.0.1
in EclipseLink Repo (http://download.eclipse.org/rt/eclipselink/maven.repo/)
	at org.apache.maven.project.DefaultProjectDependenciesResolver.resolve(DefaultProjectDependenciesResolver.java:170)
	at org.apache.maven.lifecycle.internal.LifecycleDependencyResolver.getDependencies(LifecycleDependencyResolver.java:171)
	... 22 more
Caused by: org.sonatype.aether.resolution.DependencyResolutionException: Could not find artifact
org.apache.aries.spifly:org.apache.aries.spifly.core-internal:jar:1.0.1 in EclipseLink Repo
(http://download.eclipse.org/rt/eclipselink/maven.repo/)
	at org.sonatype.aether.impl.internal.DefaultRepositorySystem.resolveDependencies(DefaultRepositorySystem.java:412)
	at org.apache.maven.project.DefaultProjectDependenciesResolver.resolve(DefaultProjectDependenciesResolver.java:164)
	... 23 more
Caused by: org.sonatype.aether.resolution.ArtifactResolutionException: Could not find artifact
org.apache.aries.spifly:org.apache.aries.spifly.core-internal:jar:1.0.1 in EclipseLink Repo
(http://download.eclipse.org/rt/eclipselink/maven.repo/)
	at org.sonatype.aether.impl.internal.DefaultArtifactResolver.resolve(DefaultArtifactResolver.java:541)
	at org.sonatype.aether.impl.internal.DefaultArtifactResolver.resolveArtifacts(DefaultArtifactResolver.java:220)
	at org.sonatype.aether.impl.internal.DefaultRepositorySystem.resolveDependencies(DefaultRepositorySystem.java:395)
	... 24 more
Caused by: org.sonatype.aether.transfer.ArtifactNotFoundException: Could not find artifact
org.apache.aries.spifly:org.apache.aries.spifly.core-internal:jar:1.0.1 in EclipseLink Repo
(http://download.eclipse.org/rt/eclipselink/maven.repo/)
	at org.sonatype.aether.connector.wagon.WagonRepositoryConnector$4.wrap(WagonRepositoryConnector.java:945)
	at org.sonatype.aether.connector.wagon.WagonRepositoryConnector$4.wrap(WagonRepositoryConnector.java:940)
	at org.sonatype.aether.connector.wagon.WagonRepositoryConnector$GetTask.flush(WagonRepositoryConnector.java:695)
	at org.sonatype.aether.connector.wagon.WagonRepositoryConnector$GetTask.flush(WagonRepositoryConnector.java:689)
	at org.sonatype.aether.connector.wagon.WagonRepositoryConnector.get(WagonRepositoryConnector.java:445)
	at org.sonatype.aether.impl.internal.DefaultArtifactResolver.resolve(DefaultArtifactResolver.java:460)
	... 26 more
[ERROR] 
[ERROR] Re-run Maven using the -X switch to enable full debug logging.
[ERROR] 
[ERROR] For more information about the errors and possible solutions, please read the following
articles:
[ERROR] [Help 1] http://cwiki.apache.org/confluence/display/MAVEN/DependencyResolutionException
[ERROR] 
[ERROR] After correcting the problems, you can resume the build with the command
[ERROR]   mvn <goals> -rf :org.apache.aries.spifly.weaver-internal
Build step 'Invoke top-level Maven targets' marked build as failure

Mime
View raw message