aries-dev mailing list archives

Site index · List index
Message view « Date » · « Thread »
Top « Date » · « Thread »
From Apache Jenkins Server <jenk...@builds.apache.org>
Subject Build failed in Jenkins: AriesWithSnapshotDependencies #523
Date Fri, 11 Jul 2014 15:40:59 GMT
See <https://builds.apache.org/job/AriesWithSnapshotDependencies/523/changes>

Changes:

[tjwatson] ARIES-1215 - Use system bundle for tracking namespace handlers and bundles

If the property org.apache.aries.blueprint.use.system.context=true is set 
then the blueprint extender will use the system bundle context to track blueprint bundles
and track NamespaceHandler services.

Two new testcases were added.

1) verifies that if a blueprint bundle is hidden
from the blueprint extender, using bundle hooks, then the blueprint extender can still
track the bundle properly using the system bundle context

2) verifies that if the blueprint cm bundle is hidden from the 
blueprint extender, using service hooks, then the blueprint extender can still
process blueprint bundles that use the cm namespace handler properly

When org.apache.aries.blueprint.use.system.context=true the blueprint extender
will no longer use the RecursiveBundleTracker.  This means that the old 
equinox composite bundles will not be supported when this option is enabled.
This option is intended to be used with subsystems.

------------------------------------------
[...truncated 12872 lines...]
[WARNING] The POM for org.apache.aries.spifly:org.apache.aries.spifly.core-internal:jar:1.0.1
is missing, no dependency information available
Downloading: http://download.eclipse.org/rt/eclipselink/maven.repo/org/apache/aries/spifly/org.apache.aries.spifly.core-internal/1.0.1/org.apache.aries.spifly.core-internal-1.0.1.jar
Downloading: http://repo1.maven.org/maven2/org/apache/aries/spifly/org.apache.aries.spifly.core-internal/1.0.1/org.apache.aries.spifly.core-internal-1.0.1.jar
[INFO] ------------------------------------------------------------------------
[INFO] Reactor Summary:
[INFO] 
[INFO] Aries :: Parent POM ............................... SUCCESS [3.992s]
[INFO] Aries Maven EBA Plugin ............................ SUCCESS [4.474s]
[INFO] Apache Aries Unit Test Support .................... SUCCESS [3.046s]
[INFO] Apache Aries Test Support ......................... SUCCESS [0.050s]
[INFO] Apache Aries Util classes compiled under r 42 framework  SUCCESS [0.993s]
[INFO] Apache Aries Util ................................. SUCCESS [9.047s]
[INFO] Apache Aries Util ................................. SUCCESS [0.023s]
[INFO] Apache Aries Proxy API ............................ SUCCESS [0.493s]
[INFO] Apache Aries Proxy Service ........................ SUCCESS [1.582s]
[INFO] Apache Aries Proxy Bundle ......................... SUCCESS [2.807s]
[INFO] Apache Aries Proxy iTests ......................... SUCCESS [1.456s]
[INFO] Apache Aries Class Proxy .......................... SUCCESS [0.043s]
[INFO] Apache Aries Quiesce API .......................... SUCCESS [0.251s]
[INFO] Apache Aries Quiesce Manager ...................... SUCCESS [0.344s]
[INFO] Aries Quiesce Manager iTests ...................... SUCCESS [0.217s]
[INFO] Apache Aries Quiesce .............................. SUCCESS [0.031s]
[INFO] Apache Aries Blueprint API ........................ SUCCESS [0.544s]
[INFO] Apache Aries Blueprint Parser ..................... SUCCESS [0.542s]
[INFO] Apache Aries Blueprint Core ....................... SUCCESS [2.928s]
[INFO] Apache Aries Blueprint CM ......................... SUCCESS [0.659s]
[INFO] Apache Aries Blueprint Bundle ..................... SUCCESS [1.906s]
[INFO] Apache Aries Blueprint Compatiblity Fragment Bundle  SUCCESS [0.124s]
[INFO] Apache Aries Blueprint Core Compatiblity Fragment Bundle  SUCCESS [0.146s]
[INFO] Apache Aries Blueprint no-OSGI .................... SUCCESS [0.544s]
[INFO] Apache Aries Blueprint Web ........................ SUCCESS [0.195s]
[INFO] Apache Aries Blueprint Web OSGI ................... SUCCESS [1.244s]
[INFO] Apache Aries Blueprint JEXL evaluator ............. SUCCESS [1.013s]
[INFO] Apache Aries Blueprint Sample ..................... SUCCESS [0.516s]
[INFO] Apache Aries Blueprint Annotation API ............. SUCCESS [0.386s]
[INFO] Apache Aries Blueprint Annotation Impl ............ SUCCESS [0.854s]
[INFO] Apache Aries Blueprint Sample for Testing Annotation  SUCCESS [0.484s]
[INFO] Apache Aries Blueprint Sample Fragment for Testing Annotation  SUCCESS [0.423s]
[INFO] Apache Aries Blueprint WAR Sample ................. SUCCESS [0.757s]
[INFO] Apache Aries Blueprint Test Bundle A .............. SUCCESS [0.727s]
[INFO] Apache Aries Blueprint Test Bundle B .............. SUCCESS [0.826s]
[INFO] Apache Aries Blueprint Test Quiesce Bundle ........ SUCCESS [0.513s]
[INFO] Apache Aries Blueprint iTests ..................... SUCCESS [2.781s]
[INFO] Apache Aries Blueprint ............................ SUCCESS [0.049s]
[INFO] Apache Aries JNDI API ............................. SUCCESS [0.293s]
[INFO] Apache Aries JNDI Core ............................ SUCCESS [0.517s]
[INFO] Apache Aries JNDI URL Handler ..................... SUCCESS [0.475s]
[INFO] Apache Aries JNDI RMI Handler ..................... SUCCESS [0.413s]
[INFO] Apache Aries JNDI Bundle .......................... SUCCESS [0.492s]
[INFO] Apache Aries JNDI Support for Legacy Runtimes ..... SUCCESS [0.520s]
[INFO] Apache Aries JNDI "business logic" test bundle for Aries jndi-url iTests  SUCCESS [0.296s]
[INFO] Apache Aries JNDI Test Bundle for Aries jndi-url iTests  SUCCESS [0.433s]
[INFO] Apache Aries JNDI iTests for jndi-url ............. SUCCESS [0.409s]
[INFO] Apache Aries JNDI ................................. SUCCESS [0.076s]
[INFO] Apache Aries Transaction Manager .................. SUCCESS [1.734s]
[INFO] Apache Aries Transaction Blueprint ................ SUCCESS [0.372s]
[INFO] Apache Aries Transaction Enlisting JDBC Datasource  SUCCESS [1.545s]
[INFO] Apache Aries JMS Pool ............................. SUCCESS [1.309s]
[INFO] Apache Aries Transaction Test Datasource Configuration  SUCCESS [0.291s]
[INFO] Apache Aries Transaction Test Bundle .............. SUCCESS [0.250s]
[INFO] Apache Aries Transaction Integration Tests ........ SUCCESS [0.199s]
[INFO] Apache Aries Transaction - reactor pom ............ SUCCESS [0.035s]
[INFO] Apache Aries Web Url handler ...................... SUCCESS [0.348s]
[INFO] Apache Aries Web integration tests ................ SUCCESS [0.171s]
[INFO] Apache Aries Web Component ........................ SUCCESS [0.070s]
[INFO] Apache Aries Application API ...................... SUCCESS [0.762s]
[INFO] Apache Aries Application Utils .................... SUCCESS [0.521s]
[INFO] Apache Aries Application Bundle ................... SUCCESS [0.963s]
[INFO] Apache Aries Application Converters ............... SUCCESS [0.899s]
[INFO] Apache Aries Application Default local platform ... SUCCESS [0.277s]
[INFO] Apache Aries Application Deployment Management .... SUCCESS [0.371s]
[INFO] Apache Aries Application Installer ................ SUCCESS [0.338s]
[INFO] Apache Aries Application itests sample application interface  SUCCESS [0.219s]
[INFO] Apache Aries Application integration tests ........ SUCCESS [0.307s]
[INFO] Apache Aries Application Management ............... SUCCESS [0.420s]
[INFO] Apache Aries Application Modelling ................ SUCCESS [0.698s]
[INFO] Apache Aries Application Modelling Standalone ..... SUCCESS [19.788s]
[INFO] Apache Aries Application Modelling tests .......... SUCCESS [0.443s]
[INFO] Apache Aries Application No-op Resolver ........... SUCCESS [0.503s]
[INFO] Apache Aries Application OBR Resolver ............. SUCCESS [0.573s]
[INFO] Apache Aries Application Resolve CM Transform ..... SUCCESS [0.495s]
[INFO] Apache Aries Application Resolve CM Transform iTests  SUCCESS [0.392s]
[INFO] Apache Aries Application Runtime .................. SUCCESS [0.435s]
[INFO] Apache Aries Isolated Application Runtime ......... SUCCESS [0.616s]
[INFO] Apache Aries Bundle Framework provider ............ SUCCESS [0.506s]
[INFO] Apache Aries Bundle Framework Manager provider .... SUCCESS [0.583s]
[INFO] Apache Aries repository generator tool ............ SUCCESS [2.594s]
[INFO] Apache Aries Bundle Repository provider ........... SUCCESS [0.480s]
[INFO] Application distribution .......................... SUCCESS [1.315s]
[INFO] Application distribution for isolated application support  SUCCESS [1.487s]
[INFO] Apache Aries Application .......................... SUCCESS [0.087s]
[INFO] Apache Aries Subsystem API ........................ SUCCESS [0.642s]
[INFO] Apache Aries Subsystem Core ....................... SUCCESS [1.521s]
[INFO] Apache Aries Subsystem OBR ........................ SUCCESS [0.626s]
[INFO] Apache Aries Subsystem iTests interfaces bundle ... SUCCESS [0.504s]
[INFO] Apache Aries Subsystem iTests ..................... SUCCESS [2.519s]
[INFO] Apache Aries Subsystems Bundle .................... SUCCESS [1.097s]
[INFO] Apache Aries Subsystem ............................ SUCCESS [0.059s]
[INFO] Aries EJB Modelling Integration ................... SUCCESS [1.628s]
[INFO] Aries EJB Modelling iTests ........................ SUCCESS [1.895s]
[INFO] Aries OpenEJB Runtime Extender .................... SUCCESS [1.235s]
[INFO] Aries EJB Extender iTests ......................... SUCCESS [1.007s]
[INFO] Aries EJB Component ............................... SUCCESS [0.093s]
[INFO] Apache Aries JMX API .............................. SUCCESS [0.768s]
[INFO] Apache Aries JMX Blueprint API .................... SUCCESS [0.994s]
[INFO] Apache Aries JMX Core ............................. SUCCESS [1.717s]
[INFO] Apache Aries JMX Core via Whiteboards ............. SUCCESS [1.537s]
[INFO] Apache Aries Whiteboard support for JMX DynamicMBean services  SUCCESS [1.134s]
[INFO] Apache Aries JMX Blueprint Core ................... SUCCESS [0.998s]
[INFO] Apache Aries JMX Bundle ........................... SUCCESS [0.951s]
[INFO] Apache Aries JMX Blueprint Bundle ................. SUCCESS [0.432s]
[INFO] Apache Aries JMX integration tests ................ SUCCESS [0.205s]
[INFO] Apache Aries JMX .................................. SUCCESS [0.015s]
[INFO] Aries JPA Container API ........................... SUCCESS [0.227s]
[INFO] Aries JPA Container ............................... SUCCESS [5.354s]
[INFO] Aries JPA Container Managed Contexts .............. SUCCESS [0.561s]
[INFO] Aries JPA Container blueprint integration for Aries blueprint  SUCCESS [0.540s]
[INFO] Test Bundle for Aries JPA Container iTests ........ SUCCESS [1.014s]
[INFO] Test Bundle for Aries JPA Container advanced iTests  SUCCESS [0.227s]
[INFO] Test Bundle for Aries JPA Blueprint iTests ........ SUCCESS [0.282s]
[INFO] Aries JPA iTests .................................. SUCCESS [0.373s]
[INFO] Aries JPA Component ............................... SUCCESS [0.015s]
[INFO] Apache Aries SPI Fly Core (internal module) ....... SUCCESS [0.318s]
[INFO] Apache Aries SPI Fly Weaver (internal module) ..... FAILURE [0.359s]
[INFO] Apache Aries SPI Fly Dynamic Weaving Bundle ....... SKIPPED
[INFO] Apache Aries SPI Fly Static Weaving Tool .......... SKIPPED
[INFO] Apache Aries SPI Fly Static Weaving Bundle ........ SKIPPED
[INFO] Apache Aries SPI Fly Examples ..................... SKIPPED
[INFO] Apache Aries Example SPI Interface ................ SKIPPED
[INFO] Apache Aries Example SPI Provider Jar 1 ........... SKIPPED
[INFO] Apache Aries Example SPI Provider Bundle 1 ........ SKIPPED
[INFO] Apache Aries Example SPI Provider Bundle 2 ........ SKIPPED
[INFO] Apache Aries Example SPI Client Jar 1 ............. SKIPPED
[INFO] Apache Aries Example SPI Client Bundle 1 .......... SKIPPED
[INFO] Apache Aries Example SPI Client Bundle 2 .......... SKIPPED
[INFO] Apache Aries Example SPI Provider Consumer Bundle . SKIPPED
[INFO] Apache Aries Example Resource Provider Bundle ..... SKIPPED
[INFO] Apache Aries Example Resource Client Bundle ....... SKIPPED
[INFO] Apache Aries SPI Fly .............................. SKIPPED
[INFO] Apache Aries Samples .............................. SKIPPED
[INFO] Apache Aries blog sample .......................... SKIPPED
[INFO] Apache Aries blog sample API ...................... SKIPPED
[INFO] Apache Aries blog sample transaction enlisting JDBC datasource  SKIPPED
[INFO] Apache Aries blog sample assembly ................. SKIPPED
[INFO] Apache Aries blog sample .......................... SKIPPED
[INFO] Apache Aries blog sample web component ............ SKIPPED
[INFO] Apache Aries blog sample persistence .............. SKIPPED
[INFO] Apache Aries Blog Sample EBA using JDBC ........... SKIPPED
[INFO] Apache Aries blog sample persistence .............. SKIPPED
[INFO] Apache Aries Blog Sample EBA using JPA ............ SKIPPED
[INFO] Apache Aries blog sample commenting EJB ........... SKIPPED
[INFO] Apache Aries Blog sample iTests ................... SKIPPED
[INFO] AriesTrader :: Performance Benchmark Sample ....... SKIPPED
[INFO] AriesTrader :: Modules ............................ SKIPPED
[INFO] AriesTrader :: Modules - Util ..................... SKIPPED
[INFO] AriesTrader :: Modules - API ...................... SKIPPED
[INFO] AriesTrader :: Modules - Core ..................... SKIPPED
[INFO] AriesTrader :: Modules - Web ...................... SKIPPED
[INFO] AriesTrader :: Modules - Beans .................... SKIPPED
[INFO] AriesTrader :: Modules - Entities ................. SKIPPED
[INFO] AriesTrader :: Modules - Derby DataSource ......... SKIPPED
[INFO] AriesTrader :: Modules - Persist JDBC ............. SKIPPED
[INFO] AriesTrader :: Modules - Persist JPA App Managed .. SKIPPED
[INFO] AriesTrader :: Modules - Persist JPA Container Managed  SKIPPED
[INFO] AriesTrader :: Assemblies ......................... SKIPPED
[INFO] AriesTrader :: Assemblies - EBA - JDBC ............ SKIPPED
[INFO] AriesTrader :: Assemblies - EBA - ALL ............. SKIPPED
[INFO] Equinox test harness that can be used to install sample EBAs  SKIPPED
[INFO] Apache Aries Blueprint samples .................... SKIPPED
[INFO] Apache Aries Blueprint HelloWorld ................. SKIPPED
[INFO] Apache Aries Blueprint HelloWorld API ............. SKIPPED
[INFO] Apache Aries Blueprint HelloWorldServer ........... SKIPPED
[INFO] Apache Aries Blueprint HelloWorldClient ........... SKIPPED
[INFO] Apache Aries Blueprint HelloWorld Assembly ........ SKIPPED
[INFO] Apache Aries Blueprint HelloWorld EBA ............. SKIPPED
[INFO] Apache Aries Blueprint sample iTests .............. SKIPPED
[INFO] Apache Aries Blueprint Sample - ID Verifier ....... SKIPPED
[INFO] Apache Aries Blueprint Sample - ID Verifier API ... SKIPPED
[INFO] Apache Aries Blueprint Sample - ID Verifier Server  SKIPPED
[INFO] Apache Aries Blueprint Sample - ID Verifier Client  SKIPPED
[INFO] Apache Aries Blueprint Sample - ID Verifier Assembly  SKIPPED
[INFO] Apache Aries Twitter sample ....................... SKIPPED
[INFO] Apache Aries Bundlise Twitter4j ................... SKIPPED
[INFO] Apache Aries Twitter bundle ....................... SKIPPED
[INFO] Apache Aries Twitter EBA .......................... SKIPPED
[INFO] Apache Aries Twitter sample integration tests ..... SKIPPED
[INFO] Apache Aries ...................................... SKIPPED
[INFO] ------------------------------------------------------------------------
[INFO] BUILD FAILURE
[INFO] ------------------------------------------------------------------------
[INFO] Total time: 2:17.589s
[INFO] Finished at: Fri Jul 11 15:40:57 UTC 2014
[INFO] Final Memory: 131M/623M
[INFO] ------------------------------------------------------------------------
[ERROR] Failed to execute goal on project org.apache.aries.spifly.weaver-internal: Could not
resolve dependencies for project org.apache.aries.spifly:org.apache.aries.spifly.weaver-internal:jar:1.0.2-SNAPSHOT:
Could not find artifact org.apache.aries.spifly:org.apache.aries.spifly.core-internal:jar:1.0.1
in EclipseLink Repo (http://download.eclipse.org/rt/eclipselink/maven.repo/) -> [Help 1]
org.apache.maven.lifecycle.LifecycleExecutionException: Failed to execute goal on project
org.apache.aries.spifly.weaver-internal: Could not resolve dependencies for project org.apache.aries.spifly:org.apache.aries.spifly.weaver-internal:jar:1.0.2-SNAPSHOT:
Could not find artifact org.apache.aries.spifly:org.apache.aries.spifly.core-internal:jar:1.0.1
in EclipseLink Repo (http://download.eclipse.org/rt/eclipselink/maven.repo/)
	at org.apache.maven.lifecycle.internal.LifecycleDependencyResolver.getDependencies(LifecycleDependencyResolver.java:196)
	at org.apache.maven.lifecycle.internal.LifecycleDependencyResolver.resolveProjectDependencies(LifecycleDependencyResolver.java:108)
	at org.apache.maven.lifecycle.internal.MojoExecutor.ensureDependenciesAreResolved(MojoExecutor.java:258)
	at org.apache.maven.lifecycle.internal.MojoExecutor.execute(MojoExecutor.java:201)
	at org.apache.maven.lifecycle.internal.MojoExecutor.execute(MojoExecutor.java:153)
	at org.apache.maven.lifecycle.internal.MojoExecutor.execute(MojoExecutor.java:145)
	at org.apache.maven.lifecycle.internal.LifecycleModuleBuilder.buildProject(LifecycleModuleBuilder.java:84)
	at org.apache.maven.lifecycle.internal.LifecycleModuleBuilder.buildProject(LifecycleModuleBuilder.java:59)
	at org.apache.maven.lifecycle.internal.LifecycleStarter.singleThreadedBuild(LifecycleStarter.java:183)
	at org.apache.maven.lifecycle.internal.LifecycleStarter.execute(LifecycleStarter.java:161)
	at org.apache.maven.DefaultMaven.doExecute(DefaultMaven.java:319)
	at org.apache.maven.DefaultMaven.execute(DefaultMaven.java:156)
	at org.apache.maven.cli.MavenCli.execute(MavenCli.java:537)
	at org.apache.maven.cli.MavenCli.doMain(MavenCli.java:196)
	at org.apache.maven.cli.MavenCli.main(MavenCli.java:141)
	at sun.reflect.NativeMethodAccessorImpl.invoke0(Native Method)
	at sun.reflect.NativeMethodAccessorImpl.invoke(NativeMethodAccessorImpl.java:57)
	at sun.reflect.DelegatingMethodAccessorImpl.invoke(DelegatingMethodAccessorImpl.java:43)
	at java.lang.reflect.Method.invoke(Method.java:606)
	at org.codehaus.plexus.classworlds.launcher.Launcher.launchEnhanced(Launcher.java:290)
	at org.codehaus.plexus.classworlds.launcher.Launcher.launch(Launcher.java:230)
	at org.codehaus.plexus.classworlds.launcher.Launcher.mainWithExitCode(Launcher.java:409)
	at org.codehaus.plexus.classworlds.launcher.Launcher.main(Launcher.java:352)
Caused by: org.apache.maven.project.DependencyResolutionException: Could not resolve dependencies
for project org.apache.aries.spifly:org.apache.aries.spifly.weaver-internal:jar:1.0.2-SNAPSHOT:
Could not find artifact org.apache.aries.spifly:org.apache.aries.spifly.core-internal:jar:1.0.1
in EclipseLink Repo (http://download.eclipse.org/rt/eclipselink/maven.repo/)
	at org.apache.maven.project.DefaultProjectDependenciesResolver.resolve(DefaultProjectDependenciesResolver.java:170)
	at org.apache.maven.lifecycle.internal.LifecycleDependencyResolver.getDependencies(LifecycleDependencyResolver.java:171)
	... 22 more
Caused by: org.sonatype.aether.resolution.DependencyResolutionException: Could not find artifact
org.apache.aries.spifly:org.apache.aries.spifly.core-internal:jar:1.0.1 in EclipseLink Repo
(http://download.eclipse.org/rt/eclipselink/maven.repo/)
	at org.sonatype.aether.impl.internal.DefaultRepositorySystem.resolveDependencies(DefaultRepositorySystem.java:412)
	at org.apache.maven.project.DefaultProjectDependenciesResolver.resolve(DefaultProjectDependenciesResolver.java:164)
	... 23 more
Caused by: org.sonatype.aether.resolution.ArtifactResolutionException: Could not find artifact
org.apache.aries.spifly:org.apache.aries.spifly.core-internal:jar:1.0.1 in EclipseLink Repo
(http://download.eclipse.org/rt/eclipselink/maven.repo/)
	at org.sonatype.aether.impl.internal.DefaultArtifactResolver.resolve(DefaultArtifactResolver.java:541)
	at org.sonatype.aether.impl.internal.DefaultArtifactResolver.resolveArtifacts(DefaultArtifactResolver.java:220)
	at org.sonatype.aether.impl.internal.DefaultRepositorySystem.resolveDependencies(DefaultRepositorySystem.java:395)
	... 24 more
Caused by: org.sonatype.aether.transfer.ArtifactNotFoundException: Could not find artifact
org.apache.aries.spifly:org.apache.aries.spifly.core-internal:jar:1.0.1 in EclipseLink Repo
(http://download.eclipse.org/rt/eclipselink/maven.repo/)
	at org.sonatype.aether.connector.wagon.WagonRepositoryConnector$4.wrap(WagonRepositoryConnector.java:945)
	at org.sonatype.aether.connector.wagon.WagonRepositoryConnector$4.wrap(WagonRepositoryConnector.java:940)
	at org.sonatype.aether.connector.wagon.WagonRepositoryConnector$GetTask.flush(WagonRepositoryConnector.java:695)
	at org.sonatype.aether.connector.wagon.WagonRepositoryConnector$GetTask.flush(WagonRepositoryConnector.java:689)
	at org.sonatype.aether.connector.wagon.WagonRepositoryConnector.get(WagonRepositoryConnector.java:445)
	at org.sonatype.aether.impl.internal.DefaultArtifactResolver.resolve(DefaultArtifactResolver.java:460)
	... 26 more
[ERROR] 
[ERROR] Re-run Maven using the -X switch to enable full debug logging.
[ERROR] 
[ERROR] For more information about the errors and possible solutions, please read the following
articles:
[ERROR] [Help 1] http://cwiki.apache.org/confluence/display/MAVEN/DependencyResolutionException
[ERROR] 
[ERROR] After correcting the problems, you can resume the build with the command
[ERROR]   mvn <goals> -rf :org.apache.aries.spifly.weaver-internal
Build step 'Invoke top-level Maven targets' marked build as failure

Mime
View raw message