aries-dev mailing list archives

Site index · List index
Message view « Date » · « Thread »
Top « Date » · « Thread »
From Apache Jenkins Server <jenk...@builds.apache.org>
Subject Build failed in Jenkins: Aries-Tx-Control-Trunk-JDK8 #34
Date Fri, 22 Jul 2016 17:21:54 GMT
See <https://builds.apache.org/job/Aries-Tx-Control-Trunk-JDK8/34/changes>

Changes:

[timothyjward] [ARIES-1585] Add tests for JDBC connection cleanup, and fix the leaks!

[timothyjward] [tx-control] Register the recovery service before the ResourceProvider so that
recovery is always available before someone uses the service

------------------------------------------
[...truncated 21389 lines...]
	at org.junit.runner.JUnitCore.run(JUnitCore.java:115)
	at org.ops4j.pax.exam.invoker.junit.internal.JUnitProbeInvoker.invokeViaJUnit(JUnitProbeInvoker.java:124)
	at org.ops4j.pax.exam.invoker.junit.internal.JUnitProbeInvoker.findAndInvoke(JUnitProbeInvoker.java:97)
	at org.ops4j.pax.exam.invoker.junit.internal.JUnitProbeInvoker.call(JUnitProbeInvoker.java:73)
	at sun.reflect.NativeMethodAccessorImpl.invoke0(Native Method)
	at sun.reflect.NativeMethodAccessorImpl.invoke(NativeMethodAccessorImpl.java:62)
	at sun.reflect.DelegatingMethodAccessorImpl.invoke(DelegatingMethodAccessorImpl.java:43)
	at java.lang.reflect.Method.invoke(Method.java:498)
	at org.ops4j.pax.swissbox.framework.RemoteFrameworkImpl.invokeMethodOnService(RemoteFrameworkImpl.java:433)
	at org.ops4j.pax.swissbox.framework.RemoteFrameworkImpl.invokeMethodOnService(RemoteFrameworkImpl.java:406)
	at sun.reflect.NativeMethodAccessorImpl.invoke0(Native Method)
	at sun.reflect.NativeMethodAccessorImpl.invoke(NativeMethodAccessorImpl.java:62)
	at sun.reflect.DelegatingMethodAccessorImpl.invoke(DelegatingMethodAccessorImpl.java:43)
	at java.lang.reflect.Method.invoke(Method.java:498)
	at sun.rmi.server.UnicastServerRef.dispatch(UnicastServerRef.java:323)
	at sun.rmi.transport.Transport$1.run(Transport.java:200)
	at sun.rmi.transport.Transport$1.run(Transport.java:197)
	at java.security.AccessController.doPrivileged(Native Method)
	at sun.rmi.transport.Transport.serviceCall(Transport.java:196)
	at sun.rmi.transport.tcp.TCPTransport.handleMessages(TCPTransport.java:568)
	at sun.rmi.transport.tcp.TCPTransport$ConnectionHandler.run0(TCPTransport.java:826)
	at sun.rmi.transport.tcp.TCPTransport$ConnectionHandler.lambda$run$0(TCPTransport.java:683)
	at java.security.AccessController.doPrivileged(Native Method)
	at sun.rmi.transport.tcp.TCPTransport$ConnectionHandler.run(TCPTransport.java:682)
	at java.util.concurrent.ThreadPoolExecutor.runWorker(ThreadPoolExecutor.java:1142)
	at java.util.concurrent.ThreadPoolExecutor$Worker.run(ThreadPoolExecutor.java:617)
	at java.lang.Thread.run(Thread.java:745)

testNestedTxInnerRollback:org.apache.aries.tx.control.itests.SimpleEclipseLink_2_6_0_Test.testNestedTxInnerRollback:Forked:FrameworkFactory[1](org.apache.aries.tx.control.itests.SimpleEclipseLink_2_6_0_Test)
 Time elapsed: 5.262 sec  <<< ERROR!
java.util.NoSuchElementException: org.osgi.service.transaction.control.jpa.JPAEntityManagerProvider
	at org.apache.aries.tx.control.itests.AbstractJPATransactionTest.getService(AbstractJPATransactionTest.java:117)
	at org.apache.aries.tx.control.itests.AbstractJPATransactionTest.getService(AbstractJPATransactionTest.java:97)
	at org.apache.aries.tx.control.itests.AbstractJPATransactionTest.configuredEntityManager(AbstractJPATransactionTest.java:162)
	at org.apache.aries.tx.control.itests.AbstractJPATransactionTest.setUp(AbstractJPATransactionTest.java:92)
	at sun.reflect.NativeMethodAccessorImpl.invoke0(Native Method)
	at sun.reflect.NativeMethodAccessorImpl.invoke(NativeMethodAccessorImpl.java:62)
	at sun.reflect.DelegatingMethodAccessorImpl.invoke(DelegatingMethodAccessorImpl.java:43)
	at java.lang.reflect.Method.invoke(Method.java:498)
	at org.junit.runners.model.FrameworkMethod$1.runReflectiveCall(FrameworkMethod.java:50)
	at org.junit.internal.runners.model.ReflectiveCallable.run(ReflectiveCallable.java:12)
	at org.junit.runners.model.FrameworkMethod.invokeExplosively(FrameworkMethod.java:47)
	at org.junit.internal.runners.statements.RunBefores.evaluate(RunBefores.java:24)
	at org.junit.internal.runners.statements.RunAfters.evaluate(RunAfters.java:27)
	at org.junit.runners.ParentRunner.runLeaf(ParentRunner.java:325)
	at org.junit.runners.BlockJUnit4ClassRunner.runChild(BlockJUnit4ClassRunner.java:78)
	at org.ops4j.pax.exam.invoker.junit.internal.ContainerTestRunner.runChild(ContainerTestRunner.java:68)
	at org.ops4j.pax.exam.invoker.junit.internal.ContainerTestRunner.runChild(ContainerTestRunner.java:37)
	at org.junit.runners.ParentRunner$3.run(ParentRunner.java:290)
	at org.junit.runners.ParentRunner$1.schedule(ParentRunner.java:71)
	at org.junit.runners.ParentRunner.runChildren(ParentRunner.java:288)
	at org.junit.runners.ParentRunner.access$000(ParentRunner.java:58)
	at org.junit.runners.ParentRunner$2.evaluate(ParentRunner.java:268)
	at org.junit.runners.ParentRunner.run(ParentRunner.java:363)
	at org.junit.runner.JUnitCore.run(JUnitCore.java:137)
	at org.junit.runner.JUnitCore.run(JUnitCore.java:115)
	at org.ops4j.pax.exam.invoker.junit.internal.JUnitProbeInvoker.invokeViaJUnit(JUnitProbeInvoker.java:124)
	at org.ops4j.pax.exam.invoker.junit.internal.JUnitProbeInvoker.findAndInvoke(JUnitProbeInvoker.java:97)
	at org.ops4j.pax.exam.invoker.junit.internal.JUnitProbeInvoker.call(JUnitProbeInvoker.java:73)
	at sun.reflect.NativeMethodAccessorImpl.invoke0(Native Method)
	at sun.reflect.NativeMethodAccessorImpl.invoke(NativeMethodAccessorImpl.java:62)
	at sun.reflect.DelegatingMethodAccessorImpl.invoke(DelegatingMethodAccessorImpl.java:43)
	at java.lang.reflect.Method.invoke(Method.java:498)
	at org.ops4j.pax.swissbox.framework.RemoteFrameworkImpl.invokeMethodOnService(RemoteFrameworkImpl.java:433)
	at org.ops4j.pax.swissbox.framework.RemoteFrameworkImpl.invokeMethodOnService(RemoteFrameworkImpl.java:406)
	at sun.reflect.NativeMethodAccessorImpl.invoke0(Native Method)
	at sun.reflect.NativeMethodAccessorImpl.invoke(NativeMethodAccessorImpl.java:62)
	at sun.reflect.DelegatingMethodAccessorImpl.invoke(DelegatingMethodAccessorImpl.java:43)
	at java.lang.reflect.Method.invoke(Method.java:498)
	at sun.rmi.server.UnicastServerRef.dispatch(UnicastServerRef.java:323)
	at sun.rmi.transport.Transport$1.run(Transport.java:200)
	at sun.rmi.transport.Transport$1.run(Transport.java:197)
	at java.security.AccessController.doPrivileged(Native Method)
	at sun.rmi.transport.Transport.serviceCall(Transport.java:196)
	at sun.rmi.transport.tcp.TCPTransport.handleMessages(TCPTransport.java:568)
	at sun.rmi.transport.tcp.TCPTransport$ConnectionHandler.run0(TCPTransport.java:826)
	at sun.rmi.transport.tcp.TCPTransport$ConnectionHandler.lambda$run$0(TCPTransport.java:683)
	at java.security.AccessController.doPrivileged(Native Method)
	at sun.rmi.transport.tcp.TCPTransport$ConnectionHandler.run(TCPTransport.java:682)
	at java.util.concurrent.ThreadPoolExecutor.runWorker(ThreadPoolExecutor.java:1142)
	at java.util.concurrent.ThreadPoolExecutor$Worker.run(ThreadPoolExecutor.java:617)
	at java.lang.Thread.run(Thread.java:745)

testNestedTx:org.apache.aries.tx.control.itests.SimpleEclipseLink_2_6_0_Test.testNestedTx:Forked:FrameworkFactory[1](org.apache.aries.tx.control.itests.SimpleEclipseLink_2_6_0_Test)
 Time elapsed: 5.269 sec  <<< ERROR!
java.util.NoSuchElementException: org.osgi.service.transaction.control.jpa.JPAEntityManagerProvider
	at org.apache.aries.tx.control.itests.AbstractJPATransactionTest.getService(AbstractJPATransactionTest.java:117)
	at org.apache.aries.tx.control.itests.AbstractJPATransactionTest.getService(AbstractJPATransactionTest.java:97)
	at org.apache.aries.tx.control.itests.AbstractJPATransactionTest.configuredEntityManager(AbstractJPATransactionTest.java:162)
	at org.apache.aries.tx.control.itests.AbstractJPATransactionTest.setUp(AbstractJPATransactionTest.java:92)
	at sun.reflect.NativeMethodAccessorImpl.invoke0(Native Method)
	at sun.reflect.NativeMethodAccessorImpl.invoke(NativeMethodAccessorImpl.java:62)
	at sun.reflect.DelegatingMethodAccessorImpl.invoke(DelegatingMethodAccessorImpl.java:43)
	at java.lang.reflect.Method.invoke(Method.java:498)
	at org.junit.runners.model.FrameworkMethod$1.runReflectiveCall(FrameworkMethod.java:50)
	at org.junit.internal.runners.model.ReflectiveCallable.run(ReflectiveCallable.java:12)
	at org.junit.runners.model.FrameworkMethod.invokeExplosively(FrameworkMethod.java:47)
	at org.junit.internal.runners.statements.RunBefores.evaluate(RunBefores.java:24)
	at org.junit.internal.runners.statements.RunAfters.evaluate(RunAfters.java:27)
	at org.junit.runners.ParentRunner.runLeaf(ParentRunner.java:325)
	at org.junit.runners.BlockJUnit4ClassRunner.runChild(BlockJUnit4ClassRunner.java:78)
	at org.ops4j.pax.exam.invoker.junit.internal.ContainerTestRunner.runChild(ContainerTestRunner.java:68)
	at org.ops4j.pax.exam.invoker.junit.internal.ContainerTestRunner.runChild(ContainerTestRunner.java:37)
	at org.junit.runners.ParentRunner$3.run(ParentRunner.java:290)
	at org.junit.runners.ParentRunner$1.schedule(ParentRunner.java:71)
	at org.junit.runners.ParentRunner.runChildren(ParentRunner.java:288)
	at org.junit.runners.ParentRunner.access$000(ParentRunner.java:58)
	at org.junit.runners.ParentRunner$2.evaluate(ParentRunner.java:268)
	at org.junit.runners.ParentRunner.run(ParentRunner.java:363)
	at org.junit.runner.JUnitCore.run(JUnitCore.java:137)
	at org.junit.runner.JUnitCore.run(JUnitCore.java:115)
	at org.ops4j.pax.exam.invoker.junit.internal.JUnitProbeInvoker.invokeViaJUnit(JUnitProbeInvoker.java:124)
	at org.ops4j.pax.exam.invoker.junit.internal.JUnitProbeInvoker.findAndInvoke(JUnitProbeInvoker.java:97)
	at org.ops4j.pax.exam.invoker.junit.internal.JUnitProbeInvoker.call(JUnitProbeInvoker.java:73)
	at sun.reflect.NativeMethodAccessorImpl.invoke0(Native Method)
	at sun.reflect.NativeMethodAccessorImpl.invoke(NativeMethodAccessorImpl.java:62)
	at sun.reflect.DelegatingMethodAccessorImpl.invoke(DelegatingMethodAccessorImpl.java:43)
	at java.lang.reflect.Method.invoke(Method.java:498)
	at org.ops4j.pax.swissbox.framework.RemoteFrameworkImpl.invokeMethodOnService(RemoteFrameworkImpl.java:433)
	at org.ops4j.pax.swissbox.framework.RemoteFrameworkImpl.invokeMethodOnService(RemoteFrameworkImpl.java:406)
	at sun.reflect.NativeMethodAccessorImpl.invoke0(Native Method)
	at sun.reflect.NativeMethodAccessorImpl.invoke(NativeMethodAccessorImpl.java:62)
	at sun.reflect.DelegatingMethodAccessorImpl.invoke(DelegatingMethodAccessorImpl.java:43)
	at java.lang.reflect.Method.invoke(Method.java:498)
	at sun.rmi.server.UnicastServerRef.dispatch(UnicastServerRef.java:323)
	at sun.rmi.transport.Transport$1.run(Transport.java:200)
	at sun.rmi.transport.Transport$1.run(Transport.java:197)
	at java.security.AccessController.doPrivileged(Native Method)
	at sun.rmi.transport.Transport.serviceCall(Transport.java:196)
	at sun.rmi.transport.tcp.TCPTransport.handleMessages(TCPTransport.java:568)
	at sun.rmi.transport.tcp.TCPTransport$ConnectionHandler.run0(TCPTransport.java:826)
	at sun.rmi.transport.tcp.TCPTransport$ConnectionHandler.lambda$run$0(TCPTransport.java:683)
	at java.security.AccessController.doPrivileged(Native Method)
	at sun.rmi.transport.tcp.TCPTransport$ConnectionHandler.run(TCPTransport.java:682)
	at java.util.concurrent.ThreadPoolExecutor.runWorker(ThreadPoolExecutor.java:1142)
	at java.util.concurrent.ThreadPoolExecutor$Worker.run(ThreadPoolExecutor.java:617)
	at java.lang.Thread.run(Thread.java:745)


Results :

Tests in error: 
  SimpleEclipseLink_2_6_0_Test>AbstractJPATransactionTest.setUp:92->AbstractJPATransactionTest.configuredEntityManager:162->AbstractJPATransactionTest.getService:97->AbstractJPATransactionTest.getService:117
» NoSuchElement
  SimpleEclipseLink_2_6_0_Test>AbstractJPATransactionTest.setUp:92->AbstractJPATransactionTest.configuredEntityManager:162->AbstractJPATransactionTest.getService:97->AbstractJPATransactionTest.getService:117
» NoSuchElement
  SimpleEclipseLink_2_6_0_Test>AbstractJPATransactionTest.setUp:92->AbstractJPATransactionTest.configuredEntityManager:162->AbstractJPATransactionTest.getService:97->AbstractJPATransactionTest.getService:117
» NoSuchElement
  SimpleEclipseLink_2_6_0_Test>AbstractJPATransactionTest.setUp:92->AbstractJPATransactionTest.configuredEntityManager:162->AbstractJPATransactionTest.getService:97->AbstractJPATransactionTest.getService:117
» NoSuchElement
  SimpleEclipseLink_2_6_0_Test>AbstractJPATransactionTest.setUp:92->AbstractJPATransactionTest.configuredEntityManager:162->AbstractJPATransactionTest.getService:97->AbstractJPATransactionTest.getService:117
» NoSuchElement
  SimpleEclipseLink_2_6_0_Test>AbstractJPATransactionTest.setUp:92->AbstractJPATransactionTest.configuredEntityManager:162->AbstractJPATransactionTest.getService:97->AbstractJPATransactionTest.getService:117
» NoSuchElement
  SimpleEclipseLink_2_6_0_Test>AbstractJPATransactionTest.setUp:92->AbstractJPATransactionTest.configuredEntityManager:162->AbstractJPATransactionTest.getService:97->AbstractJPATransactionTest.getService:117
» NoSuchElement
  SimpleHibernate_5_0_9_Test>AbstractJPATransactionTest.setUp:92->AbstractJPATransactionTest.configuredEntityManager:162->AbstractJPATransactionTest.getService:97->AbstractJPATransactionTest.getService:117
» NoSuchElement
  SimpleHibernate_5_0_9_Test>AbstractJPATransactionTest.setUp:92->AbstractJPATransactionTest.configuredEntityManager:162->AbstractJPATransactionTest.getService:97->AbstractJPATransactionTest.getService:117
» NoSuchElement
  SimpleHibernate_5_0_9_Test>AbstractJPATransactionTest.setUp:92->AbstractJPATransactionTest.configuredEntityManager:162->AbstractJPATransactionTest.getService:97->AbstractJPATransactionTest.getService:117
» NoSuchElement
  SimpleHibernate_5_0_9_Test>AbstractJPATransactionTest.setUp:92->AbstractJPATransactionTest.configuredEntityManager:162->AbstractJPATransactionTest.getService:97->AbstractJPATransactionTest.getService:117
» NoSuchElement
  SimpleHibernate_5_0_9_Test>AbstractJPATransactionTest.setUp:92->AbstractJPATransactionTest.configuredEntityManager:162->AbstractJPATransactionTest.getService:97->AbstractJPATransactionTest.getService:117
» NoSuchElement
  SimpleHibernate_5_0_9_Test>AbstractJPATransactionTest.setUp:92->AbstractJPATransactionTest.configuredEntityManager:162->AbstractJPATransactionTest.getService:97->AbstractJPATransactionTest.getService:117
» NoSuchElement
  SimpleHibernate_5_0_9_Test>AbstractJPATransactionTest.setUp:92->AbstractJPATransactionTest.configuredEntityManager:162->AbstractJPATransactionTest.getService:97->AbstractJPATransactionTest.getService:117
» NoSuchElement
  SimpleOpenJPA_2_4_1_Test>AbstractJPATransactionTest.setUp:92->AbstractJPATransactionTest.configuredEntityManager:162->AbstractJPATransactionTest.getService:97->AbstractJPATransactionTest.getService:117
» NoSuchElement
  SimpleOpenJPA_2_4_1_Test>AbstractJPATransactionTest.setUp:92->AbstractJPATransactionTest.configuredEntityManager:162->AbstractJPATransactionTest.getService:97->AbstractJPATransactionTest.getService:117
» NoSuchElement
  SimpleOpenJPA_2_4_1_Test>AbstractJPATransactionTest.setUp:92->AbstractJPATransactionTest.configuredEntityManager:162->AbstractJPATransactionTest.getService:97->AbstractJPATransactionTest.getService:117
» NoSuchElement
  SimpleOpenJPA_2_4_1_Test>AbstractJPATransactionTest.setUp:92->AbstractJPATransactionTest.configuredEntityManager:162->AbstractJPATransactionTest.getService:97->AbstractJPATransactionTest.getService:117
» NoSuchElement
  SimpleOpenJPA_2_4_1_Test>AbstractJPATransactionTest.setUp:92->AbstractJPATransactionTest.configuredEntityManager:162->AbstractJPATransactionTest.getService:97->AbstractJPATransactionTest.getService:117
» NoSuchElement
  SimpleOpenJPA_2_4_1_Test>AbstractJPATransactionTest.setUp:92->AbstractJPATransactionTest.configuredEntityManager:162->AbstractJPATransactionTest.getService:97->AbstractJPATransactionTest.getService:117
» NoSuchElement
  SimpleOpenJPA_2_4_1_Test>AbstractJPATransactionTest.setUp:92->AbstractJPATransactionTest.configuredEntityManager:162->AbstractJPATransactionTest.getService:97->AbstractJPATransactionTest.getService:117
» NoSuchElement
  XAEclipseLink_2_6_0_Test.testTwoPhaseCommit » ClassNotFound javax.persistence....
  XAEclipseLink_2_6_0_Test.testTwoPhaseRollback » ClassNotFound javax.persistenc...
  XAHibernate_5_0_9_Test.org.apache.aries.tx.control.itests.XAHibernate_5_0_9_Test » TestContainer
  XAOpenJPA_2_4_1_Test.testTwoPhaseCommit » ClassNotFound javax.persistence.crit...
  XAOpenJPA_2_4_1_Test.testTwoPhaseRollback » ClassNotFound javax.persistence.cr...

Tests run: 47, Failures: 0, Errors: 26, Skipped: 0

[INFO] ------------------------------------------------------------------------
[INFO] Reactor Summary:
[INFO] 
[INFO] tx-control ......................................... SUCCESS [  5.113 s]
[INFO] OSGi Transaction Control API ....................... SUCCESS [  3.473 s]
[INFO] OSGi Transaction Control Service - Common Code ..... SUCCESS [  1.567 s]
[INFO] OSGi Transaction Control Service - Local Transactions SUCCESS [  1.685 s]
[INFO] OSGi Transaction Control Service - XA Transactions . SUCCESS [  6.061 s]
[INFO] OSGi Transaction Control JDBC Resource Provider - Common Code SUCCESS [  1.104 s]
[INFO] OSGi Transaction Control JDBC Resource Provider - Local Transactions SUCCESS [  1.587
s]
[INFO] OSGi Transaction Control JDBC Resource Provider - XA Transactions SUCCESS [  1.647
s]
[INFO] OSGi Transaction Control JPA Resource Provider - Local Transactions SUCCESS [  1.985
s]
[INFO] OSGi Transaction Control JPA Resource Provider - XA Transactions SUCCESS [  3.492 s]
[INFO] Apache Aries Transaction Control iTests ............ SUCCESS [03:34 min]
[INFO] Apache Aries Transaction Control JPA iTests ........ FAILURE [02:45 min]
[INFO] ------------------------------------------------------------------------
[INFO] BUILD FAILURE
[INFO] ------------------------------------------------------------------------
[INFO] Total time: 06:50 min
[INFO] Finished at: 2016-07-22T17:21:58+00:00
[INFO] Final Memory: 52M/607M
[INFO] ------------------------------------------------------------------------
[ERROR] Failed to execute goal org.apache.maven.plugins:maven-surefire-plugin:2.18.1:test
(default-test) on project org.apache.aries.tx-control-jpa-itests: There are test failures.
[ERROR] 
[ERROR] Please refer to <https://builds.apache.org/job/Aries-Tx-Control-Trunk-JDK8/ws/tx-control-jpa-itests/target/surefire-reports>
for the individual test results.
[ERROR] -> [Help 1]
org.apache.maven.lifecycle.LifecycleExecutionException: Failed to execute goal org.apache.maven.plugins:maven-surefire-plugin:2.18.1:test
(default-test) on project org.apache.aries.tx-control-jpa-itests: There are test failures.

Please refer to <https://builds.apache.org/job/Aries-Tx-Control-Trunk-JDK8/ws/tx-control-jpa-itests/target/surefire-reports>
for the individual test results.
	at org.apache.maven.lifecycle.internal.MojoExecutor.execute(MojoExecutor.java:212)
	at org.apache.maven.lifecycle.internal.MojoExecutor.execute(MojoExecutor.java:153)
	at org.apache.maven.lifecycle.internal.MojoExecutor.execute(MojoExecutor.java:145)
	at org.apache.maven.lifecycle.internal.LifecycleModuleBuilder.buildProject(LifecycleModuleBuilder.java:116)
	at org.apache.maven.lifecycle.internal.LifecycleModuleBuilder.buildProject(LifecycleModuleBuilder.java:80)
	at org.apache.maven.lifecycle.internal.builder.singlethreaded.SingleThreadedBuilder.build(SingleThreadedBuilder.java:51)
	at org.apache.maven.lifecycle.internal.LifecycleStarter.execute(LifecycleStarter.java:120)
	at org.apache.maven.DefaultMaven.doExecute(DefaultMaven.java:355)
	at org.apache.maven.DefaultMaven.execute(DefaultMaven.java:155)
	at org.jvnet.hudson.maven3.launcher.Maven32Launcher.main(Maven32Launcher.java:132)
	at sun.reflect.NativeMethodAccessorImpl.invoke0(Native Method)
	at sun.reflect.NativeMethodAccessorImpl.invoke(NativeMethodAccessorImpl.java:62)
	at sun.reflect.DelegatingMethodAccessorImpl.invoke(DelegatingMethodAccessorImpl.java:43)
	at java.lang.reflect.Method.invoke(Method.java:498)
	at org.codehaus.plexus.classworlds.launcher.Launcher.launchStandard(Launcher.java:330)
	at org.codehaus.plexus.classworlds.launcher.Launcher.launch(Launcher.java:238)
	at jenkins.maven3.agent.Maven32Main.launch(Maven32Main.java:186)
	at sun.reflect.NativeMethodAccessorImpl.invoke0(Native Method)
	at sun.reflect.NativeMethodAccessorImpl.invoke(NativeMethodAccessorImpl.java:62)
	at sun.reflect.DelegatingMethodAccessorImpl.invoke(DelegatingMethodAccessorImpl.java:43)
	at java.lang.reflect.Method.invoke(Method.java:498)
	at hudson.maven.Maven3Builder.call(Maven3Builder.java:136)
	at hudson.maven.Maven3Builder.call(Maven3Builder.java:71)
	at hudson.remoting.UserRequest.perform(UserRequest.java:120)
	at hudson.remoting.UserRequest.perform(UserRequest.java:48)
	at hudson.remoting.Request$2.run(Request.java:326)
	at hudson.remoting.InterceptingExecutorService$1.call(InterceptingExecutorService.java:68)
	at java.util.concurrent.FutureTask.run(FutureTask.java:266)
	at java.util.concurrent.ThreadPoolExecutor.runWorker(ThreadPoolExecutor.java:1142)
	at java.util.concurrent.ThreadPoolExecutor$Worker.run(ThreadPoolExecutor.java:617)
	at java.lang.Thread.run(Thread.java:745)
Caused by: org.apache.maven.plugin.MojoFailureException: There are test failures.

Please refer to <https://builds.apache.org/job/Aries-Tx-Control-Trunk-JDK8/ws/tx-control-jpa-itests/target/surefire-reports>
for the individual test results.
	at org.apache.maven.plugin.surefire.SurefireHelper.reportExecution(SurefireHelper.java:82)
	at org.apache.maven.plugin.surefire.SurefirePlugin.handleSummary(SurefirePlugin.java:254)
	at org.apache.maven.plugin.surefire.AbstractSurefireMojo.executeAfterPreconditionsChecked(AbstractSurefireMojo.java:854)
	at org.apache.maven.plugin.surefire.AbstractSurefireMojo.execute(AbstractSurefireMojo.java:722)
	at org.apache.maven.plugin.DefaultBuildPluginManager.executeMojo(DefaultBuildPluginManager.java:132)
	at org.apache.maven.lifecycle.internal.MojoExecutor.execute(MojoExecutor.java:208)
	... 30 more
[ERROR] 
[ERROR] Re-run Maven using the -X switch to enable full debug logging.
[ERROR] 
[ERROR] For more information about the errors and possible solutions, please read the following
articles:
[ERROR] [Help 1] http://cwiki.apache.org/confluence/display/MAVEN/MojoFailureException
[ERROR] 
[ERROR] After correcting the problems, you can resume the build with the command
[ERROR]   mvn <goals> -rf :org.apache.aries.tx-control-jpa-itests
[JENKINS] Archiving <https://builds.apache.org/job/Aries-Tx-Control-Trunk-JDK8/ws/pom.xml>
to org.apache.aries.tx-control/tx-control/0.0.2-SNAPSHOT/tx-control-0.0.2-SNAPSHOT.pom
channel stopped

Mime
View raw message