aries-dev mailing list archives

Site index · List index
Message view « Date » · « Thread »
Top « Date » · « Thread »
From Apache Jenkins Server <jenk...@builds.apache.org>
Subject Build failed in Jenkins: Aries-Tx-Control-Trunk-JDK8 #65
Date Mon, 30 Apr 2018 12:23:17 GMT
See <https://builds.apache.org/job/Aries-Tx-Control-Trunk-JDK8/65/display/redirect?page=changes>

Changes:

[timothyjward] Move to using the released version of Aries JPA 2.7.0

------------------------------------------
[...truncated 2.48 MB...]
   ExecuteQuery - query to get number of active connections after Db server has restarted
   ExecuteQuery - query to get number of active connections after Db server has restarted
   ExecuteQuery - query to get number of active connections after Db server has restarted
testConnectionTestQuery() - Waiting while queries are run
   ExecuteQuery - query to get number of active connections after Db server has restarted
   ExecuteQuery - query to get number of active connections after Db server has restarted
   ExecuteQuery - query to get number of active connections after Db server has restarted
   ExecuteQuery - query to get number of active connections after Db server has restarted
   ExecuteQuery - numberOfConnections after starting Db server =<5>
   ExecuteQuery - numberOfConnections after starting Db server =<5>
   ExecuteQuery - numberOfConnections after starting Db server =<5>
   ExecuteQuery - numberOfConnections after starting Db server =<5>
   ExecuteQuery - numberOfConnections after starting Db server =<5>
   ExecuteQuery - numberOfConnections after starting Db server =<5>
   ExecuteQuery - numberOfConnections after starting Db server =<5>
   ExecuteQuery - numberOfConnections after starting Db server =<5>
   ExecuteQuery - numberOfConnections after starting Db server =<5>
   ExecuteQuery - numberOfConnections after starting Db server =<5>
testConnectionTestQuery() - Execute query to get number of active connections
-------------- end testConnectionTestQuery -------------------------
[CM Configuration Updater (Delete: pid=org.apache.aries.tx.control.jdbc.xa.a66c05b1-38f5-49e4-8c96-fab784139a99)]
INFO com.zaxxer.hikari.pool.HikariPool - HikariPool-1 - Close initiated...
[CM Configuration Updater (Delete: pid=org.apache.aries.tx.control.jdbc.xa.a66c05b1-38f5-49e4-8c96-fab784139a99)]
INFO com.zaxxer.hikari.pool.HikariPool - HikariPool-1 - Closed.
12:21:35.799 [main] DEBUG org.ops4j.exec.DefaultJavaRunner - Shutdown in progress...

12:21:35.800 [main] DEBUG org.ops4j.exec.DefaultJavaRunner - Unwrapping stream I/O.
12:21:35.800 [main] INFO  org.ops4j.exec.DefaultJavaRunner - Platform has been shutdown.
12:21:35.803 [main] DEBUG org.ops4j.exec.DefaultJavaRunner - Shutdown in progress...

12:21:35.803 [main] DEBUG org.ops4j.exec.DefaultJavaRunner - Unwrapping stream I/O.
12:21:35.803 [main] INFO  org.ops4j.exec.DefaultJavaRunner - Platform has been shutdown.
12:21:35.807 [main] DEBUG org.ops4j.exec.DefaultJavaRunner - Shutdown in progress...

12:21:35.807 [main] DEBUG org.ops4j.exec.DefaultJavaRunner - Unwrapping stream I/O.
12:21:35.807 [main] INFO  org.ops4j.exec.DefaultJavaRunner - Platform has been shutdown.
12:21:35.811 [main] DEBUG org.ops4j.exec.DefaultJavaRunner - Shutdown in progress...

12:21:35.811 [main] DEBUG org.ops4j.exec.DefaultJavaRunner - Unwrapping stream I/O.
12:21:35.811 [main] INFO  org.ops4j.exec.DefaultJavaRunner - Platform has been shutdown.
12:21:35.816 [main] DEBUG org.ops4j.exec.DefaultJavaRunner - Shutdown in progress...

12:21:35.816 [main] DEBUG org.ops4j.exec.DefaultJavaRunner - Unwrapping stream I/O.
12:21:35.817 [main] INFO  org.ops4j.exec.DefaultJavaRunner - Platform has been shutdown.
12:21:35.823 [main] DEBUG org.ops4j.exec.DefaultJavaRunner - Shutdown in progress...

12:21:35.823 [main] DEBUG org.ops4j.exec.DefaultJavaRunner - Unwrapping stream I/O.
12:21:35.824 [main] INFO  org.ops4j.exec.DefaultJavaRunner - Platform has been shutdown.
12:21:35.830 [main] DEBUG org.ops4j.exec.DefaultJavaRunner - Shutdown in progress...

12:21:35.830 [main] DEBUG org.ops4j.exec.DefaultJavaRunner - Unwrapping stream I/O.
12:21:35.830 [main] INFO  org.ops4j.exec.DefaultJavaRunner - Platform has been shutdown.
12:21:35.839 [main] DEBUG org.ops4j.exec.DefaultJavaRunner - Shutdown in progress...

12:21:35.839 [main] DEBUG org.ops4j.exec.DefaultJavaRunner - Unwrapping stream I/O.
12:21:35.839 [main] INFO  org.ops4j.exec.DefaultJavaRunner - Platform has been shutdown.
12:21:35.840 [main] INFO  o.o.p.e.spi.reactors.ReactorManager - suite finished
Tests run: 8, Failures: 0, Errors: 0, Skipped: 0, Time elapsed: 24.29 sec - in org.apache.aries.tx.control.itests.ConnectionRefreshTest

Results :

Tests run: 178, Failures: 0, Errors: 0, Skipped: 0

[JENKINS] Recording test results
[INFO] 
[INFO] --- maven-jar-plugin:2.5:jar (default-jar) @ tx-control-jdbc-itests ---
[INFO] Adding existing MANIFEST to archive. Found under: <https://builds.apache.org/job/Aries-Tx-Control-Trunk-JDK8/ws/tx-control-providers/jdbc/tx-control-jdbc-itests/target/classes/META-INF/MANIFEST.MF>
[INFO] Building jar: <https://builds.apache.org/job/Aries-Tx-Control-Trunk-JDK8/ws/tx-control-providers/jdbc/tx-control-jdbc-itests/target/tx-control-jdbc-itests-1.0.0-SNAPSHOT.jar>
[INFO] 
[INFO] --- maven-site-plugin:3.4:attach-descriptor (attach-descriptor) @ tx-control-jdbc-itests
---
[INFO] 
[INFO] --- maven-install-plugin:2.5.2:install (default-install) @ tx-control-jdbc-itests ---
[INFO] Installing <https://builds.apache.org/job/Aries-Tx-Control-Trunk-JDK8/ws/tx-control-providers/jdbc/tx-control-jdbc-itests/target/tx-control-jdbc-itests-1.0.0-SNAPSHOT.jar>
to /home/jenkins/jenkins-slave/maven-repositories/0/org/apache/aries/tx-control/tx-control-jdbc-itests/1.0.0-SNAPSHOT/tx-control-jdbc-itests-1.0.0-SNAPSHOT.jar
[INFO] Installing <https://builds.apache.org/job/Aries-Tx-Control-Trunk-JDK8/ws/tx-control-providers/jdbc/tx-control-jdbc-itests/pom.xml>
to /home/jenkins/jenkins-slave/maven-repositories/0/org/apache/aries/tx-control/tx-control-jdbc-itests/1.0.0-SNAPSHOT/tx-control-jdbc-itests-1.0.0-SNAPSHOT.pom
[INFO] 
[INFO] ------------------------------------------------------------------------
[INFO] Building tx-control-provider-jdbc 1.0.0-SNAPSHOT
[INFO] ------------------------------------------------------------------------
[INFO] 
[INFO] --- maven-clean-plugin:2.5:clean (default-clean) @ tx-control-provider-jdbc ---
[INFO] 
[INFO] --- maven-remote-resources-plugin:1.5:process (default) @ tx-control-provider-jdbc
---
[INFO] 
[INFO] --- bnd-maven-plugin:3.3.0:bnd-process (default-bnd-process) @ tx-control-provider-jdbc
---
[INFO] skip project with packaging=pom
[INFO] 
[INFO] --- maven-site-plugin:3.4:attach-descriptor (attach-descriptor) @ tx-control-provider-jdbc
---
[INFO] 
[INFO] --- maven-install-plugin:2.5.2:install (default-install) @ tx-control-provider-jdbc
---
[INFO] Installing <https://builds.apache.org/job/Aries-Tx-Control-Trunk-JDK8/ws/tx-control-providers/jdbc/pom.xml>
to /home/jenkins/jenkins-slave/maven-repositories/0/org/apache/aries/tx-control/tx-control-provider-jdbc/1.0.0-SNAPSHOT/tx-control-provider-jdbc-1.0.0-SNAPSHOT.pom
[INFO] 
[INFO] ------------------------------------------------------------------------
[INFO] Building tx-control-provider-jpa-parent 1.0.0-SNAPSHOT
[INFO] ------------------------------------------------------------------------
[INFO] 
[INFO] --- maven-clean-plugin:2.5:clean (default-clean) @ tx-control-provider-jpa-parent ---
[INFO] 
[INFO] --- maven-remote-resources-plugin:1.5:process (default) @ tx-control-provider-jpa-parent
---
[INFO] 
[INFO] --- bnd-maven-plugin:3.3.0:bnd-process (default-bnd-process) @ tx-control-provider-jpa-parent
---
[INFO] skip project with packaging=pom
[INFO] 
[INFO] --- maven-site-plugin:3.4:attach-descriptor (attach-descriptor) @ tx-control-provider-jpa-parent
---
[INFO] 
[INFO] --- maven-install-plugin:2.5.2:install (default-install) @ tx-control-provider-jpa-parent
---
[INFO] Installing <https://builds.apache.org/job/Aries-Tx-Control-Trunk-JDK8/ws/tx-control-providers/jpa/tx-control-provider-jpa-parent/pom.xml>
to /home/jenkins/jenkins-slave/maven-repositories/0/org/apache/aries/tx-control/tx-control-provider-jpa-parent/1.0.0-SNAPSHOT/tx-control-provider-jpa-parent-1.0.0-SNAPSHOT.pom
[INFO] 
[INFO] ------------------------------------------------------------------------
[INFO] Building OSGi Transaction Control JPA Resource Provider - Common Code 1.0.0-SNAPSHOT
[INFO] ------------------------------------------------------------------------
[INFO] Downloading: https://repo.maven.apache.org/maven2/org/osgi/org.osgi.service.jpa/1.1.0/org.osgi.service.jpa-1.1.0.pom
[INFO] Downloaded: https://repo.maven.apache.org/maven2/org/osgi/org.osgi.service.jpa/1.1.0/org.osgi.service.jpa-1.1.0.pom
(1.4 kB at 16 kB/s)
[INFO] Downloading: https://repo.maven.apache.org/maven2/org/apache/aries/jpa/javax/persistence/javax.persistence_2.1/2.7.0/javax.persistence_2.1-2.7.0.pom
[WARNING] The POM for org.apache.aries.jpa.javax.persistence:javax.persistence_2.1:jar:2.7.0
is missing, no dependency information available
[INFO] Downloading: https://repo.maven.apache.org/maven2/org/osgi/org.osgi.service.jpa/1.1.0/org.osgi.service.jpa-1.1.0.jar
[INFO] Downloading: https://repo.maven.apache.org/maven2/org/apache/aries/jpa/javax/persistence/javax.persistence_2.1/2.7.0/javax.persistence_2.1-2.7.0.jar
[INFO] Downloaded: https://repo.maven.apache.org/maven2/org/osgi/org.osgi.service.jpa/1.1.0/org.osgi.service.jpa-1.1.0.jar
(15 kB at 500 kB/s)
[INFO] ------------------------------------------------------------------------
[INFO] Reactor Summary:
[INFO] 
[INFO] tx-control-parent .................................. SUCCESS [  8.311 s]
[INFO] tx-control-provider-parent ......................... SUCCESS [  2.557 s]
[INFO] OSGi Transaction Control Resource Provider - Common Code SUCCESS [01:21 min]
[INFO] tx-control-provider-jdbc-parent .................... SUCCESS [  2.008 s]
[INFO] OSGi Transaction Control JDBC Resource Provider - Common Code SUCCESS [  7.672 s]
[INFO] OSGi Transaction Control JDBC Resource Provider - Local Transactions SUCCESS [  5.270
s]
[INFO] OSGi Transaction Control JDBC Resource Provider - XA Transactions SUCCESS [  5.682
s]
[INFO] tx-control-service-parent .......................... SUCCESS [  1.405 s]
[INFO] OSGi Transaction Control Service - Common Code ..... SUCCESS [  4.508 s]
[INFO] Apache Aries Transaction Control Service - Local Transactions SUCCESS [  4.622 s]
[INFO] Apache Aries OSGi Transaction Control Service - XA Transactions SUCCESS [  9.781 s]
[INFO] Apache Aries Transaction Control JDBC iTests ....... SUCCESS [10:03 min]
[INFO] tx-control-provider-jdbc ........................... SUCCESS [  1.584 s]
[INFO] tx-control-provider-jpa-parent ..................... SUCCESS [  1.549 s]
[INFO] OSGi Transaction Control JPA Resource Provider - Common Code FAILURE [  0.915 s]
[INFO] OSGi Transaction Control JPA Resource Provider - Local Transactions SKIPPED
[INFO] EclipseLink plugin for the JPA (XA) Resource Provider SKIPPED
[INFO] Hibernate (5.0.x and 5.1.x) plugin for the JPA (XA) Resource Provider SKIPPED
[INFO] Hibernate (5.2.x and higher) plugin for the JPA (XA) Resource Provider SKIPPED
[INFO] OpenJPA plugin for the JPA (XA) Resource Provider .. SKIPPED
[INFO] OSGi Transaction Control JPA Resource Provider - XA Transactions SKIPPED
[INFO] Apache Aries Transaction Control JPA iTests ........ SKIPPED
[INFO] tx-control-provider-jpa ............................ SKIPPED
[INFO] tx-control-providers ............................... SKIPPED
[INFO] tx-control-services ................................ SKIPPED
[INFO] tx-control ......................................... SKIPPED
[INFO] ------------------------------------------------------------------------
[INFO] BUILD FAILURE
[INFO] ------------------------------------------------------------------------
[INFO] Total time: 13:43 min
[INFO] Finished at: 2018-04-30T12:22:15Z
[INFO] Final Memory: 47M/569M
[INFO] ------------------------------------------------------------------------
[ERROR] Failed to execute goal on project tx-control-provider-jpa-common: Could not resolve
dependencies for project org.apache.aries.tx-control:tx-control-provider-jpa-common:jar:1.0.0-SNAPSHOT:
Could not find artifact org.apache.aries.jpa.javax.persistence:javax.persistence_2.1:jar:2.7.0
in central (https://repo.maven.apache.org/maven2) -> [Help 1]
org.apache.maven.lifecycle.LifecycleExecutionException: Failed to execute goal on project
tx-control-provider-jpa-common: Could not resolve dependencies for project org.apache.aries.tx-control:tx-control-provider-jpa-common:jar:1.0.0-SNAPSHOT:
Could not find artifact org.apache.aries.jpa.javax.persistence:javax.persistence_2.1:jar:2.7.0
in central (https://repo.maven.apache.org/maven2)
	at org.apache.maven.lifecycle.internal.LifecycleDependencyResolver.getDependencies(LifecycleDependencyResolver.java:221)
	at org.apache.maven.lifecycle.internal.LifecycleDependencyResolver.resolveProjectDependencies(LifecycleDependencyResolver.java:127)
	at org.apache.maven.lifecycle.internal.MojoExecutor.ensureDependenciesAreResolved(MojoExecutor.java:246)
	at org.apache.maven.lifecycle.internal.MojoExecutor.execute(MojoExecutor.java:200)
	at org.apache.maven.lifecycle.internal.MojoExecutor.execute(MojoExecutor.java:154)
	at org.apache.maven.lifecycle.internal.MojoExecutor.execute(MojoExecutor.java:146)
	at org.apache.maven.lifecycle.internal.LifecycleModuleBuilder.buildProject(LifecycleModuleBuilder.java:117)
	at org.apache.maven.lifecycle.internal.LifecycleModuleBuilder.buildProject(LifecycleModuleBuilder.java:81)
	at org.apache.maven.lifecycle.internal.builder.singlethreaded.SingleThreadedBuilder.build(SingleThreadedBuilder.java:51)
	at org.apache.maven.lifecycle.internal.LifecycleStarter.execute(LifecycleStarter.java:128)
	at org.apache.maven.DefaultMaven.doExecute(DefaultMaven.java:309)
	at org.apache.maven.DefaultMaven.doExecute(DefaultMaven.java:194)
	at org.apache.maven.DefaultMaven.execute(DefaultMaven.java:107)
	at org.jvnet.hudson.maven3.launcher.Maven35Launcher.main(Maven35Launcher.java:130)
	at sun.reflect.NativeMethodAccessorImpl.invoke0(Native Method)
	at sun.reflect.NativeMethodAccessorImpl.invoke(NativeMethodAccessorImpl.java:62)
	at sun.reflect.DelegatingMethodAccessorImpl.invoke(DelegatingMethodAccessorImpl.java:43)
	at java.lang.reflect.Method.invoke(Method.java:498)
	at org.codehaus.plexus.classworlds.launcher.Launcher.launchEnhanced(Launcher.java:289)
	at org.codehaus.plexus.classworlds.launcher.Launcher.launch(Launcher.java:229)
	at jenkins.maven3.agent.Maven35Main.launch(Maven35Main.java:176)
	at sun.reflect.NativeMethodAccessorImpl.invoke0(Native Method)
	at sun.reflect.NativeMethodAccessorImpl.invoke(NativeMethodAccessorImpl.java:62)
	at sun.reflect.DelegatingMethodAccessorImpl.invoke(DelegatingMethodAccessorImpl.java:43)
	at java.lang.reflect.Method.invoke(Method.java:498)
	at hudson.maven.Maven3Builder.call(Maven3Builder.java:139)
	at hudson.maven.Maven3Builder.call(Maven3Builder.java:70)
	at hudson.remoting.UserRequest.perform(UserRequest.java:207)
	at hudson.remoting.UserRequest.perform(UserRequest.java:53)
	at hudson.remoting.Request$2.run(Request.java:358)
	at hudson.remoting.InterceptingExecutorService$1.call(InterceptingExecutorService.java:72)
	at java.util.concurrent.FutureTask.run(FutureTask.java:266)
	at java.util.concurrent.ThreadPoolExecutor.runWorker(ThreadPoolExecutor.java:1149)
	at java.util.concurrent.ThreadPoolExecutor$Worker.run(ThreadPoolExecutor.java:624)
	at java.lang.Thread.run(Thread.java:748)
Caused by: org.apache.maven.project.DependencyResolutionException: Could not resolve dependencies
for project org.apache.aries.tx-control:tx-control-provider-jpa-common:jar:1.0.0-SNAPSHOT:
Could not find artifact org.apache.aries.jpa.javax.persistence:javax.persistence_2.1:jar:2.7.0
in central (https://repo.maven.apache.org/maven2)
	at org.apache.maven.project.DefaultProjectDependenciesResolver.resolve(DefaultProjectDependenciesResolver.java:208)
	at org.apache.maven.lifecycle.internal.LifecycleDependencyResolver.getDependencies(LifecycleDependencyResolver.java:195)
	... 34 more
Caused by: org.eclipse.aether.resolution.DependencyResolutionException: Could not find artifact
org.apache.aries.jpa.javax.persistence:javax.persistence_2.1:jar:2.7.0 in central (https://repo.maven.apache.org/maven2)
	at org.eclipse.aether.internal.impl.DefaultRepositorySystem.resolveDependencies(DefaultRepositorySystem.java:393)
	at org.apache.maven.project.DefaultProjectDependenciesResolver.resolve(DefaultProjectDependenciesResolver.java:202)
	... 35 more
Caused by: org.eclipse.aether.resolution.ArtifactResolutionException: Could not find artifact
org.apache.aries.jpa.javax.persistence:javax.persistence_2.1:jar:2.7.0 in central (https://repo.maven.apache.org/maven2)
	at org.eclipse.aether.internal.impl.DefaultArtifactResolver.resolve(DefaultArtifactResolver.java:453)
	at org.eclipse.aether.internal.impl.DefaultArtifactResolver.resolveArtifacts(DefaultArtifactResolver.java:255)
	at org.eclipse.aether.internal.impl.DefaultRepositorySystem.resolveDependencies(DefaultRepositorySystem.java:376)
	... 36 more
Caused by: org.eclipse.aether.transfer.ArtifactNotFoundException: Could not find artifact
org.apache.aries.jpa.javax.persistence:javax.persistence_2.1:jar:2.7.0 in central (https://repo.maven.apache.org/maven2)
	at org.eclipse.aether.connector.basic.ArtifactTransportListener.transferFailed(ArtifactTransportListener.java:48)
	at org.eclipse.aether.connector.basic.BasicRepositoryConnector$TaskRunner.run(BasicRepositoryConnector.java:364)
	at org.eclipse.aether.util.concurrency.RunnableErrorForwarder$1.run(RunnableErrorForwarder.java:76)
	... 3 more
[ERROR] 
[ERROR] Re-run Maven using the -X switch to enable full debug logging.
[ERROR] 
[ERROR] For more information about the errors and possible solutions, please read the following
articles:
[ERROR] [Help 1] http://cwiki.apache.org/confluence/display/MAVEN/DependencyResolutionException
[ERROR] 
[ERROR] After correcting the problems, you can resume the build with the command
[ERROR]   mvn <goals> -rf :tx-control-provider-jpa-common
[JENKINS] Archiving <https://builds.apache.org/job/Aries-Tx-Control-Trunk-JDK8/ws/tx-control-services/tx-control-service-parent/pom.xml>
to org.apache.aries.tx-control/tx-control-service-parent/1.0.0-SNAPSHOT/tx-control-service-parent-1.0.0-SNAPSHOT.pom
[JENKINS] Archiving <https://builds.apache.org/job/Aries-Tx-Control-Trunk-JDK8/ws/tx-control-providers/jpa/tx-control-provider-jpa-xa-plugin-hibernate-5_2/pom.xml>
to org.apache.aries.tx-control/tx-control-provider-jpa-xa-plugin-hibernate-5_2/1.0.0-SNAPSHOT/tx-control-provider-jpa-xa-plugin-hibernate-5_2-1.0.0-SNAPSHOT.pom
[JENKINS] Archiving <https://builds.apache.org/job/Aries-Tx-Control-Trunk-JDK8/ws/tx-control-providers/jpa/tx-control-provider-jpa-xa-plugin-openjpa/pom.xml>
to org.apache.aries.tx-control/tx-control-provider-jpa-xa-plugin-openjpa/1.0.0-SNAPSHOT/tx-control-provider-jpa-xa-plugin-openjpa-1.0.0-SNAPSHOT.pom
[JENKINS] Archiving <https://builds.apache.org/job/Aries-Tx-Control-Trunk-JDK8/ws/tx-control-providers/jdbc/tx-control-provider-jdbc-parent/pom.xml>
to org.apache.aries.tx-control/tx-control-provider-jdbc-parent/1.0.0-SNAPSHOT/tx-control-provider-jdbc-parent-1.0.0-SNAPSHOT.pom
[JENKINS] Archiving <https://builds.apache.org/job/Aries-Tx-Control-Trunk-JDK8/ws/tx-control-providers/jpa/tx-control-provider-jpa-parent/pom.xml>
to org.apache.aries.tx-control/tx-control-provider-jpa-parent/1.0.0-SNAPSHOT/tx-control-provider-jpa-parent-1.0.0-SNAPSHOT.pom
[JENKINS] Archiving <https://builds.apache.org/job/Aries-Tx-Control-Trunk-JDK8/ws/tx-control-services/pom.xml>
to org.apache.aries.tx-control/tx-control-services/1.0.0-SNAPSHOT/tx-control-services-1.0.0-SNAPSHOT.pom
[JENKINS] Archiving <https://builds.apache.org/job/Aries-Tx-Control-Trunk-JDK8/ws/tx-control-providers/jdbc/tx-control-provider-jdbc-local/pom.xml>
to org.apache.aries.tx-control/tx-control-provider-jdbc-local/1.0.0-SNAPSHOT/tx-control-provider-jdbc-local-1.0.0-SNAPSHOT.pom
[JENKINS] Archiving <https://builds.apache.org/job/Aries-Tx-Control-Trunk-JDK8/ws/tx-control-providers/jdbc/tx-control-provider-jdbc-local/target/tx-control-provider-jdbc-local-1.0.0-SNAPSHOT.jar>
to org.apache.aries.tx-control/tx-control-provider-jdbc-local/1.0.0-SNAPSHOT/tx-control-provider-jdbc-local-1.0.0-SNAPSHOT.jar
[JENKINS] Archiving <https://builds.apache.org/job/Aries-Tx-Control-Trunk-JDK8/ws/tx-control-providers/jdbc/tx-control-provider-jdbc-common/pom.xml>
to org.apache.aries.tx-control/tx-control-provider-jdbc-common/1.0.0-SNAPSHOT/tx-control-provider-jdbc-common-1.0.0-SNAPSHOT.pom
[JENKINS] Archiving <https://builds.apache.org/job/Aries-Tx-Control-Trunk-JDK8/ws/tx-control-providers/jdbc/tx-control-provider-jdbc-common/target/tx-control-provider-jdbc-common-1.0.0-SNAPSHOT.jar>
to org.apache.aries.tx-control/tx-control-provider-jdbc-common/1.0.0-SNAPSHOT/tx-control-provider-jdbc-common-1.0.0-SNAPSHOT.jar
[JENKINS] Archiving <https://builds.apache.org/job/Aries-Tx-Control-Trunk-JDK8/ws/tx-control-providers/jpa/tx-control-provider-jpa-xa/pom.xml>
to org.apache.aries.tx-control/tx-control-provider-jpa-xa/1.0.0-SNAPSHOT/tx-control-provider-jpa-xa-1.0.0-SNAPSHOT.pom
[JENKINS] Archiving <https://builds.apache.org/job/Aries-Tx-Control-Trunk-JDK8/ws/tx-control-providers/jdbc/tx-control-provider-jdbc-xa/pom.xml>
to org.apache.aries.tx-control/tx-control-provider-jdbc-xa/1.0.0-SNAPSHOT/tx-control-provider-jdbc-xa-1.0.0-SNAPSHOT.pom
[JENKINS] Archiving <https://builds.apache.org/job/Aries-Tx-Control-Trunk-JDK8/ws/tx-control-providers/jdbc/tx-control-provider-jdbc-xa/target/tx-control-provider-jdbc-xa-1.0.0-SNAPSHOT.jar>
to org.apache.aries.tx-control/tx-control-provider-jdbc-xa/1.0.0-SNAPSHOT/tx-control-provider-jdbc-xa-1.0.0-SNAPSHOT.jar
[JENKINS] Archiving <https://builds.apache.org/job/Aries-Tx-Control-Trunk-JDK8/ws/tx-control-providers/jpa/pom.xml>
to org.apache.aries.tx-control/tx-control-provider-jpa/1.0.0-SNAPSHOT/tx-control-provider-jpa-1.0.0-SNAPSHOT.pom
[JENKINS] Archiving <https://builds.apache.org/job/Aries-Tx-Control-Trunk-JDK8/ws/tx-control-providers/tx-control-provider-parent/pom.xml>
to org.apache.aries.tx-control/tx-control-provider-parent/1.0.0-SNAPSHOT/tx-control-provider-parent-1.0.0-SNAPSHOT.pom
[JENKINS] Archiving <https://builds.apache.org/job/Aries-Tx-Control-Trunk-JDK8/ws/tx-control-providers/jpa/tx-control-provider-jpa-common/pom.xml>
to org.apache.aries.tx-control/tx-control-provider-jpa-common/1.0.0-SNAPSHOT/tx-control-provider-jpa-common-1.0.0-SNAPSHOT.pom
[JENKINS] Archiving <https://builds.apache.org/job/Aries-Tx-Control-Trunk-JDK8/ws/tx-control-services/tx-control-service-common/pom.xml>
to org.apache.aries.tx-control/tx-control-service-common/1.0.0-SNAPSHOT/tx-control-service-common-1.0.0-SNAPSHOT.pom
[JENKINS] Archiving <https://builds.apache.org/job/Aries-Tx-Control-Trunk-JDK8/ws/tx-control-services/tx-control-service-common/target/tx-control-service-common-1.0.0-SNAPSHOT.jar>
to org.apache.aries.tx-control/tx-control-service-common/1.0.0-SNAPSHOT/tx-control-service-common-1.0.0-SNAPSHOT.jar
[JENKINS] Archiving <https://builds.apache.org/job/Aries-Tx-Control-Trunk-JDK8/ws/tx-control-providers/jpa/tx-control-provider-jpa-xa-plugin-eclipselink/pom.xml>
to org.apache.aries.tx-control/tx-control-provider-jpa-xa-plugin-eclipselink/1.0.0-SNAPSHOT/tx-control-provider-jpa-xa-plugin-eclipselink-1.0.0-SNAPSHOT.pom
[JENKINS] Archiving <https://builds.apache.org/job/Aries-Tx-Control-Trunk-JDK8/ws/tx-control-providers/jdbc/pom.xml>
to org.apache.aries.tx-control/tx-control-provider-jdbc/1.0.0-SNAPSHOT/tx-control-provider-jdbc-1.0.0-SNAPSHOT.pom
[JENKINS] Archiving <https://builds.apache.org/job/Aries-Tx-Control-Trunk-JDK8/ws/tx-control-providers/jpa/tx-control-provider-jpa-xa-plugin-hibernate-5_0/pom.xml>
to org.apache.aries.tx-control/tx-control-provider-jpa-xa-plugin-hibernate-5_0/1.0.0-SNAPSHOT/tx-control-provider-jpa-xa-plugin-hibernate-5_0-1.0.0-SNAPSHOT.pom
[JENKINS] Archiving <https://builds.apache.org/job/Aries-Tx-Control-Trunk-JDK8/ws/tx-control-providers/jdbc/tx-control-jdbc-itests/pom.xml>
to org.apache.aries.tx-control/tx-control-jdbc-itests/1.0.0-SNAPSHOT/tx-control-jdbc-itests-1.0.0-SNAPSHOT.pom
[JENKINS] Archiving <https://builds.apache.org/job/Aries-Tx-Control-Trunk-JDK8/ws/tx-control-providers/jdbc/tx-control-jdbc-itests/target/tx-control-jdbc-itests-1.0.0-SNAPSHOT.jar>
to org.apache.aries.tx-control/tx-control-jdbc-itests/1.0.0-SNAPSHOT/tx-control-jdbc-itests-1.0.0-SNAPSHOT.jar
[JENKINS] Archiving <https://builds.apache.org/job/Aries-Tx-Control-Trunk-JDK8/ws/tx-control-providers/pom.xml>
to org.apache.aries.tx-control/tx-control-providers/1.0.0-SNAPSHOT/tx-control-providers-1.0.0-SNAPSHOT.pom
[JENKINS] Archiving <https://builds.apache.org/job/Aries-Tx-Control-Trunk-JDK8/ws/tx-control-providers/jpa/tx-control-provider-jpa-local/pom.xml>
to org.apache.aries.tx-control/tx-control-provider-jpa-local/1.0.0-SNAPSHOT/tx-control-provider-jpa-local-1.0.0-SNAPSHOT.pom
[JENKINS] Archiving <https://builds.apache.org/job/Aries-Tx-Control-Trunk-JDK8/ws/tx-control-services/tx-control-service-local/pom.xml>
to org.apache.aries.tx-control/tx-control-service-local/1.0.0-SNAPSHOT/tx-control-service-local-1.0.0-SNAPSHOT.pom
[JENKINS] Archiving <https://builds.apache.org/job/Aries-Tx-Control-Trunk-JDK8/ws/tx-control-services/tx-control-service-local/target/tx-control-service-local-1.0.0-SNAPSHOT.jar>
to org.apache.aries.tx-control/tx-control-service-local/1.0.0-SNAPSHOT/tx-control-service-local-1.0.0-SNAPSHOT.jar
[JENKINS] Archiving <https://builds.apache.org/job/Aries-Tx-Control-Trunk-JDK8/ws/tx-control-parent/pom.xml>
to org.apache.aries.tx-control/tx-control-parent/1.0.0-SNAPSHOT/tx-control-parent-1.0.0-SNAPSHOT.pom
[JENKINS] Archiving <https://builds.apache.org/job/Aries-Tx-Control-Trunk-JDK8/ws/pom.xml>
to org.apache.aries.tx-control/tx-control/1.0.0-SNAPSHOT/tx-control-1.0.0-SNAPSHOT.pom
[JENKINS] Archiving <https://builds.apache.org/job/Aries-Tx-Control-Trunk-JDK8/ws/tx-control-services/tx-control-service-xa/pom.xml>
to org.apache.aries.tx-control/tx-control-service-xa/1.0.0-SNAPSHOT/tx-control-service-xa-1.0.0-SNAPSHOT.pom
[JENKINS] Archiving <https://builds.apache.org/job/Aries-Tx-Control-Trunk-JDK8/ws/tx-control-services/tx-control-service-xa/target/tx-control-service-xa-1.0.0-SNAPSHOT.jar>
to org.apache.aries.tx-control/tx-control-service-xa/1.0.0-SNAPSHOT/tx-control-service-xa-1.0.0-SNAPSHOT.jar
[JENKINS] Archiving <https://builds.apache.org/job/Aries-Tx-Control-Trunk-JDK8/ws/tx-control-providers/tx-control-provider-common/pom.xml>
to org.apache.aries.tx-control/tx-control-provider-common/1.0.0-SNAPSHOT/tx-control-provider-common-1.0.0-SNAPSHOT.pom
[JENKINS] Archiving <https://builds.apache.org/job/Aries-Tx-Control-Trunk-JDK8/ws/tx-control-providers/tx-control-provider-common/target/tx-control-provider-common-1.0.0-SNAPSHOT.jar>
to org.apache.aries.tx-control/tx-control-provider-common/1.0.0-SNAPSHOT/tx-control-provider-common-1.0.0-SNAPSHOT.jar
[JENKINS] Archiving <https://builds.apache.org/job/Aries-Tx-Control-Trunk-JDK8/ws/tx-control-providers/jpa/tx-control-jpa-itests/pom.xml>
to org.apache.aries.tx-control/tx-control-jpa-itests/1.0.0-SNAPSHOT/tx-control-jpa-itests-1.0.0-SNAPSHOT.pom
channel stopped

Mime
View raw message