beam-builds mailing list archives

Site index · List index
Message view « Date » · « Thread »
Top « Date » · « Thread »
From Apache Jenkins Server <jenk...@builds.apache.org>
Subject Build failed in Jenkins: beam_PreCommit_Java_Cron #801
Date Tue, 08 Jan 2019 18:17:34 GMT
See <https://builds.apache.org/job/beam_PreCommit_Java_Cron/801/display/redirect?page=changes>

Changes:

[iemejia] [BEAM-5798] Add support to write to multiple topics with KafkaIO

------------------------------------------
[...truncated 709.78 KB...]
> Task :beam-sdks-java-io-kudu:testClasses
> Task :beam-sdks-java-io-kudu:packageTests
> Task :beam-sdks-java-io-kudu:assemble
> Task :beam-sdks-java-io-kinesis:compileTestJava
> Task :beam-sdks-java-io-kudu:checkstyleTest
> Task :beam-sdks-java-io-hcatalog:check
> Task :beam-sdks-java-io-hcatalog:build
> Task :beam-sdks-java-io-hcatalog:buildDependents
> Task :beam-sdks-java-io-kafka:test
> Task :beam-runners-flink-1.6-job-server:startShadowScripts
> Task :beam-sdks-java-io-google-cloud-platform:check
> Task :beam-sdks-java-io-google-cloud-platform:build
> Task :beam-runners-flink-1.6-job-server:shadowDistTar
> Task :beam-sdks-java-extensions-sql-jdbc:test
> Task :beam-sdks-java-extensions-sql-jdbc:check
> Task :beam-sdks-java-extensions-sql-jdbc:build
> Task :beam-sdks-java-extensions-sql-jdbc:buildDependents
> Task :beam-sdks-java-io-kudu:test
> Task :beam-sdks-java-io-kudu:check
> Task :beam-sdks-java-io-kudu:build
> Task :beam-sdks-java-io-kudu:buildDependents
> Task :beam-runners-flink-1.6-job-server:shadowDistZip
> Task :beam-runners-flink-1.6-job-server:assemble
> Task :beam-runners-flink-1.6-job-server:checkstyleMain NO-SOURCE
> Task :beam-runners-flink-1.6-job-server:checkstyleTest NO-SOURCE
> Task :beam-runners-flink-1.6-job-server:findbugsMain NO-SOURCE
> Task :beam-runners-flink-1.6-job-server:javadoc NO-SOURCE
> Task :beam-runners-flink-1.6-job-server:test NO-SOURCE
> Task :beam-runners-flink-1.6-job-server:check UP-TO-DATE
> Task :beam-runners-flink-1.6-job-server:build
> Task :beam-runners-flink-1.6-job-server:buildDependents
> Task :beam-runners-flink-1.6:buildDependents
> Task :beam-sdks-java-io-jdbc:check
> Task :beam-sdks-java-io-jdbc:build
> Task :beam-sdks-java-io-jdbc:buildDependents
> Task :beam-sdks-java-io-kinesis:testClasses
> Task :beam-sdks-java-io-kinesis:packageTests
> Task :beam-sdks-java-io-kinesis:assemble
> Task :beam-sdks-java-io-kafka:check
> Task :beam-sdks-java-io-kafka:build
> Task :beam-sdks-java-io-kinesis:checkstyleTest
> Task :beam-sdks-java-io-mongodb:compileTestJava
> Task :beam-sdks-java-io-mqtt:compileTestJava
> Task :beam-sdks-java-io-mqtt:testClasses
> Task :beam-sdks-java-io-mqtt:packageTests
> Task :beam-sdks-java-io-mqtt:assemble
> Task :beam-sdks-java-io-mqtt:checkstyleTest
> Task :beam-sdks-java-io-parquet:compileTestJava
> Task :beam-sdks-java-io-parquet:testClasses
> Task :beam-sdks-java-io-mongodb:testClasses
> Task :beam-sdks-java-io-mongodb:packageTests
> Task :beam-sdks-java-io-mongodb:assemble
> Task :beam-sdks-java-io-mongodb:checkstyleTest
> Task :beam-sdks-java-io-rabbitmq:compileTestJava
> Task :beam-sdks-java-io-rabbitmq:testClasses
> Task :beam-sdks-java-io-rabbitmq:packageTests
> Task :beam-sdks-java-io-rabbitmq:assemble
> Task :beam-sdks-java-io-redis:compileTestJava
> Task :beam-sdks-java-io-redis:testClasses
> Task :beam-sdks-java-io-redis:packageTests
> Task :beam-sdks-java-io-redis:assemble
> Task :beam-sdks-java-io-rabbitmq:checkstyleTest
> Task :beam-sdks-java-io-redis:checkstyleTest
> Task :beam-sdks-java-io-parquet:shadowTestJar
> Task :beam-sdks-java-io-xml:compileTestJava
> Task :beam-sdks-java-io-parquet:packageTests
> Task :beam-sdks-java-io-parquet:assemble
> Task :beam-sdks-java-io-xml:testClasses
> Task :beam-sdks-java-io-parquet:checkstyleTest
> Task :beam-sdks-java-io-solr:compileTestJava
> Task :beam-sdks-java-io-solr:testClasses
> Task :beam-sdks-java-io-solr:packageTests
> Task :beam-sdks-java-io-solr:assemble
> Task :beam-sdks-java-io-solr:checkstyleTest
> Task :beam-sdks-java-io-mqtt:test
> Task :beam-sdks-java-io-mqtt:check
> Task :beam-sdks-java-io-mqtt:build
> Task :beam-sdks-java-io-mqtt:buildDependents
> Task :beam-sdks-java-io-synthetic:jar
> Task :beam-sdks-java-io-xml:shadowTestJar
> Task :beam-sdks-java-io-kinesis:test
> Task :beam-sdks-java-io-synthetic:compileTestJava
> Task :beam-sdks-java-io-synthetic:testClasses
> Task :beam-sdks-java-io-synthetic:packageTests
> Task :beam-sdks-java-io-synthetic:assemble
> Task :beam-sdks-java-io-synthetic:checkstyleMain
> Task :beam-sdks-java-io-synthetic:checkstyleTest
> Task :beam-sdks-java-io-mongodb:test
> Task :beam-sdks-java-io-parquet:test
> Task :beam-sdks-java-io-parquet:check
> Task :beam-sdks-java-io-parquet:build
> Task :beam-runners-direct-java:jar
> Task :beam-runners-direct-java:packageTests
> Task :beam-sdks-java-io-rabbitmq:test
> Task :beam-sdks-java-io-redis:test
> Task :beam-runners-direct-java:assemble
> Task :beam-sdks-java-io-file-based-io-tests:compileTestJava
> Task :beam-sdks-java-io-solr:test
> Task :beam-runners-direct-java:checkstyleMain
> Task :beam-sdks-java-extensions-sql:validateShadedJarDoesntLeakNonProjectClasses
> Task :beam-sdks-java-extensions-sql:check
> Task :beam-sdks-java-extensions-sql:build
> Task :beam-sdks-java-io-kinesis:check
> Task :beam-sdks-java-io-kinesis:build
> Task :beam-sdks-java-io-kinesis:buildDependents
> Task :beam-sdks-java-io-file-based-io-tests:testClasses
> Task :beam-sdks-java-io-file-based-io-tests:packageTests
> Task :beam-sdks-java-io-file-based-io-tests:assemble
> Task :beam-sdks-java-io-file-based-io-tests:checkstyleTest
> Task :beam-sdks-java-io-file-based-io-tests:test NO-SOURCE
> Task :beam-sdks-java-io-file-based-io-tests:check
> Task :beam-sdks-java-io-file-based-io-tests:build
> Task :beam-sdks-java-io-file-based-io-tests:buildDependents
> Task :beam-sdks-java-io-parquet:buildDependents
> Task :beam-sdks-java-io-xml:packageTests
> Task :beam-sdks-java-io-xml:assemble
> Task :beam-sdks-java-io-xml:checkstyleTest
> Task :beam-sdks-java-io-synthetic:findbugsMain
> Task :beam-runners-direct-java:checkstyleTest
> Task :beam-sdks-java-io-synthetic:javadoc
> Task :beam-sdks-java-io-rabbitmq:check
> Task :beam-sdks-java-io-rabbitmq:build
> Task :beam-sdks-java-io-rabbitmq:buildDependents
> Task :beam-sdks-java-maven-archetypes-starter:compileJava NO-SOURCE
> Task :beam-sdks-java-maven-archetypes-starter:classes
> Task :beam-sdks-java-maven-archetypes-starter:jar
> Task :beam-sdks-java-maven-archetypes-starter:compileTestJava NO-SOURCE
> Task :beam-sdks-java-maven-archetypes-starter:testClasses
> Task :beam-sdks-java-maven-archetypes-starter:packageTests
> Task :beam-sdks-java-maven-archetypes-starter:assemble
> Task :beam-sdks-java-maven-archetypes-starter:checkstyleMain NO-SOURCE
> Task :beam-sdks-java-maven-archetypes-starter:checkstyleTest NO-SOURCE
> Task :beam-sdks-java-maven-archetypes-starter:findbugsMain NO-SOURCE
> Task :beam-sdks-java-maven-archetypes-starter:javadoc NO-SOURCE
> Task :beam-sdks-java-maven-archetypes-starter:test NO-SOURCE
> Task :beam-sdks-java-maven-archetypes-starter:shadowJar
> Task :beam-sdks-java-maven-archetypes-starter:validateShadedJarDoesntLeakNonProjectClasses
> Task :beam-sdks-java-maven-archetypes-starter:check
> Task :beam-sdks-java-maven-archetypes-starter:build
> Task :beam-sdks-java-maven-archetypes-starter:buildDependents
> Task :beam-sdks-java-test-utils:packageTests
> Task :beam-sdks-java-test-utils:assemble
> Task :beam-sdks-java-test-utils:checkstyleTest
> Task :beam-sdks-java-io-mongodb:check
> Task :beam-sdks-java-io-mongodb:build
> Task :beam-sdks-java-io-mongodb:buildDependents
> Task :beam-sdks-java-io-tika:compileTestJava
> Task :beam-sdks-java-io-tika:testClasses
> Task :beam-sdks-java-io-tika:packageTests
> Task :beam-sdks-java-io-tika:assemble
> Task :beam-sdks-java-io-tika:checkstyleTest
> Task :beam-runners-samza:shadowJar
> Task :beam-runners-samza:validateShadedJarDoesntLeakNonProjectClasses
> Task :beam-runners-samza:check
> Task :beam-runners-samza:build
> Task :beam-runners-samza:buildDependents
> Task :beam-runners-java-fn-execution:validateShadedJarDoesntLeakNonProjectClasses
> Task :beam-runners-java-fn-execution:check
> Task :beam-runners-java-fn-execution:build
> Task :beam-sdks-java-io-elasticsearch:buildDependents
> Task :beam-sdks-java-extensions-kryo:compileTestJava
> Task :beam-sdks-java-extensions-kryo:testClasses
> Task :beam-sdks-java-extensions-kryo:packageTests
> Task :beam-sdks-java-extensions-kryo:assemble
> Task :beam-sdks-java-extensions-kryo:checkstyleTest
> Task :beam-sdks-java-test-utils:test
> Task :beam-sdks-java-test-utils:check
> Task :beam-sdks-java-test-utils:build
> Task :beam-sdks-java-extensions-euphoria:compileTestJava
> Task :beam-sdks-java-io-synthetic:test
> Task :beam-sdks-java-extensions-kryo:test
> Task :beam-sdks-java-extensions-kryo:check
> Task :beam-sdks-java-extensions-kryo:build
> Task :beam-sdks-java-io-synthetic:validateShadedJarDoesntLeakNonProjectClasses
> Task :beam-sdks-java-io-synthetic:check
> Task :beam-sdks-java-io-synthetic:build
> Task :beam-sdks-java-io-synthetic:buildDependents
> Task :beam-sdks-java-io-solr:check
> Task :beam-sdks-java-io-solr:build
> Task :beam-sdks-java-io-solr:buildDependents
> Task :beam-sdks-java-io-xml:test
> Task :beam-runners-direct-java:findbugsMain
> Task :beam-sdks-java-io-tika:test
> Task :beam-sdks-java-io-tika:check
> Task :beam-sdks-java-io-tika:build
> Task :beam-sdks-java-io-tika:buildDependents
> Task :beam-sdks-java-extensions-euphoria:testClasses
> Task :beam-sdks-java-extensions-euphoria:packageTests
> Task :beam-sdks-java-extensions-euphoria:assemble
> Task :beam-sdks-java-extensions-euphoria:checkstyleTest
> Task :beam-sdks-java-io-xml:check
> Task :beam-sdks-java-io-xml:build
> Task :beam-sdks-java-io-xml:buildDependents
> Task :beam-sdks-java-extensions-sql-jdbc:shadowJarTest
> Task :beam-sdks-java-extensions-sql-jdbc:preCommit
> Task :beam-runners-direct-java:javadoc
> Task :beam-sdks-java-javadoc:allJavadoc
> Task :beam-sdks-java-extensions-euphoria:test
> Task :beam-sdks-java-extensions-euphoria:check
> Task :beam-sdks-java-extensions-euphoria:build
> Task :beam-sdks-java-extensions-euphoria:buildDependents
> Task :beam-sdks-java-extensions-kryo:buildDependents
> Task :beam-sdks-java-io-redis:check
> Task :beam-sdks-java-io-redis:build
> Task :beam-sdks-java-io-redis:buildDependents
> Task :beam-runners-direct-java:test
> Task :beam-runners-direct-java:validateShadedJarDoesntLeakNonProjectClasses
> Task :beam-runners-direct-java:check
> Task :beam-runners-direct-java:build
> Task :beam-sdks-java-io-hbase:check
> Task :beam-sdks-java-io-hbase:build
> Task :beam-sdks-java-io-hbase:buildDependents
> Task :beam-sdks-java-io-common:buildDependents
> Task :beam-sdks-java-io-hadoop-common:buildDependents
> Task :beam-sdks-java-nexmark:shadowJar
> Task :beam-sdks-java-nexmark:validateShadedJarDoesntLeakNonProjectClasses
> Task :beam-sdks-java-nexmark:check
> Task :beam-sdks-java-nexmark:build
> Task :beam-sdks-java-nexmark:buildDependents
> Task :beam-sdks-java-extensions-sql:buildDependents
> Task :beam-sdks-java-extensions-join-library:buildDependents
> Task :beam-sdks-java-io-google-cloud-platform:buildDependents
> Task :beam-sdks-java-io-kafka:buildDependents
> Task :beam-sdks-java-extensions-protobuf:buildDependents
> Task :beam-sdks-java-test-utils:buildDependents

FAILURE: Build failed with an exception.

* What went wrong:
Execution failed for task ':beam-sdks-java-io-clickhouse:test'.
> There were failing tests. See the report at: file://<https://builds.apache.org/job/beam_PreCommit_Java_Cron/ws/src/sdks/java/io/clickhouse/build/reports/tests/test/index.html>

* Try:
Run with --stacktrace option to get the stack trace. Run with --info or --debug option to
get more log output. Run with --scan to get full insights.

* Get more help at https://help.gradle.org

Deprecated Gradle features were used in this build, making it incompatible with Gradle 5.0.
Use '--warning-mode all' to show the individual deprecation warnings.
See https://docs.gradle.org/4.10.3/userguide/command_line_interface.html#sec:command_line_warnings

BUILD FAILED in 17m 16s
885 actionable tasks: 879 executed, 6 from cache

Publishing build scan...
https://gradle.com/s/7wawqqcjkrhby

Build step 'Invoke Gradle script' changed build result to FAILURE
Build step 'Invoke Gradle script' marked build as failure

---------------------------------------------------------------------
To unsubscribe, e-mail: builds-unsubscribe@beam.apache.org
For additional commands, e-mail: builds-help@beam.apache.org


Mime
View raw message