beam-builds mailing list archives

Site index · List index
Message view « Date » · « Thread »
Top « Date » · « Thread »
From Apache Jenkins Server <jenk...@builds.apache.org>
Subject Build failed in Jenkins: beam_PostCommit_Java_ValidatesRunner_Dataflow #1814
Date Tue, 08 Jan 2019 16:59:11 GMT
See <https://builds.apache.org/job/beam_PostCommit_Java_ValidatesRunner_Dataflow/1814/display/redirect?page=changes>

Changes:

[iemejia] [BEAM-6021] Serialize more core classes when using kryo's

------------------------------------------
[...truncated 1.12 KB...]
 > git checkout -f e38f0b240ed7cf2c71a9a60a2a853d415fc3733b
Commit message: "Merge pull request #6998: [BEAM-6021] Serialize more core classes when using
kryo's BeamSparkRunnerRegistrator"
 > git rev-list --no-walk 109eeb81535a1fd4f5d8cc724f3ddbddab326c3d # timeout=10
Cleaning workspace
 > git rev-parse --verify HEAD # timeout=10
Resetting working tree
 > git reset --hard # timeout=10
 > git clean -fdx # timeout=10
No emails were triggered.
[EnvInject] - Executing scripts and injecting environment variables after the SCM step.
[EnvInject] - Injecting as environment variables the properties content 
SPARK_LOCAL_IP=127.0.0.1

[EnvInject] - Variables injected successfully.
[Gradle] - Launching build.
[src] $ <https://builds.apache.org/job/beam_PostCommit_Java_ValidatesRunner_Dataflow/ws/src/gradlew>
--continue --max-workers=120 -Dorg.gradle.jvmargs=-Xms2g -Dorg.gradle.jvmargs=-Xmx4g :beam-runners-google-cloud-dataflow-java:validatesRunner
To honour the JVM settings for this build a new JVM will be forked. Please consider using
the daemon: https://docs.gradle.org/4.10.3/userguide/gradle_daemon.html.
Daemon will be stopped at the end of the build stopping after processing
Parallel execution is an incubating feature.
> Task :buildSrc:compileJava NO-SOURCE
> Task :buildSrc:compileGroovy FROM-CACHE
> Task :buildSrc:processResources NO-SOURCE
> Task :buildSrc:classes UP-TO-DATE
> Task :buildSrc:jar
> Task :buildSrc:assemble
> Task :buildSrc:spotlessGroovy
> Task :buildSrc:spotlessGroovyCheck
> Task :buildSrc:spotlessGroovyGradle
> Task :buildSrc:spotlessGroovyGradleCheck
> Task :buildSrc:spotlessCheck
> Task :buildSrc:compileTestJava NO-SOURCE
> Task :buildSrc:compileTestGroovy NO-SOURCE
> Task :buildSrc:processTestResources NO-SOURCE
> Task :buildSrc:testClasses UP-TO-DATE
> Task :buildSrc:test NO-SOURCE
> Task :buildSrc:check
> Task :buildSrc:build
Parallel execution with configuration on demand is an incubating feature.

> Configure project :beam-model-pipeline
applyPortabilityNature with [shadowJarValidationExcludes:[org/apache/beam/model/pipeline/v1/**]]
for project beam-model-pipeline

> Configure project :beam-model-job-management
applyPortabilityNature with [shadowJarValidationExcludes:[org/apache/beam/model/jobmanagement/v1/**]]
for project beam-model-job-management

> Configure project :beam-model-fn-execution
applyPortabilityNature with [shadowJarValidationExcludes:[org/apache/beam/model/fnexecution/v1/**]]
for project beam-model-fn-execution

> Configure project :beam-runners-google-cloud-dataflow-java-windmill
applyPortabilityNature with [shadowJarValidationExcludes:[org/apache/beam/runners/dataflow/worker/windmill/**]]
for project beam-runners-google-cloud-dataflow-java-windmill

> Task :beam-runners-google-cloud-dataflow-java-legacy-worker:processResources NO-SOURCE
> Task :beam-runners-core-java:processResources NO-SOURCE
> Task :beam-sdks-java-extensions-google-cloud-platform-core:processResources NO-SOURCE
> Task :beam-sdks-java-harness:processResources NO-SOURCE
> Task :beam-sdks-java-fn-execution:processResources NO-SOURCE
> Task :beam-runners-java-fn-execution:processResources NO-SOURCE
> Task :beam-vendor-sdks-java-extensions-protobuf:processResources NO-SOURCE
> Task :beam-runners-core-construction-java:processResources NO-SOURCE
> Task :beam-sdks-java-core:generateAvroProtocol NO-SOURCE
> Task :beam-sdks-java-io-google-cloud-platform:processResources NO-SOURCE
> Task :beam-model-fn-execution:extractProto
> Task :beam-model-job-management:extractProto
> Task :beam-sdks-java-extensions-protobuf:extractProto
> Task :beam-sdks-java-core:generateAvroJava NO-SOURCE
> Task :beam-model-job-management:processResources
> Task :beam-sdks-java-extensions-protobuf:processResources NO-SOURCE
> Task :beam-model-fn-execution:processResources
> Task :beam-sdks-java-core:processResources
> Task :beam-runners-google-cloud-dataflow-java:processResources
> Task :beam-sdks-java-core:generateTestAvroProtocol NO-SOURCE
> Task :beam-runners-google-cloud-dataflow-java-windmill:extractIncludeProto
> Task :beam-model-pipeline:extractIncludeProto
> Task :beam-runners-google-cloud-dataflow-java-windmill:extractProto
> Task :beam-model-pipeline:extractProto
> Task :beam-sdks-java-core:generateTestAvroJava
> Task :beam-sdks-java-core:processTestResources NO-SOURCE
> Task :beam-runners-google-cloud-dataflow-java-windmill:generateProto
> Task :beam-model-pipeline:generateProto
> Task :beam-runners-google-cloud-dataflow-java-windmill:compileJava FROM-CACHE
> Task :beam-runners-google-cloud-dataflow-java-windmill:processResources
> Task :beam-runners-google-cloud-dataflow-java-windmill:classes
> Task :beam-model-pipeline:compileJava FROM-CACHE
> Task :beam-model-pipeline:processResources
> Task :beam-model-pipeline:classes
> Task :beam-model-pipeline:jar
> Task :beam-model-job-management:extractIncludeProto
> Task :beam-model-fn-execution:extractIncludeProto
> Task :beam-model-job-management:generateProto
> Task :beam-model-fn-execution:generateProto
> Task :beam-runners-google-cloud-dataflow-java-windmill:shadowJar
> Task :beam-model-pipeline:shadowJar
> Task :beam-model-job-management:compileJava FROM-CACHE
> Task :beam-model-job-management:classes
> Task :beam-model-fn-execution:compileJava FROM-CACHE
> Task :beam-model-fn-execution:classes
> Task :beam-sdks-java-core:compileJava FROM-CACHE
> Task :beam-sdks-java-core:classes
> Task :beam-model-job-management:shadowJar
> Task :beam-model-fn-execution:shadowJar
> Task :beam-sdks-java-core:shadowJar
> Task :beam-sdks-java-extensions-protobuf:extractIncludeProto
> Task :beam-sdks-java-extensions-protobuf:generateProto NO-SOURCE

> Task :beam-vendor-sdks-java-extensions-protobuf:compileJava
Note: Some input files use or override a deprecated API.
Note: Recompile with -Xlint:deprecation for details.

> Task :beam-sdks-java-extensions-protobuf:compileJava
Note: Some input files use or override a deprecated API.
Note: Recompile with -Xlint:deprecation for details.

> Task :beam-sdks-java-extensions-protobuf:classes
> Task :beam-vendor-sdks-java-extensions-protobuf:classes

> Task :beam-sdks-java-fn-execution:compileJava
Note: Some input files use or override a deprecated API.
Note: Recompile with -Xlint:deprecation for details.
Note: Some input files use unchecked or unsafe operations.
Note: Recompile with -Xlint:unchecked for details.

> Task :beam-sdks-java-fn-execution:classes

> Task :beam-sdks-java-extensions-google-cloud-platform-core:compileJava
Note: <https://builds.apache.org/job/beam_PostCommit_Java_ValidatesRunner_Dataflow/ws/src/sdks/java/extensions/google-cloud-platform-core/src/main/java/org/apache/beam/sdk/util/GcsUtil.java>
uses or overrides a deprecated API.
Note: Recompile with -Xlint:deprecation for details.

> Task :beam-vendor-sdks-java-extensions-protobuf:shadowJar
> Task :beam-sdks-java-extensions-google-cloud-platform-core:classes
> Task :beam-sdks-java-extensions-protobuf:shadowJar
> Task :beam-sdks-java-fn-execution:shadowJar
> Task :beam-sdks-java-extensions-google-cloud-platform-core:shadowJar

> Task :beam-runners-core-construction-java:compileJava
Note: Some input files use or override a deprecated API.
Note: Recompile with -Xlint:deprecation for details.
Note: Some input files use unchecked or unsafe operations.
Note: Recompile with -Xlint:unchecked for details.

> Task :beam-runners-core-construction-java:classes
> Task :beam-runners-core-construction-java:shadowJar
> Task :beam-sdks-java-core:compileTestJava

> Task :beam-sdks-java-io-google-cloud-platform:compileJava
Note: Some input files use or override a deprecated API.
Note: Recompile with -Xlint:deprecation for details.
Note: Some input files use unchecked or unsafe operations.
Note: Recompile with -Xlint:unchecked for details.

> Task :beam-sdks-java-io-google-cloud-platform:classes
> Task :beam-sdks-java-io-google-cloud-platform:shadowJar

> Task :beam-runners-core-java:compileJava
Note: Some input files use or override a deprecated API.
Note: Recompile with -Xlint:deprecation for details.
Note: Some input files use unchecked or unsafe operations.
Note: Recompile with -Xlint:unchecked for details.

> Task :beam-runners-core-java:classes

> Task :beam-sdks-java-core:compileTestJava
Note: Some input files use or override a deprecated API.
Note: Recompile with -Xlint:deprecation for details.
Note: Some input files use unchecked or unsafe operations.
Note: Recompile with -Xlint:unchecked for details.

> Task :beam-sdks-java-core:testClasses
> Task :beam-runners-core-java:shadowJar
> Task :beam-sdks-java-core:shadowTestJar

> Task :beam-runners-google-cloud-dataflow-java:compileJava
Note: Some input files use or override a deprecated API.
Note: Recompile with -Xlint:deprecation for details.
Note: Some input files use unchecked or unsafe operations.
Note: Recompile with -Xlint:unchecked for details.

> Task :beam-runners-google-cloud-dataflow-java:classes

> Task :beam-sdks-java-harness:compileJava
Note: Some input files use or override a deprecated API.
Note: Recompile with -Xlint:deprecation for details.
Note: Some input files use unchecked or unsafe operations.
Note: Recompile with -Xlint:unchecked for details.

> Task :beam-runners-google-cloud-dataflow-java:shadowJar
> Task :beam-sdks-java-harness:classes
> Task :beam-sdks-java-harness:jar
> Task :beam-sdks-java-harness:shadowJar

> Task :beam-runners-java-fn-execution:compileJava
Note: <https://builds.apache.org/job/beam_PostCommit_Java_ValidatesRunner_Dataflow/ws/src/runners/java-fn-execution/src/main/java/org/apache/beam/runners/fnexecution/ServerFactory.java>
uses or overrides a deprecated API.
Note: Recompile with -Xlint:deprecation for details.
Note: Some input files use unchecked or unsafe operations.
Note: Recompile with -Xlint:unchecked for details.

> Task :beam-runners-java-fn-execution:classes
> Task :beam-runners-java-fn-execution:shadowJar
> Task :beam-runners-google-cloud-dataflow-java-legacy-worker:compileJava
Note: Some input files use or override a deprecated API.
Note: Recompile with -Xlint:deprecation for details.
Note: Some input files use unchecked or unsafe operations.
Note: Recompile with -Xlint:unchecked for details.

> Task :beam-runners-google-cloud-dataflow-java-legacy-worker:classes
> Task :beam-runners-google-cloud-dataflow-java-legacy-worker:shadowJar
> Task :beam-runners-google-cloud-dataflow-java:validatesRunnerLegacyWorkerTest
Java HotSpot(TM) 64-Bit Server VM warning: #
# There is insufficient memory for the Java Runtime Environment to continue.
INFO: os::commit_memory(0x00007f42183a1000, 12288, 0) failed; error='Cannot allocate memory'
(errno=12)
# Native memory allocation (mmap) failed to map 12288 bytes for committing reserved memory.
# An error report file with more information is saved as:
# <https://builds.apache.org/job/beam_PostCommit_Java_ValidatesRunner_Dataflow/ws/src/runners/google-cloud-dataflow-java/hs_err_pid7651.log>

org.apache.beam.sdk.transforms.SplittableDoFnTest > testPairWithIndexWindowedTimestampedUnbounded
FAILED
    java.lang.RuntimeException at SplittableDoFnTest.java:226
        Caused by: java.io.IOException at SplittableDoFnTest.java:226
            Caused by: java.util.concurrent.ExecutionException at SplittableDoFnTest.java:226
                Caused by: java.io.IOException at SplittableDoFnTest.java:226
                    Caused by: com.google.api.client.googleapis.json.GoogleJsonResponseException
at SplittableDoFnTest.java:226

214 tests completed, 1 failed, 3 skipped

> Task :beam-runners-google-cloud-dataflow-java:validatesRunnerLegacyWorkerTest FAILED

FAILURE: Build failed with an exception.

* What went wrong:
Execution failed for task ':beam-runners-google-cloud-dataflow-java:validatesRunnerLegacyWorkerTest'.
> Process 'Gradle Test Executor 74' finished with non-zero exit value 1
  This problem might be caused by incorrect test process configuration.
  Please refer to the test execution section in the user guide at https://docs.gradle.org/4.10.3/userguide/java_plugin.html#sec:test_execution

* Try:
Run with --stacktrace option to get the stack trace. Run with --info or --debug option to
get more log output. Run with --scan to get full insights.

* Get more help at https://help.gradle.org

Deprecated Gradle features were used in this build, making it incompatible with Gradle 5.0.
Use '--warning-mode all' to show the individual deprecation warnings.
See https://docs.gradle.org/4.10.3/userguide/command_line_interface.html#sec:command_line_warnings

BUILD FAILED in 2h 27m 2s
58 actionable tasks: 53 executed, 5 from cache

Publishing build scan...
https://gradle.com/s/hg4wdlfwyfrla

Build step 'Invoke Gradle script' changed build result to FAILURE
Build step 'Invoke Gradle script' marked build as failure

---------------------------------------------------------------------
To unsubscribe, e-mail: builds-unsubscribe@beam.apache.org
For additional commands, e-mail: builds-help@beam.apache.org


Mime
View raw message