beam-builds mailing list archives

Site index · List index
Message view « Date » · « Thread »
Top « Date » · « Thread »
From Apache Jenkins Server <jenk...@builds.apache.org>
Subject Build failed in Jenkins: beam_PreCommit_JavaPortabilityApi_Cron #263
Date Tue, 08 Jan 2019 01:05:56 GMT
See <https://builds.apache.org/job/beam_PreCommit_JavaPortabilityApi_Cron/263/display/redirect?page=changes>

Changes:

[robinyqiu] Use millisecond resolution for output file names to ensure uniqueness

[melissapa] Add some Go examples to the code snippets. (#7084)

[kenn] [BEAM-6363] Upgrade Gearpump to 0.9.0

------------------------------------------
[...truncated 42.47 KB...]
Note: Some input files use unchecked or unsafe operations.
Note: Recompile with -Xlint:unchecked for details.

> Task :beam-sdks-java-io-google-cloud-platform:classes
> Task :beam-sdks-java-io-google-cloud-platform:shadowJar

> Task :beam-runners-core-java:compileJava
Note: Some input files use or override a deprecated API.
Note: Recompile with -Xlint:deprecation for details.
Note: Some input files use unchecked or unsafe operations.
Note: Recompile with -Xlint:unchecked for details.

> Task :beam-runners-core-java:classes
> Task :beam-sdks-java-core:compileTestJava
> Task :beam-runners-core-java:shadowJar

> Task :beam-sdks-java-core:compileTestJava
Note: Some input files use or override a deprecated API.
Note: Recompile with -Xlint:deprecation for details.
Note: Some input files use unchecked or unsafe operations.
Note: Recompile with -Xlint:unchecked for details.

> Task :beam-sdks-java-core:testClasses
> Task :beam-examples-java:compileJava
> Task :beam-examples-java:classes

> Task :beam-runners-google-cloud-dataflow-java:compileJava
Note: Some input files use or override a deprecated API.
Note: Recompile with -Xlint:deprecation for details.
Note: Some input files use unchecked or unsafe operations.
Note: Recompile with -Xlint:unchecked for details.

> Task :beam-runners-google-cloud-dataflow-java:classes
> Task :beam-runners-google-cloud-dataflow-java:shadowJar

> Task :beam-sdks-java-harness:compileJava
Note: Some input files use or override a deprecated API.
Note: Recompile with -Xlint:deprecation for details.
Note: Some input files use unchecked or unsafe operations.
Note: Recompile with -Xlint:unchecked for details.

> Task :beam-sdks-java-harness:classes
> Task :beam-sdks-java-harness:jar

> Task :beam-examples-java:compileTestJava
Note: Some input files use or override a deprecated API.
Note: Recompile with -Xlint:deprecation for details.
Note: Some input files use unchecked or unsafe operations.
Note: Recompile with -Xlint:unchecked for details.

> Task :beam-examples-java:testClasses
> Task :beam-sdks-java-core:shadowTestJar

> Task :beam-sdks-java-extensions-google-cloud-platform-core:compileTestJava
Note: Some input files use or override a deprecated API.
Note: Recompile with -Xlint:deprecation for details.

> Task :beam-sdks-java-extensions-google-cloud-platform-core:testClasses
> Task :beam-sdks-java-extensions-google-cloud-platform-core:shadowTestJar

> Task :beam-runners-core-java:compileTestJava
Note: Some input files use or override a deprecated API.
Note: Recompile with -Xlint:deprecation for details.
Note: Some input files use unchecked or unsafe operations.
Note: Recompile with -Xlint:unchecked for details.

> Task :beam-runners-core-java:testClasses
> Task :beam-runners-core-java:shadowTestJar
> Task :beam-sdks-java-harness:shadowJar

> Task :beam-sdks-go:resolveBuildDependencies
Resolving google.golang.org/api: commit='386d4e5f4f92f86e6aec85985761bba4b938a2d5', urls=[https://code.googlesource.com/google-api-go-client]

> Task :beam-sdks-java-container:copyDockerfileDependencies

> Task :beam-sdks-go:resolveBuildDependencies
Resolving google.golang.org/genproto: commit='2b5a72b8730b0b16380010cfe5286c42108d88e7', urls=[https://github.com/google/go-genproto]
Resolving google.golang.org/grpc: commit='7646b5360d049a7ca31e9133315db43456f39e2e', urls=[https://github.com/grpc/grpc-go]
Resolving cached github.com/coreos/etcd: commit='11214aa33bf5a47d3d9d8dafe0f6b97237dfe921',
urls=[https://github.com/coreos/etcd.git, git@github.com:coreos/etcd.git]
Resolving cached github.com/coreos/etcd: commit='11214aa33bf5a47d3d9d8dafe0f6b97237dfe921',
urls=[https://github.com/coreos/etcd.git, git@github.com:coreos/etcd.git]

> Task :beam-sdks-go:installDependencies

> Task :beam-runners-java-fn-execution:compileJava
Note: <https://builds.apache.org/job/beam_PreCommit_JavaPortabilityApi_Cron/ws/src/runners/java-fn-execution/src/main/java/org/apache/beam/runners/fnexecution/ServerFactory.java>
uses or overrides a deprecated API.
Note: Recompile with -Xlint:deprecation for details.
Note: Some input files use unchecked or unsafe operations.
Note: Recompile with -Xlint:unchecked for details.

> Task :beam-sdks-go:buildLinuxAmd64
> Task :beam-sdks-go:build

> Task :beam-sdks-java-container:resolveBuildDependencies
Resolving ./github.com/apache/beam/sdks/go@<https://builds.apache.org/job/beam_PreCommit_JavaPortabilityApi_Cron/ws/src/sdks/go>

> Task :beam-sdks-java-container:installDependencies
> Task :beam-runners-java-fn-execution:classes
> Task :beam-sdks-java-container:buildLinuxAmd64
> Task :beam-sdks-java-container:build
> Task :beam-sdks-java-container:dockerPrepare
> Task :beam-runners-java-fn-execution:shadowJar

> Task :beam-sdks-java-container:docker
8: Pulling from library/openjdk
Digest: sha256:fd26a0ce164bee965095ba91ee7c4f21f3f98f54247e240c1f98255bd200cbe8
Status: Downloaded newer image for openjdk:8
 ---> f2194a7e67df
Step 2/7 : MAINTAINER "Apache Beam <dev@beam.apache.org>"
 ---> Running in 5007b4571400
 ---> e477ab609f58
Removing intermediate container 5007b4571400
Step 3/7 : ADD target/slf4j-api.jar /opt/apache/beam/jars/
 ---> 1915e8dfbfc0
Removing intermediate container cdbfe95558c3
Step 4/7 : ADD target/slf4j-jdk14.jar /opt/apache/beam/jars/
 ---> b28b16e99cb3
Removing intermediate container 46dd30443a8a
Step 5/7 : ADD target/beam-sdks-java-harness.jar /opt/apache/beam/jars/
 ---> c41b00b017e3
Removing intermediate container 9f29933ea412
Step 6/7 : ADD target/linux_amd64/boot /opt/apache/beam/
 ---> c4388cebb5d2
Removing intermediate container 1ea7cfcb16e9
Step 7/7 : ENTRYPOINT /opt/apache/beam/boot
 ---> Running in e33b4ae3d60d
 ---> 4d18965e0e39
Removing intermediate container e33b4ae3d60d
Successfully built 4d18965e0e39
Successfully tagged jenkins-docker-apache.bintray.io/beam/java:latest

> Task :beam-runners-google-cloud-dataflow-java:buildAndPushDockerContainer
The push refers to a repository [us.gcr.io/apache-beam-testing/java-postcommit-it/java]
16877243d94e: Preparing
b59811f55b5d: Preparing
eab643fea7ea: Preparing
195934afcc1f: Preparing
08b1513fa90e: Preparing
38af37073821: Preparing
a7702ebc484e: Preparing
7b1186903462: Preparing
d2217ead3a1c: Preparing
b53b57a50746: Preparing
d2518892581f: Preparing
c581f4ede92d: Preparing
b53b57a50746: Waiting
7b1186903462: Waiting
d2518892581f: Waiting
d2217ead3a1c: Waiting
38af37073821: Waiting
a7702ebc484e: Waiting
c581f4ede92d: Waiting
08b1513fa90e: Layer already exists
38af37073821: Layer already exists
a7702ebc484e: Layer already exists
7b1186903462: Layer already exists
d2217ead3a1c: Layer already exists
b53b57a50746: Layer already exists
d2518892581f: Layer already exists
c581f4ede92d: Layer already exists
195934afcc1f: Pushed
eab643fea7ea: Pushed
16877243d94e: Pushed

> Task :beam-runners-direct-java:compileJava
Note: Some input files use or override a deprecated API.
Note: Recompile with -Xlint:deprecation for details.
Note: Some input files use unchecked or unsafe operations.
Note: Recompile with -Xlint:unchecked for details.

> Task :beam-runners-direct-java:classes

> Task :beam-runners-google-cloud-dataflow-java:buildAndPushDockerContainer
b59811f55b5d: Pushed
20190108000020: digest: sha256:9bd31f67664640c50b2d4bfab52aa1776face53448deb4fe0994c0ec96e5521a
size: 2841

> Task :beam-runners-google-cloud-dataflow-java-fn-api-worker:compileJava
Note: Some input files use or override a deprecated API.
Note: Recompile with -Xlint:deprecation for details.
Note: Some input files use unchecked or unsafe operations.
Note: Recompile with -Xlint:unchecked for details.

> Task :beam-runners-google-cloud-dataflow-java-fn-api-worker:classes
> Task :beam-runners-direct-java:shadowJar
> Task :beam-examples-java:shadowJar
> Task :beam-examples-java:shadowTestJar
> Task :beam-runners-google-cloud-dataflow-java-fn-api-worker:shadowJar
> Task :beam-runners-google-cloud-dataflow-java-fn-api-worker:jar

> Task :beam-runners-google-cloud-dataflow-java-fn-api-worker:compileTestJava
Note: Some input files use or override a deprecated API.
Note: Recompile with -Xlint:deprecation for details.
Note: Some input files use unchecked or unsafe operations.
Note: Recompile with -Xlint:unchecked for details.

> Task :beam-runners-google-cloud-dataflow-java-fn-api-worker:testClasses
> Task :beam-runners-google-cloud-dataflow-java-fn-api-worker:packageTests
> Task :beam-runners-google-cloud-dataflow-java-fn-api-worker:assemble
> Task :beam-runners-google-cloud-dataflow-java-fn-api-worker:checkstyleMain SKIPPED
> Task :beam-runners-google-cloud-dataflow-java-fn-api-worker:checkstyleTest SKIPPED
> Task :beam-runners-google-cloud-dataflow-java-fn-api-worker:javadoc SKIPPED
> Task :beam-runners-google-cloud-dataflow-java-examples:preCommitFnApiWorker
> Task :beam-runners-google-cloud-dataflow-java-fn-api-worker:test
> Task :beam-runners-google-cloud-dataflow-java-fn-api-worker:check
> Task :beam-runners-google-cloud-dataflow-java-fn-api-worker:build

> Task :beam-runners-google-cloud-dataflow-java-examples:preCommitFnApiWorker

org.apache.beam.examples.WordCountIT > testE2EWordCount FAILED
    java.lang.RuntimeException at WordCountIT.java:69

3 tests completed, 1 failed

> Task :beam-runners-google-cloud-dataflow-java-examples:preCommitFnApiWorker FAILED

> Task :beam-runners-google-cloud-dataflow-java:cleanUpDockerImages
Untagged: us.gcr.io/apache-beam-testing/java-postcommit-it/java:20190108000020
Untagged: us.gcr.io/apache-beam-testing/java-postcommit-it/java@sha256:9bd31f67664640c50b2d4bfab52aa1776face53448deb4fe0994c0ec96e5521a
Digests:
- us.gcr.io/apache-beam-testing/java-postcommit-it/java@sha256:9bd31f67664640c50b2d4bfab52aa1776face53448deb4fe0994c0ec96e5521a
  Associated tags:
 - 20190108000020
Tags:
- us.gcr.io/apache-beam-testing/java-postcommit-it/java:20190108000020
Deleted [us.gcr.io/apache-beam-testing/java-postcommit-it/java:20190108000020].
Deleted [us.gcr.io/apache-beam-testing/java-postcommit-it/java@sha256:9bd31f67664640c50b2d4bfab52aa1776face53448deb4fe0994c0ec96e5521a].

FAILURE: Build failed with an exception.

* What went wrong:
Execution failed for task ':beam-runners-google-cloud-dataflow-java-examples:preCommitFnApiWorker'.
> There were failing tests. See the report at: file://<https://builds.apache.org/job/beam_PreCommit_JavaPortabilityApi_Cron/ws/src/runners/google-cloud-dataflow-java/examples/build/reports/tests/preCommitFnApiWorker/index.html>

* Try:
Run with --stacktrace option to get the stack trace. Run with --info or --debug option to
get more log output. Run with --scan to get full insights.

* Get more help at https://help.gradle.org

Deprecated Gradle features were used in this build, making it incompatible with Gradle 5.0.
Use '--warning-mode all' to show the individual deprecation warnings.
See https://docs.gradle.org/4.10.3/userguide/command_line_interface.html#sec:command_line_warnings

BUILD FAILED in 1h 5m 43s
92 actionable tasks: 86 executed, 5 from cache, 1 up-to-date

Publishing build scan...
https://gradle.com/s/tp74u5vkonyvq

Build step 'Invoke Gradle script' changed build result to FAILURE
Build step 'Invoke Gradle script' marked build as failure

---------------------------------------------------------------------
To unsubscribe, e-mail: builds-unsubscribe@beam.apache.org
For additional commands, e-mail: builds-help@beam.apache.org


Mime
View raw message