beam-builds mailing list archives

Site index · List index
Message view « Date » · « Thread »
Top « Date » · « Thread »
From Apache Jenkins Server <jenk...@builds.apache.org>
Subject Build failed in Jenkins: beam_PostCommit_Java_PVR_Flink_Streaming #470
Date Thu, 17 Jan 2019 00:21:48 GMT
See <https://builds.apache.org/job/beam_PostCommit_Java_PVR_Flink_Streaming/470/display/redirect?page=changes>

Changes:

[klk] Turn off spotless paddedCell

------------------------------------------
[...truncated 2.13 KB...]
Parallel execution is an incubating feature.
> Task :buildSrc:compileJava NO-SOURCE
> Task :buildSrc:compileGroovy FROM-CACHE
> Task :buildSrc:processResources NO-SOURCE
> Task :buildSrc:classes UP-TO-DATE
> Task :buildSrc:jar
> Task :buildSrc:assemble
> Task :buildSrc:spotlessGroovy
> Task :buildSrc:spotlessGroovyCheck
> Task :buildSrc:spotlessGroovyGradle
> Task :buildSrc:spotlessGroovyGradleCheck
> Task :buildSrc:spotlessCheck
> Task :buildSrc:compileTestJava NO-SOURCE
> Task :buildSrc:compileTestGroovy NO-SOURCE
> Task :buildSrc:processTestResources NO-SOURCE
> Task :buildSrc:testClasses UP-TO-DATE
> Task :buildSrc:test NO-SOURCE
> Task :buildSrc:check
> Task :buildSrc:build
Parallel execution with configuration on demand is an incubating feature.

> Configure project :beam-model-pipeline
applyPortabilityNature with [shadowJarValidationExcludes:[org/apache/beam/model/pipeline/v1/**]]
for project beam-model-pipeline

> Configure project :beam-model-fn-execution
applyPortabilityNature with [shadowJarValidationExcludes:[org/apache/beam/model/fnexecution/v1/**]]
for project beam-model-fn-execution

> Configure project :beam-model-job-management
applyPortabilityNature with [shadowJarValidationExcludes:[org/apache/beam/model/jobmanagement/v1/**]]
for project beam-model-job-management

> Task :beam-sdks-java-core:generateAvroProtocol NO-SOURCE
> Task :beam-runners-core-java:processResources NO-SOURCE
> Task :beam-sdks-java-fn-execution:processResources NO-SOURCE
> Task :beam-runners-java-fn-execution:processResources NO-SOURCE
> Task :beam-sdks-java-harness:processResources NO-SOURCE
> Task :beam-runners-core-java:processTestResources NO-SOURCE
> Task :beam-sdks-java-extensions-google-cloud-platform-core:processResources NO-SOURCE
> Task :beam-vendor-sdks-java-extensions-protobuf:processResources NO-SOURCE
> Task :beam-runners-core-construction-java:processResources NO-SOURCE
> Task :beam-sdks-java-core:generateAvroJava NO-SOURCE
> Task :beam-runners-flink_2.11:processResources
> Task :beam-model-fn-execution:extractProto
> Task :beam-model-job-management:extractProto
> Task :beam-runners-core-construction-java:processTestResources NO-SOURCE
> Task :beam-runners-reference-java:processResources NO-SOURCE
> Task :beam-sdks-java-io-google-cloud-platform:processResources NO-SOURCE
> Task :beam-sdks-java-extensions-protobuf:extractProto
> Task :beam-runners-reference-java:processTestResources NO-SOURCE
> Task :beam-runners-flink_2.11:processTestResources
> Task :beam-sdks-java-extensions-protobuf:processResources NO-SOURCE
> Task :beam-model-job-management:processResources
> Task :beam-model-fn-execution:processResources
> Task :beam-sdks-java-core:generateGrammarSource FROM-CACHE
> Task :beam-sdks-java-core:processResources
> Task :beam-sdks-java-core:generateTestAvroProtocol NO-SOURCE
> Task :beam-model-pipeline:extractIncludeProto
> Task :beam-model-pipeline:extractProto
> Task :beam-sdks-java-core:generateTestAvroJava
> Task :beam-sdks-java-core:generateTestGrammarSource NO-SOURCE
> Task :beam-sdks-java-core:processTestResources NO-SOURCE
> Task :beam-model-pipeline:generateProto
> Task :beam-model-pipeline:compileJava
> Task :beam-model-pipeline:processResources
> Task :beam-model-pipeline:classes
> Task :beam-model-pipeline:jar
> Task :beam-model-job-management:extractIncludeProto
> Task :beam-model-fn-execution:extractIncludeProto
> Task :beam-model-job-management:generateProto
> Task :beam-model-fn-execution:generateProto
> Task :beam-model-job-management:compileJava FROM-CACHE
> Task :beam-model-job-management:classes
> Task :beam-model-pipeline:shadowJar
> Task :beam-model-job-management:shadowJar
> Task :beam-model-fn-execution:compileJava
> Task :beam-model-fn-execution:classes
> Task :beam-model-fn-execution:shadowJar

> Task :beam-sdks-java-core:compileJava
Note: Some input files use or override a deprecated API.
Note: Recompile with -Xlint:deprecation for details.
Note: Some input files use unchecked or unsafe operations.
Note: Recompile with -Xlint:unchecked for details.

> Task :beam-sdks-java-core:classes
> Task :beam-sdks-java-core:shadowJar
> Task :beam-sdks-java-extensions-protobuf:extractIncludeProto
> Task :beam-sdks-java-extensions-protobuf:generateProto NO-SOURCE

> Task :beam-vendor-sdks-java-extensions-protobuf:compileJava
Note: Some input files use or override a deprecated API.
Note: Recompile with -Xlint:deprecation for details.

> Task :beam-sdks-java-extensions-protobuf:compileJava
Note: Some input files use or override a deprecated API.
Note: Recompile with -Xlint:deprecation for details.

> Task :beam-sdks-java-extensions-protobuf:classes
> Task :beam-vendor-sdks-java-extensions-protobuf:classes
> Task :beam-sdks-java-extensions-protobuf:shadowJar

> Task :beam-sdks-java-fn-execution:compileJava
Note: Some input files use or override a deprecated API.
Note: Recompile with -Xlint:deprecation for details.
Note: Some input files use unchecked or unsafe operations.
Note: Recompile with -Xlint:unchecked for details.

> Task :beam-sdks-java-fn-execution:classes
> Task :beam-sdks-java-fn-execution:shadowJar
> Task :beam-vendor-sdks-java-extensions-protobuf:shadowJar

> Task :beam-sdks-java-extensions-google-cloud-platform-core:compileJava
Note: <https://builds.apache.org/job/beam_PostCommit_Java_PVR_Flink_Streaming/ws/src/sdks/java/extensions/google-cloud-platform-core/src/main/java/org/apache/beam/sdk/util/GcsUtil.java>
uses or overrides a deprecated API.
Note: Recompile with -Xlint:deprecation for details.

> Task :beam-sdks-java-extensions-google-cloud-platform-core:classes
> Task :beam-sdks-java-extensions-google-cloud-platform-core:shadowJar

> Task :beam-runners-core-construction-java:compileJava
Note: Some input files use or override a deprecated API.
Note: Recompile with -Xlint:deprecation for details.
Note: Some input files use unchecked or unsafe operations.
Note: Recompile with -Xlint:unchecked for details.

> Task :beam-runners-core-construction-java:classes
> Task :beam-runners-core-construction-java:shadowJar
> Task :beam-sdks-java-core:compileTestJava

> Task :beam-runners-core-java:compileJava
Note: Some input files use or override a deprecated API.
Note: Recompile with -Xlint:deprecation for details.
Note: Some input files use unchecked or unsafe operations.
Note: Recompile with -Xlint:unchecked for details.

> Task :beam-runners-core-java:classes

> Task :beam-sdks-java-io-google-cloud-platform:compileJava
Note: Some input files use or override a deprecated API.
Note: Recompile with -Xlint:deprecation for details.
Note: Some input files use unchecked or unsafe operations.
Note: Recompile with -Xlint:unchecked for details.

> Task :beam-runners-core-java:shadowJar
> Task :beam-sdks-java-io-google-cloud-platform:classes
> Task :beam-sdks-java-io-google-cloud-platform:shadowJar

> Task :beam-sdks-java-core:compileTestJava
Note: Some input files use or override a deprecated API.
Note: Recompile with -Xlint:deprecation for details.
Note: Some input files use unchecked or unsafe operations.
Note: Recompile with -Xlint:unchecked for details.

> Task :beam-runners-core-construction-java:compileTestJava
Note: Some input files use or override a deprecated API.
Note: Recompile with -Xlint:deprecation for details.
Note: Some input files use unchecked or unsafe operations.
Note: Recompile with -Xlint:unchecked for details.

> Task :beam-runners-core-construction-java:testClasses
> Task :beam-sdks-java-core:testClasses
> Task :beam-runners-core-construction-java:shadowTestJar

> Task :beam-sdks-java-harness:compileJava
Note: Some input files use or override a deprecated API.
Note: Recompile with -Xlint:deprecation for details.
Note: Some input files use unchecked or unsafe operations.
Note: Recompile with -Xlint:unchecked for details.

> Task :beam-sdks-java-harness:classes
> Task :beam-sdks-java-harness:jar
> Task :beam-sdks-java-core:shadowTestJar

> Task :beam-runners-core-java:compileTestJava
Note: Some input files use or override a deprecated API.
Note: Recompile with -Xlint:deprecation for details.
Note: Some input files use unchecked or unsafe operations.
Note: Recompile with -Xlint:unchecked for details.

> Task :beam-runners-core-java:testClasses
> Task :beam-runners-core-java:shadowTestJar
> Task :beam-sdks-java-harness:shadowJar

> Task :beam-runners-java-fn-execution:compileJava
Note: <https://builds.apache.org/job/beam_PostCommit_Java_PVR_Flink_Streaming/ws/src/runners/java-fn-execution/src/main/java/org/apache/beam/runners/fnexecution/ServerFactory.java>
uses or overrides a deprecated API.
Note: Recompile with -Xlint:deprecation for details.
Note: Some input files use unchecked or unsafe operations.
Note: Recompile with -Xlint:unchecked for details.

> Task :beam-runners-java-fn-execution:classes
> Task :beam-runners-java-fn-execution:shadowJar
> Task :beam-runners-reference-java:compileJava
> Task :beam-runners-reference-java:classes
> Task :beam-runners-reference-java:shadowJar

> Task :beam-runners-reference-java:compileTestJava
Note: <https://builds.apache.org/job/beam_PostCommit_Java_PVR_Flink_Streaming/ws/src/runners/reference/java/src/test/java/org/apache/beam/runners/reference/CloseableResourceTest.java>
uses or overrides a deprecated API.
Note: Recompile with -Xlint:deprecation for details.

> Task :beam-runners-reference-java:testClasses
> Task :beam-runners-reference-java:shadowTestJar

> Task :beam-runners-flink_2.11:compileJava
Note: Some input files use or override a deprecated API.
Note: Recompile with -Xlint:deprecation for details.
Note: Some input files use unchecked or unsafe operations.
Note: Recompile with -Xlint:unchecked for details.

> Task :beam-runners-flink_2.11:classes
> Task :beam-runners-flink_2.11:shadowJar

> Task :beam-runners-flink_2.11:compileTestJava
Note: Some input files use or override a deprecated API.
Note: Recompile with -Xlint:deprecation for details.
Note: Some input files use unchecked or unsafe operations.
Note: Recompile with -Xlint:unchecked for details.

> Task :beam-runners-flink_2.11:testClasses
> Task :beam-runners-flink_2.11:shadowTestJar
> Task :beam-runners-flink_2.11-job-server:validatesPortableRunnerStreaming

org.apache.beam.sdk.transforms.ViewTest > testWindowedSideInputFixedToFixedWithDefault
FAILED
    java.lang.OutOfMemoryError at ViewTest.java:1455

196 tests completed, 1 failed, 2 skipped

> Task :beam-runners-flink_2.11-job-server:validatesPortableRunnerStreaming FAILED

FAILURE: Build failed with an exception.

* What went wrong:
Execution failed for task ':beam-runners-flink_2.11-job-server:validatesPortableRunnerStreaming'.
> There were failing tests. See the report at: file://<https://builds.apache.org/job/beam_PostCommit_Java_PVR_Flink_Streaming/ws/src/runners/flink/job-server/build/reports/tests/validatesPortableRunnerStreaming/index.html>

* Try:
Run with --stacktrace option to get the stack trace. Run with --info or --debug option to
get more log output. Run with --scan to get full insights.

* Get more help at https://help.gradle.org

Deprecated Gradle features were used in this build, making it incompatible with Gradle 5.0.
Use '--warning-mode all' to show the individual deprecation warnings.
See https://docs.gradle.org/4.10.3/userguide/command_line_interface.html#sec:command_line_warnings

BUILD FAILED in 25m 4s
62 actionable tasks: 60 executed, 2 from cache

Publishing build scan...
https://gradle.com/s/bxafeuscfqy5y

Build step 'Invoke Gradle script' changed build result to FAILURE
Build step 'Invoke Gradle script' marked build as failure

---------------------------------------------------------------------
To unsubscribe, e-mail: builds-unsubscribe@beam.apache.org
For additional commands, e-mail: builds-help@beam.apache.org


Mime
View raw message