beam-builds mailing list archives

Site index · List index
Message view « Date » · « Thread »
Top « Date » · « Thread »
From Apache Jenkins Server <jenk...@builds.apache.org>
Subject Build failed in Jenkins: beam_PostCommit_Python_VR_Flink #1225
Date Thu, 03 Jan 2019 19:52:16 GMT
See <https://builds.apache.org/job/beam_PostCommit_Python_VR_Flink/1225/display/redirect?page=changes>

Changes:

[ehudm] [BEAM-5959] Reorder methods according to convention

------------------------------------------
[...truncated 3.86 MB...]
[flink-akka.actor.default-dispatcher-5] INFO org.apache.flink.runtime.jobmaster.slotpool.SlotPool - Cannot serve slot request, no ResourceManager connected. Adding as pending request [SlotRequestId{0b6b1580f20e094eb26e308a1657c21f}]
[jobmanager-future-thread-1] INFO org.apache.flink.runtime.highavailability.nonha.embedded.EmbeddedLeaderService - Received confirmation of leadership for leader akka://flink/user/jobmanager_45 , session=8b2f5f33-1caf-45ca-8aa2-57ec4b83f45b
[flink-akka.actor.default-dispatcher-2] INFO org.apache.flink.runtime.jobmaster.JobMaster - Connecting to ResourceManager akka://flink/user/resourcemanager_2266ced5-369e-47fa-9be3-a9c36deafaa2(85cda569706809c81c3d22b6bb564304)
[flink-akka.actor.default-dispatcher-5] INFO org.apache.flink.runtime.jobmaster.JobMaster - Resolved ResourceManager address, beginning registration
[flink-akka.actor.default-dispatcher-5] INFO org.apache.flink.runtime.jobmaster.JobMaster - Registration at ResourceManager attempt 1 (timeout=100ms)
[flink-akka.actor.default-dispatcher-2] INFO org.apache.flink.runtime.resourcemanager.StandaloneResourceManager - Registering job manager 8aa257ec4b83f45b8b2f5f331caf45ca@akka://flink/user/jobmanager_45 for job 8a60c8f07ccf9f8cec553eaf2cbd3e0e.
[flink-akka.actor.default-dispatcher-3] INFO org.apache.flink.runtime.resourcemanager.StandaloneResourceManager - Registered job manager 8aa257ec4b83f45b8b2f5f331caf45ca@akka://flink/user/jobmanager_45 for job 8a60c8f07ccf9f8cec553eaf2cbd3e0e.
[flink-akka.actor.default-dispatcher-2] INFO org.apache.flink.runtime.jobmaster.JobMaster - JobManager successfully registered at ResourceManager, leader id: 85cda569706809c81c3d22b6bb564304.
[flink-akka.actor.default-dispatcher-5] INFO org.apache.flink.runtime.jobmaster.slotpool.SlotPool - Requesting new slot [SlotRequestId{0b6b1580f20e094eb26e308a1657c21f}] and profile ResourceProfile{cpuCores=-1.0, heapMemoryInMB=-1, directMemoryInMB=0, nativeMemoryInMB=0, networkMemoryInMB=0} from resource manager.
[flink-akka.actor.default-dispatcher-5] INFO org.apache.flink.runtime.resourcemanager.StandaloneResourceManager - Request slot with profile ResourceProfile{cpuCores=-1.0, heapMemoryInMB=-1, directMemoryInMB=0, nativeMemoryInMB=0, networkMemoryInMB=0} for job 8a60c8f07ccf9f8cec553eaf2cbd3e0e with allocation id AllocationID{ec3f57061f92c0ff3e5cfe1e2e3c0fe3}.
[flink-akka.actor.default-dispatcher-2] INFO org.apache.flink.runtime.taskexecutor.TaskExecutor - Receive slot request AllocationID{ec3f57061f92c0ff3e5cfe1e2e3c0fe3} for job 8a60c8f07ccf9f8cec553eaf2cbd3e0e from resource manager with leader id 85cda569706809c81c3d22b6bb564304.
[flink-akka.actor.default-dispatcher-2] INFO org.apache.flink.runtime.taskexecutor.TaskExecutor - Allocated slot for AllocationID{ec3f57061f92c0ff3e5cfe1e2e3c0fe3}.
[flink-akka.actor.default-dispatcher-2] INFO org.apache.flink.runtime.taskexecutor.JobLeaderService - Add job 8a60c8f07ccf9f8cec553eaf2cbd3e0e for job leader monitoring.
[flink-akka.actor.default-dispatcher-5] INFO org.apache.flink.runtime.taskexecutor.JobLeaderService - Try to register at job manager akka://flink/user/jobmanager_45 with leader id 8b2f5f33-1caf-45ca-8aa2-57ec4b83f45b.
[flink-akka.actor.default-dispatcher-4] INFO org.apache.flink.runtime.taskexecutor.JobLeaderService - Resolved JobManager address, beginning registration
[flink-akka.actor.default-dispatcher-4] INFO org.apache.flink.runtime.taskexecutor.JobLeaderService - Registration at JobManager attempt 1 (timeout=100ms)
[flink-akka.actor.default-dispatcher-4] INFO org.apache.flink.runtime.taskexecutor.JobLeaderService - Successful registration at job manager akka://flink/user/jobmanager_45 for job 8a60c8f07ccf9f8cec553eaf2cbd3e0e.
[flink-akka.actor.default-dispatcher-4] INFO org.apache.flink.runtime.taskexecutor.TaskExecutor - Establish JobManager connection for job 8a60c8f07ccf9f8cec553eaf2cbd3e0e.
[flink-akka.actor.default-dispatcher-4] INFO org.apache.flink.runtime.taskexecutor.TaskExecutor - Offer reserved slots to the leader of job 8a60c8f07ccf9f8cec553eaf2cbd3e0e.
[flink-akka.actor.default-dispatcher-4] INFO org.apache.flink.runtime.taskexecutor.slot.TaskSlotTable - Activate slot AllocationID{ec3f57061f92c0ff3e5cfe1e2e3c0fe3}.
[flink-akka.actor.default-dispatcher-4] INFO org.apache.flink.runtime.executiongraph.ExecutionGraph - Source: Impulse -> [4]assert_that/{Create, Group} (1/1) (2138398d17583365b57739de2785cc1f) switched from SCHEDULED to DEPLOYING.
[flink-akka.actor.default-dispatcher-4] INFO org.apache.flink.runtime.executiongraph.ExecutionGraph - Deploying Source: Impulse -> [4]assert_that/{Create, Group} (1/1) (attempt #0) to localhost
[flink-akka.actor.default-dispatcher-4] INFO org.apache.flink.runtime.executiongraph.ExecutionGraph - Source: Impulse -> [1]Create/FlatMap(<lambda at core.py:2029>) (1/1) (648a24267f4412dd4e2eca6b8932774c) switched from SCHEDULED to DEPLOYING.
[flink-akka.actor.default-dispatcher-4] INFO org.apache.flink.runtime.executiongraph.ExecutionGraph - Deploying Source: Impulse -> [1]Create/FlatMap(<lambda at core.py:2029>) (1/1) (attempt #0) to localhost
[flink-akka.actor.default-dispatcher-4] INFO org.apache.flink.runtime.executiongraph.ExecutionGraph - [3]{Create, Map(<lambda at fn_api_runner_test.py:405>), WindowInto(WindowIntoFn)} -> ToKeyedWorkItem (1/1) (bbfcdbfff8fece8929b6dd10477aef02) switched from SCHEDULED to DEPLOYING.
[flink-akka.actor.default-dispatcher-4] INFO org.apache.flink.runtime.executiongraph.ExecutionGraph - Deploying [3]{Create, Map(<lambda at fn_api_runner_test.py:405>), WindowInto(WindowIntoFn)} -> ToKeyedWorkItem (1/1) (attempt #0) to localhost
[flink-akka.actor.default-dispatcher-4] INFO org.apache.flink.runtime.executiongraph.ExecutionGraph - GroupByKey -> [5]{Map(<lambda at fn_api_runner_test.py:408>), assert_that} (1/1) (93f9bdf92ddcc167be749dbbff5fa9be) switched from SCHEDULED to DEPLOYING.
[flink-akka.actor.default-dispatcher-4] INFO org.apache.flink.runtime.executiongraph.ExecutionGraph - Deploying GroupByKey -> [5]{Map(<lambda at fn_api_runner_test.py:408>), assert_that} (1/1) (attempt #0) to localhost
[flink-akka.actor.default-dispatcher-4] INFO org.apache.flink.runtime.executiongraph.ExecutionGraph - ToKeyedWorkItem (1/1) (912eec61c677a47fd573072f94808a20) switched from SCHEDULED to DEPLOYING.
[flink-akka.actor.default-dispatcher-4] INFO org.apache.flink.runtime.executiongraph.ExecutionGraph - Deploying ToKeyedWorkItem (1/1) (attempt #0) to localhost
[flink-akka.actor.default-dispatcher-4] INFO org.apache.flink.runtime.executiongraph.ExecutionGraph - assert_that/Group/GroupByKey -> [3]assert_that/{Group, Unkey, Match} (1/1) (860e7cc8b754fd697560f64a6e9f9428) switched from SCHEDULED to DEPLOYING.
[flink-akka.actor.default-dispatcher-4] INFO org.apache.flink.runtime.executiongraph.ExecutionGraph - Deploying assert_that/Group/GroupByKey -> [3]assert_that/{Group, Unkey, Match} (1/1) (attempt #0) to localhost
[flink-akka.actor.default-dispatcher-2] INFO org.apache.flink.runtime.taskexecutor.TaskExecutor - Received task Source: Impulse -> [4]assert_that/{Create, Group} (1/1).
[Source: Impulse -> [4]assert_that/{Create, Group} (1/1)] INFO org.apache.flink.runtime.taskmanager.Task - Source: Impulse -> [4]assert_that/{Create, Group} (1/1) (2138398d17583365b57739de2785cc1f) switched from CREATED to DEPLOYING.
[Source: Impulse -> [4]assert_that/{Create, Group} (1/1)] INFO org.apache.flink.runtime.taskmanager.Task - Creating FileSystem stream leak safety net for task Source: Impulse -> [4]assert_that/{Create, Group} (1/1) (2138398d17583365b57739de2785cc1f) [DEPLOYING]
[Source: Impulse -> [4]assert_that/{Create, Group} (1/1)] INFO org.apache.flink.runtime.taskmanager.Task - Loading JAR files for task Source: Impulse -> [4]assert_that/{Create, Group} (1/1) (2138398d17583365b57739de2785cc1f) [DEPLOYING].
[flink-akka.actor.default-dispatcher-2] INFO org.apache.flink.runtime.taskexecutor.TaskExecutor - Received task Source: Impulse -> [1]Create/FlatMap(<lambda at core.py:2029>) (1/1).
[Source: Impulse -> [4]assert_that/{Create, Group} (1/1)] INFO org.apache.flink.runtime.taskmanager.Task - Registering task at network: Source: Impulse -> [4]assert_that/{Create, Group} (1/1) (2138398d17583365b57739de2785cc1f) [DEPLOYING].
[Source: Impulse -> [1]Create/FlatMap(<lambda at core.py:2029>) (1/1)] INFO org.apache.flink.runtime.taskmanager.Task - Source: Impulse -> [1]Create/FlatMap(<lambda at core.py:2029>) (1/1) (648a24267f4412dd4e2eca6b8932774c) switched from CREATED to DEPLOYING.
[Source: Impulse -> [1]Create/FlatMap(<lambda at core.py:2029>) (1/1)] INFO org.apache.flink.runtime.taskmanager.Task - Creating FileSystem stream leak safety net for task Source: Impulse -> [1]Create/FlatMap(<lambda at core.py:2029>) (1/1) (648a24267f4412dd4e2eca6b8932774c) [DEPLOYING]
[Source: Impulse -> [1]Create/FlatMap(<lambda at core.py:2029>) (1/1)] INFO org.apache.flink.runtime.taskmanager.Task - Loading JAR files for task Source: Impulse -> [1]Create/FlatMap(<lambda at core.py:2029>) (1/1) (648a24267f4412dd4e2eca6b8932774c) [DEPLOYING].
[Source: Impulse -> [1]Create/FlatMap(<lambda at core.py:2029>) (1/1)] INFO org.apache.flink.runtime.taskmanager.Task - Registering task at network: Source: Impulse -> [1]Create/FlatMap(<lambda at core.py:2029>) (1/1) (648a24267f4412dd4e2eca6b8932774c) [DEPLOYING].
[flink-akka.actor.default-dispatcher-2] INFO org.apache.flink.runtime.taskexecutor.TaskExecutor - Received task [3]{Create, Map(<lambda at fn_api_runner_test.py:405>), WindowInto(WindowIntoFn)} -> ToKeyedWorkItem (1/1).
[[3]{Create, Map(<lambda at fn_api_runner_test.py:405>), WindowInto(WindowIntoFn)} -> ToKeyedWorkItem (1/1)] INFO org.apache.flink.runtime.taskmanager.Task - [3]{Create, Map(<lambda at fn_api_runner_test.py:405>), WindowInto(WindowIntoFn)} -> ToKeyedWorkItem (1/1) (bbfcdbfff8fece8929b6dd10477aef02) switched from CREATED to DEPLOYING.
[[3]{Create, Map(<lambda at fn_api_runner_test.py:405>), WindowInto(WindowIntoFn)} -> ToKeyedWorkItem (1/1)] INFO org.apache.flink.runtime.taskmanager.Task - Creating FileSystem stream leak safety net for task [3]{Create, Map(<lambda at fn_api_runner_test.py:405>), WindowInto(WindowIntoFn)} -> ToKeyedWorkItem (1/1) (bbfcdbfff8fece8929b6dd10477aef02) [DEPLOYING]
[[3]{Create, Map(<lambda at fn_api_runner_test.py:405>), WindowInto(WindowIntoFn)} -> ToKeyedWorkItem (1/1)] INFO org.apache.flink.runtime.taskmanager.Task - Loading JAR files for task [3]{Create, Map(<lambda at fn_api_runner_test.py:405>), WindowInto(WindowIntoFn)} -> ToKeyedWorkItem (1/1) (bbfcdbfff8fece8929b6dd10477aef02) [DEPLOYING].
[[3]{Create, Map(<lambda at fn_api_runner_test.py:405>), WindowInto(WindowIntoFn)} -> ToKeyedWorkItem (1/1)] INFO org.apache.flink.runtime.taskmanager.Task - Registering task at network: [3]{Create, Map(<lambda at fn_api_runner_test.py:405>), WindowInto(WindowIntoFn)} -> ToKeyedWorkItem (1/1) (bbfcdbfff8fece8929b6dd10477aef02) [DEPLOYING].
[flink-akka.actor.default-dispatcher-2] INFO org.apache.flink.runtime.taskexecutor.TaskExecutor - Received task GroupByKey -> [5]{Map(<lambda at fn_api_runner_test.py:408>), assert_that} (1/1).
[GroupByKey -> [5]{Map(<lambda at fn_api_runner_test.py:408>), assert_that} (1/1)] INFO org.apache.flink.runtime.taskmanager.Task - GroupByKey -> [5]{Map(<lambda at fn_api_runner_test.py:408>), assert_that} (1/1) (93f9bdf92ddcc167be749dbbff5fa9be) switched from CREATED to DEPLOYING.
[GroupByKey -> [5]{Map(<lambda at fn_api_runner_test.py:408>), assert_that} (1/1)] INFO org.apache.flink.runtime.taskmanager.Task - Creating FileSystem stream leak safety net for task GroupByKey -> [5]{Map(<lambda at fn_api_runner_test.py:408>), assert_that} (1/1) (93f9bdf92ddcc167be749dbbff5fa9be) [DEPLOYING]
[GroupByKey -> [5]{Map(<lambda at fn_api_runner_test.py:408>), assert_that} (1/1)] INFO org.apache.flink.runtime.taskmanager.Task - Loading JAR files for task GroupByKey -> [5]{Map(<lambda at fn_api_runner_test.py:408>), assert_that} (1/1) (93f9bdf92ddcc167be749dbbff5fa9be) [DEPLOYING].
[GroupByKey -> [5]{Map(<lambda at fn_api_runner_test.py:408>), assert_that} (1/1)] INFO org.apache.flink.runtime.taskmanager.Task - Registering task at network: GroupByKey -> [5]{Map(<lambda at fn_api_runner_test.py:408>), assert_that} (1/1) (93f9bdf92ddcc167be749dbbff5fa9be) [DEPLOYING].
[flink-akka.actor.default-dispatcher-2] INFO org.apache.flink.runtime.taskexecutor.TaskExecutor - Received task ToKeyedWorkItem (1/1).
[ToKeyedWorkItem (1/1)] INFO org.apache.flink.runtime.taskmanager.Task - ToKeyedWorkItem (1/1) (912eec61c677a47fd573072f94808a20) switched from CREATED to DEPLOYING.
[ToKeyedWorkItem (1/1)] INFO org.apache.flink.runtime.taskmanager.Task - Creating FileSystem stream leak safety net for task ToKeyedWorkItem (1/1) (912eec61c677a47fd573072f94808a20) [DEPLOYING]
[ToKeyedWorkItem (1/1)] INFO org.apache.flink.runtime.taskmanager.Task - Loading JAR files for task ToKeyedWorkItem (1/1) (912eec61c677a47fd573072f94808a20) [DEPLOYING].
[ToKeyedWorkItem (1/1)] INFO org.apache.flink.runtime.taskmanager.Task - Registering task at network: ToKeyedWorkItem (1/1) (912eec61c677a47fd573072f94808a20) [DEPLOYING].
[Source: Impulse -> [1]Create/FlatMap(<lambda at core.py:2029>) (1/1)] INFO org.apache.flink.runtime.taskmanager.Task - Source: Impulse -> [1]Create/FlatMap(<lambda at core.py:2029>) (1/1) (648a24267f4412dd4e2eca6b8932774c) switched from DEPLOYING to RUNNING.
[flink-akka.actor.default-dispatcher-3] INFO org.apache.flink.runtime.executiongraph.ExecutionGraph - Source: Impulse -> [1]Create/FlatMap(<lambda at core.py:2029>) (1/1) (648a24267f4412dd4e2eca6b8932774c) switched from DEPLOYING to RUNNING.
[Source: Impulse -> [1]Create/FlatMap(<lambda at core.py:2029>) (1/1)] INFO org.apache.flink.streaming.runtime.tasks.StreamTask - No state backend has been configured, using default (Memory / JobManager) MemoryStateBackend (data in heap memory / checkpoints to JobManager) (checkpoints: 'null', savepoints: 'null', asynchronous: TRUE, maxStateSize: 5242880)
[Source: Impulse -> [4]assert_that/{Create, Group} (1/1)] INFO org.apache.flink.runtime.taskmanager.Task - Source: Impulse -> [4]assert_that/{Create, Group} (1/1) (2138398d17583365b57739de2785cc1f) switched from DEPLOYING to RUNNING.
[flink-akka.actor.default-dispatcher-3] INFO org.apache.flink.runtime.executiongraph.ExecutionGraph - Source: Impulse -> [4]assert_that/{Create, Group} (1/1) (2138398d17583365b57739de2785cc1f) switched from DEPLOYING to RUNNING.
[GroupByKey -> [5]{Map(<lambda at fn_api_runner_test.py:408>), assert_that} (1/1)] INFO org.apache.flink.runtime.taskmanager.Task - GroupByKey -> [5]{Map(<lambda at fn_api_runner_test.py:408>), assert_that} (1/1) (93f9bdf92ddcc167be749dbbff5fa9be) switched from DEPLOYING to RUNNING.
[flink-akka.actor.default-dispatcher-2] INFO org.apache.flink.runtime.taskexecutor.TaskExecutor - Received task assert_that/Group/GroupByKey -> [3]assert_that/{Group, Unkey, Match} (1/1).
[Source: Impulse -> [4]assert_that/{Create, Group} (1/1)] INFO org.apache.flink.streaming.runtime.tasks.StreamTask - No state backend has been configured, using default (Memory / JobManager) MemoryStateBackend (data in heap memory / checkpoints to JobManager) (checkpoints: 'null', savepoints: 'null', asynchronous: TRUE, maxStateSize: 5242880)
[flink-akka.actor.default-dispatcher-4] INFO org.apache.flink.runtime.executiongraph.ExecutionGraph - GroupByKey -> [5]{Map(<lambda at fn_api_runner_test.py:408>), assert_that} (1/1) (93f9bdf92ddcc167be749dbbff5fa9be) switched from DEPLOYING to RUNNING.
[GroupByKey -> [5]{Map(<lambda at fn_api_runner_test.py:408>), assert_that} (1/1)] INFO org.apache.flink.streaming.runtime.tasks.StreamTask - No state backend has been configured, using default (Memory / JobManager) MemoryStateBackend (data in heap memory / checkpoints to JobManager) (checkpoints: 'null', savepoints: 'null', asynchronous: TRUE, maxStateSize: 5242880)
[[3]{Create, Map(<lambda at fn_api_runner_test.py:405>), WindowInto(WindowIntoFn)} -> ToKeyedWorkItem (1/1)] INFO org.apache.flink.runtime.taskmanager.Task - [3]{Create, Map(<lambda at fn_api_runner_test.py:405>), WindowInto(WindowIntoFn)} -> ToKeyedWorkItem (1/1) (bbfcdbfff8fece8929b6dd10477aef02) switched from DEPLOYING to RUNNING.
[flink-akka.actor.default-dispatcher-4] INFO org.apache.flink.runtime.executiongraph.ExecutionGraph - [3]{Create, Map(<lambda at fn_api_runner_test.py:405>), WindowInto(WindowIntoFn)} -> ToKeyedWorkItem (1/1) (bbfcdbfff8fece8929b6dd10477aef02) switched from DEPLOYING to RUNNING.
[[3]{Create, Map(<lambda at fn_api_runner_test.py:405>), WindowInto(WindowIntoFn)} -> ToKeyedWorkItem (1/1)] INFO org.apache.flink.streaming.runtime.tasks.StreamTask - No state backend has been configured, using default (Memory / JobManager) MemoryStateBackend (data in heap memory / checkpoints to JobManager) (checkpoints: 'null', savepoints: 'null', asynchronous: TRUE, maxStateSize: 5242880)
[ToKeyedWorkItem (1/1)] INFO org.apache.flink.runtime.taskmanager.Task - ToKeyedWorkItem (1/1) (912eec61c677a47fd573072f94808a20) switched from DEPLOYING to RUNNING.
[flink-akka.actor.default-dispatcher-4] INFO org.apache.flink.runtime.executiongraph.ExecutionGraph - ToKeyedWorkItem (1/1) (912eec61c677a47fd573072f94808a20) switched from DEPLOYING to RUNNING.
[ToKeyedWorkItem (1/1)] INFO org.apache.flink.streaming.runtime.tasks.StreamTask - No state backend has been configured, using default (Memory / JobManager) MemoryStateBackend (data in heap memory / checkpoints to JobManager) (checkpoints: 'null', savepoints: 'null', asynchronous: TRUE, maxStateSize: 5242880)
[assert_that/Group/GroupByKey -> [3]assert_that/{Group, Unkey, Match} (1/1)] INFO org.apache.flink.runtime.taskmanager.Task - assert_that/Group/GroupByKey -> [3]assert_that/{Group, Unkey, Match} (1/1) (860e7cc8b754fd697560f64a6e9f9428) switched from CREATED to DEPLOYING.
[assert_that/Group/GroupByKey -> [3]assert_that/{Group, Unkey, Match} (1/1)] INFO org.apache.flink.runtime.taskmanager.Task - Creating FileSystem stream leak safety net for task assert_that/Group/GroupByKey -> [3]assert_that/{Group, Unkey, Match} (1/1) (860e7cc8b754fd697560f64a6e9f9428) [DEPLOYING]
[assert_that/Group/GroupByKey -> [3]assert_that/{Group, Unkey, Match} (1/1)] INFO org.apache.flink.runtime.taskmanager.Task - Loading JAR files for task assert_that/Group/GroupByKey -> [3]assert_that/{Group, Unkey, Match} (1/1) (860e7cc8b754fd697560f64a6e9f9428) [DEPLOYING].
[assert_that/Group/GroupByKey -> [3]assert_that/{Group, Unkey, Match} (1/1)] INFO org.apache.flink.runtime.taskmanager.Task - Registering task at network: assert_that/Group/GroupByKey -> [3]assert_that/{Group, Unkey, Match} (1/1) (860e7cc8b754fd697560f64a6e9f9428) [DEPLOYING].
[assert_that/Group/GroupByKey -> [3]assert_that/{Group, Unkey, Match} (1/1)] INFO org.apache.flink.runtime.taskmanager.Task - assert_that/Group/GroupByKey -> [3]assert_that/{Group, Unkey, Match} (1/1) (860e7cc8b754fd697560f64a6e9f9428) switched from DEPLOYING to RUNNING.
[assert_that/Group/GroupByKey -> [3]assert_that/{Group, Unkey, Match} (1/1)] INFO org.apache.flink.streaming.runtime.tasks.StreamTask - No state backend has been configured, using default (Memory / JobManager) MemoryStateBackend (data in heap memory / checkpoints to JobManager) (checkpoints: 'null', savepoints: 'null', asynchronous: TRUE, maxStateSize: 5242880)
[flink-akka.actor.default-dispatcher-2] INFO org.apache.flink.runtime.executiongraph.ExecutionGraph - assert_that/Group/GroupByKey -> [3]assert_that/{Group, Unkey, Match} (1/1) (860e7cc8b754fd697560f64a6e9f9428) switched from DEPLOYING to RUNNING.
[[3]{Create, Map(<lambda at fn_api_runner_test.py:405>), WindowInto(WindowIntoFn)} -> ToKeyedWorkItem (1/1)] WARN org.apache.flink.metrics.MetricGroup - The operator name [3]{Create, Map(<lambda at fn_api_runner_test.py:405>), WindowInto(WindowIntoFn)} exceeded the 80 characters length limit and was truncated.
[assert_that/Group/GroupByKey -> [3]assert_that/{Group, Unkey, Match} (1/1)] INFO org.apache.flink.runtime.state.heap.HeapKeyedStateBackend - Initializing heap keyed state backend with stream factory.
[GroupByKey -> [5]{Map(<lambda at fn_api_runner_test.py:408>), assert_that} (1/1)] INFO org.apache.flink.runtime.state.heap.HeapKeyedStateBackend - Initializing heap keyed state backend with stream factory.
[Source: Impulse -> [4]assert_that/{Create, Group} (1/1)] WARN org.apache.beam.runners.fnexecution.environment.DockerCommand - Unable to pull docker image jenkins-docker-apache.bintray.io/beam/python:latest, cause: Received exit code 1 for command 'docker pull jenkins-docker-apache.bintray.io/beam/python:latest'. stderr: Error response from daemon: unknown: Repo 'apache' was not found
[grpc-default-executor-0] INFO org.apache.beam.runners.fnexecution.artifact.BeamFileSystemArtifactRetrievalService - GetManifest for /tmp/flinktest8AZFmm/job_22ac494c-3ac1-4a2a-8918-adca4a3fc334/MANIFEST
[grpc-default-executor-0] INFO org.apache.beam.runners.fnexecution.artifact.BeamFileSystemArtifactRetrievalService - Loading manifest for retrieval token /tmp/flinktest8AZFmm/job_22ac494c-3ac1-4a2a-8918-adca4a3fc334/MANIFEST
[grpc-default-executor-0] INFO org.apache.beam.runners.fnexecution.artifact.BeamFileSystemArtifactRetrievalService - Manifest at /tmp/flinktest8AZFmm/job_22ac494c-3ac1-4a2a-8918-adca4a3fc334/MANIFEST has 0 artifact locations
[grpc-default-executor-0] INFO org.apache.beam.runners.fnexecution.artifact.BeamFileSystemArtifactRetrievalService - GetManifest for /tmp/flinktest8AZFmm/job_22ac494c-3ac1-4a2a-8918-adca4a3fc334/MANIFEST -> 0 artifacts
[grpc-default-executor-0] INFO org.apache.beam.runners.fnexecution.logging.GrpcLoggingService - Beam Fn Logging client connected.
[grpc-default-executor-0] INFO sdk_worker_main.main - Logging handler created.
[grpc-default-executor-0] INFO sdk_worker_main.start - Status HTTP server running at localhost:43791
[grpc-default-executor-0] INFO sdk_worker_main.main - semi_persistent_directory: /tmp
[grpc-default-executor-0] WARN sdk_worker_main._load_main_session - No session file found: /tmp/staged/pickled_main_session. Functions defined in __main__ (interactive session) may fail. 
[grpc-default-executor-0] INFO pipeline_options.get_all_options - Parsing unknown args: [u'--direct_runner_use_stacked_bundle', u'--options_id=23', u'--pipeline_type_check', u'--sdk_worker_parallelism=1']
[grpc-default-executor-0] INFO sdk_worker_main.main - Python sdk harness started with pipeline_options: {'runner': u'None', 'streaming': True, 'experiments': [u'beam_fn_api'], 'environment_type': u'DOCKER', 'sdk_location': u'container', 'flink_master': '[local]', 'direct_runner_use_stacked_bundle': None, 'sdk_worker_parallelism': u'1', 'job_name': u'test_windowing_1546545128.84', 'options_id': u'23', 'pipeline_type_check': None, 'parallelism': 1, 'job_endpoint': u'localhost:34541'}
[grpc-default-executor-0] INFO sdk_worker.__init__ - Creating insecure control channel for localhost:35565.
[grpc-default-executor-0] INFO sdk_worker.__init__ - Control channel established.
[grpc-default-executor-0] INFO sdk_worker.__init__ - Initializing SDKHarness with 12 workers.
[grpc-default-executor-0] INFO org.apache.beam.runners.fnexecution.control.FnApiControlClientPoolService - Beam Fn Control client connected with id 1
[grpc-default-executor-0] INFO sdk_worker.create_state_handler - Creating insecure state channel for localhost:35507
[grpc-default-executor-0] INFO sdk_worker.create_state_handler - State channel established.
[grpc-default-executor-0] WARN bundle_processor.create_operation - No unique name set for transform fn/write/ref_PCollection_PCollection_2:0 
[grpc-default-executor-0] INFO data_plane.create_data_channel - Creating channel for localhost:46733
[grpc-default-executor-0] INFO org.apache.beam.runners.fnexecution.data.GrpcDataService - Beam Fn Data client connected.
[grpc-default-executor-1] WARN bundle_processor.create_operation - No unique name set for transform fn/write/ref_PCollection_PCollection_24:1:0 
[grpc-default-executor-0] WARN bundle_processor.create_operation - No unique name set for transform fn/read/ref_PCollection_PCollection_1:0 
[Source: Impulse -> [1]Create/FlatMap(<lambda at core.py:2029>) (1/1)] WARN org.apache.flink.metrics.MetricGroup - Name collision: Group already contains a Metric with the name 'beam.metric:pardo_execution_time:start_bundle_msecs:v1'. Metric will not be reported.[localhost, taskmanager, 7fd4fbdf-6f32-43bb-80ff-3dde152eb117, test_windowing_1546545128.84, [1]Create/FlatMap(<lambda at core.py:2029>), 0]
[Source: Impulse -> [1]Create/FlatMap(<lambda at core.py:2029>) (1/1)] WARN org.apache.flink.metrics.MetricGroup - Name collision: Group already contains a Metric with the name 'beam.metric:pardo_execution_time:process_bundle_msecs:v1'. Metric will not be reported.[localhost, taskmanager, 7fd4fbdf-6f32-43bb-80ff-3dde152eb117, test_windowing_1546545128.84, [1]Create/FlatMap(<lambda at core.py:2029>), 0]
[Source: Impulse -> [1]Create/FlatMap(<lambda at core.py:2029>) (1/1)] WARN org.apache.flink.metrics.MetricGroup - Name collision: Group already contains a Metric with the name 'beam.metric:ptransform_execution_time:total_msecs:v1'. Metric will not be reported.[localhost, taskmanager, 7fd4fbdf-6f32-43bb-80ff-3dde152eb117, test_windowing_1546545128.84, [1]Create/FlatMap(<lambda at core.py:2029>), 0]
[Source: Impulse -> [1]Create/FlatMap(<lambda at core.py:2029>) (1/1)] WARN org.apache.flink.metrics.MetricGroup - Name collision: Group already contains a Metric with the name 'beam.metric:element_count:v1'. Metric will not be reported.[localhost, taskmanager, 7fd4fbdf-6f32-43bb-80ff-3dde152eb117, test_windowing_1546545128.84, [1]Create/FlatMap(<lambda at core.py:2029>), 0]
[Source: Impulse -> [1]Create/FlatMap(<lambda at core.py:2029>) (1/1)] WARN org.apache.flink.metrics.MetricGroup - Name collision: Group already contains a Metric with the name 'beam.metric:pardo_execution_time:finish_bundle_msecs:v1'. Metric will not be reported.[localhost, taskmanager, 7fd4fbdf-6f32-43bb-80ff-3dde152eb117, test_windowing_1546545128.84, [1]Create/FlatMap(<lambda at core.py:2029>), 0]
[grpc-default-executor-0] WARN bundle_processor.create_operation - No unique name set for transform fn/read/ref_PCollection_PCollection_17:0 
[Source: Impulse -> [4]assert_that/{Create, Group} (1/1)] WARN org.apache.flink.metrics.MetricGroup - Name collision: Group already contains a Metric with the name 'beam.metric:pardo_execution_time:process_bundle_msecs:v1'. Metric will not be reported.[localhost, taskmanager, 7fd4fbdf-6f32-43bb-80ff-3dde152eb117, test_windowing_1546545128.84, [4]assert_that/{Create, Group}, 0]
[Source: Impulse -> [4]assert_that/{Create, Group} (1/1)] WARN org.apache.flink.metrics.MetricGroup - Name collision: Group already contains a Metric with the name 'beam.metric:pardo_execution_time:start_bundle_msecs:v1'. Metric will not be reported.[localhost, taskmanager, 7fd4fbdf-6f32-43bb-80ff-3dde152eb117, test_windowing_1546545128.84, [4]assert_that/{Create, Group}, 0]
[Source: Impulse -> [4]assert_that/{Create, Group} (1/1)] WARN org.apache.flink.metrics.MetricGroup - Name collision: Group already contains a Metric with the name 'beam.metric:element_count:v1'. Metric will not be reported.[localhost, taskmanager, 7fd4fbdf-6f32-43bb-80ff-3dde152eb117, test_windowing_1546545128.84, [4]assert_that/{Create, Group}, 0]
[Source: Impulse -> [4]assert_that/{Create, Group} (1/1)] WARN org.apache.flink.metrics.MetricGroup - Name collision: Group already contains a Metric with the name 'beam.metric:ptransform_execution_time:total_msecs:v1'. Metric will not be reported.[localhost, taskmanager, 7fd4fbdf-6f32-43bb-80ff-3dde152eb117, test_windowing_1546545128.84, [4]assert_that/{Create, Group}, 0]
[Source: Impulse -> [4]assert_that/{Create, Group} (1/1)] WARN org.apache.flink.metrics.MetricGroup - Name collision: Group already contains a Metric with the name 'beam.metric:pardo_execution_time:finish_bundle_msecs:v1'. Metric will not be reported.[localhost, taskmanager, 7fd4fbdf-6f32-43bb-80ff-3dde152eb117, test_windowing_1546545128.84, [4]assert_that/{Create, Group}, 0]
[grpc-default-executor-0] WARN bundle_processor.create_operation - No unique name set for transform fn/write/ref_PCollection_PCollection_12:0 
[Source: Impulse -> [1]Create/FlatMap(<lambda at core.py:2029>) (1/1)] INFO org.apache.flink.runtime.taskmanager.Task - Source: Impulse -> [1]Create/FlatMap(<lambda at core.py:2029>) (1/1) (648a24267f4412dd4e2eca6b8932774c) switched from RUNNING to FINISHED.
[Source: Impulse -> [1]Create/FlatMap(<lambda at core.py:2029>) (1/1)] INFO org.apache.flink.runtime.taskmanager.Task - Freeing task resources for Source: Impulse -> [1]Create/FlatMap(<lambda at core.py:2029>) (1/1) (648a24267f4412dd4e2eca6b8932774c).
[Source: Impulse -> [1]Create/FlatMap(<lambda at core.py:2029>) (1/1)] INFO org.apache.flink.runtime.taskmanager.Task - Ensuring all FileSystem streams are closed for task Source: Impulse -> [1]Create/FlatMap(<lambda at core.py:2029>) (1/1) (648a24267f4412dd4e2eca6b8932774c) [FINISHED]
[flink-akka.actor.default-dispatcher-2] INFO org.apache.flink.runtime.taskexecutor.TaskExecutor - Un-registering task and sending final execution state FINISHED to JobManager for task Source: Impulse -> [1]Create/FlatMap(<lambda at core.py:2029>) 648a24267f4412dd4e2eca6b8932774c.
[flink-akka.actor.default-dispatcher-3] INFO org.apache.flink.runtime.executiongraph.ExecutionGraph - Source: Impulse -> [1]Create/FlatMap(<lambda at core.py:2029>) (1/1) (648a24267f4412dd4e2eca6b8932774c) switched from RUNNING to FINISHED.
[grpc-default-executor-0] WARN bundle_processor.create_operation - No unique name set for transform fn/read/ref_PCollection_PCollection_9:0 
[[3]{Create, Map(<lambda at fn_api_runner_test.py:405>), WindowInto(WindowIntoFn)} -> ToKeyedWorkItem (1/1)] WARN org.apache.flink.metrics.MetricGroup - Name collision: Group already contains a Metric with the name 'beam.metric:pardo_execution_time:start_bundle_msecs:v1'. Metric will not be reported.[localhost, taskmanager, 7fd4fbdf-6f32-43bb-80ff-3dde152eb117, test_windowing_1546545128.84, [3]{Create, Map(<lambda at fn_api_runner_test.py:405>), WindowInto(WindowIntoFn), 0]
[[3]{Create, Map(<lambda at fn_api_runner_test.py:405>), WindowInto(WindowIntoFn)} -> ToKeyedWorkItem (1/1)] WARN org.apache.flink.metrics.MetricGroup - Name collision: Group already contains a Metric with the name 'beam.metric:pardo_execution_time:process_bundle_msecs:v1'. Metric will not be reported.[localhost, taskmanager, 7fd4fbdf-6f32-43bb-80ff-3dde152eb117, test_windowing_1546545128.84, [3]{Create, Map(<lambda at fn_api_runner_test.py:405>), WindowInto(WindowIntoFn), 0]
[[3]{Create, Map(<lambda at fn_api_runner_test.py:405>), WindowInto(WindowIntoFn)} -> ToKeyedWorkItem (1/1)] WARN org.apache.flink.metrics.MetricGroup - Name collision: Group already contains a Metric with the name 'beam.metric:ptransform_execution_time:total_msecs:v1'. Metric will not be reported.[localhost, taskmanager, 7fd4fbdf-6f32-43bb-80ff-3dde152eb117, test_windowing_1546545128.84, [3]{Create, Map(<lambda at fn_api_runner_test.py:405>), WindowInto(WindowIntoFn), 0]
[[3]{Create, Map(<lambda at fn_api_runner_test.py:405>), WindowInto(WindowIntoFn)} -> ToKeyedWorkItem (1/1)] WARN org.apache.flink.metrics.MetricGroup - Name collision: Group already contains a Metric with the name 'beam.metric:element_count:v1'. Metric will not be reported.[localhost, taskmanager, 7fd4fbdf-6f32-43bb-80ff-3dde152eb117, test_windowing_1546545128.84, [3]{Create, Map(<lambda at fn_api_runner_test.py:405>), WindowInto(WindowIntoFn), 0]
[[3]{Create, Map(<lambda at fn_api_runner_test.py:405>), WindowInto(WindowIntoFn)} -> ToKeyedWorkItem (1/1)] WARN org.apache.flink.metrics.MetricGroup - Name collision: Group already contains a Metric with the name 'beam.metric:pardo_execution_time:finish_bundle_msecs:v1'. Metric will not be reported.[localhost, taskmanager, 7fd4fbdf-6f32-43bb-80ff-3dde152eb117, test_windowing_1546545128.84, [3]{Create, Map(<lambda at fn_api_runner_test.py:405>), WindowInto(WindowIntoFn), 0]
[Source: Impulse -> [4]assert_that/{Create, Group} (1/1)] INFO org.apache.flink.runtime.taskmanager.Task - Source: Impulse -> [4]assert_that/{Create, Group} (1/1) (2138398d17583365b57739de2785cc1f) switched from RUNNING to FINISHED.
[Source: Impulse -> [4]assert_that/{Create, Group} (1/1)] INFO org.apache.flink.runtime.taskmanager.Task - Freeing task resources for Source: Impulse -> [4]assert_that/{Create, Group} (1/1) (2138398d17583365b57739de2785cc1f).
[Source: Impulse -> [4]assert_that/{Create, Group} (1/1)] INFO org.apache.flink.runtime.taskmanager.Task - Ensuring all FileSystem streams are closed for task Source: Impulse -> [4]assert_that/{Create, Group} (1/1) (2138398d17583365b57739de2785cc1f) [FINISHED]
[flink-akka.actor.default-dispatcher-4] INFO org.apache.flink.runtime.taskexecutor.TaskExecutor - Un-registering task and sending final execution state FINISHED to JobManager for task Source: Impulse -> [4]assert_that/{Create, Group} 2138398d17583365b57739de2785cc1f.
[flink-akka.actor.default-dispatcher-3] INFO org.apache.flink.runtime.executiongraph.ExecutionGraph - Source: Impulse -> [4]assert_that/{Create, Group} (1/1) (2138398d17583365b57739de2785cc1f) switched from RUNNING to FINISHED.
[[3]{Create, Map(<lambda at fn_api_runner_test.py:405>), WindowInto(WindowIntoFn)} -> ToKeyedWorkItem (1/1)] INFO org.apache.flink.runtime.taskmanager.Task - [3]{Create, Map(<lambda at fn_api_runner_test.py:405>), WindowInto(WindowIntoFn)} -> ToKeyedWorkItem (1/1) (bbfcdbfff8fece8929b6dd10477aef02) switched from RUNNING to FINISHED.
[[3]{Create, Map(<lambda at fn_api_runner_test.py:405>), WindowInto(WindowIntoFn)} -> ToKeyedWorkItem (1/1)] INFO org.apache.flink.runtime.taskmanager.Task - Freeing task resources for [3]{Create, Map(<lambda at fn_api_runner_test.py:405>), WindowInto(WindowIntoFn)} -> ToKeyedWorkItem (1/1) (bbfcdbfff8fece8929b6dd10477aef02).
[[3]{Create, Map(<lambda at fn_api_runner_test.py:405>), WindowInto(WindowIntoFn)} -> ToKeyedWorkItem (1/1)] INFO org.apache.flink.runtime.taskmanager.Task - Ensuring all FileSystem streams are closed for task [3]{Create, Map(<lambda at fn_api_runner_test.py:405>), WindowInto(WindowIntoFn)} -> ToKeyedWorkItem (1/1) (bbfcdbfff8fece8929b6dd10477aef02) [FINISHED]
[flink-akka.actor.default-dispatcher-5] INFO org.apache.flink.runtime.taskexecutor.TaskExecutor - Un-registering task and sending final execution state FINISHED to JobManager for task [3]{Create, Map(<lambda at fn_api_runner_test.py:405>), WindowInto(WindowIntoFn)} -> ToKeyedWorkItem bbfcdbfff8fece8929b6dd10477aef02.
[flink-akka.actor.default-dispatcher-2] INFO org.apache.flink.runtime.executiongraph.ExecutionGraph - [3]{Create, Map(<lambda at fn_api_runner_test.py:405>), WindowInto(WindowIntoFn)} -> ToKeyedWorkItem (1/1) (bbfcdbfff8fece8929b6dd10477aef02) switched from RUNNING to FINISHED.
[grpc-default-executor-0] WARN bundle_processor.create_operation - No unique name set for transform fn/write/ref_PCollection_PCollection_24:0:0 
[grpc-default-executor-0] WARN bundle_processor.create_operation - No unique name set for transform fn/read/ref_PCollection_PCollection_15:0 
[GroupByKey -> [5]{Map(<lambda at fn_api_runner_test.py:408>), assert_that} (1/1)] WARN org.apache.flink.metrics.MetricGroup - Name collision: Group already contains a Metric with the name 'beam.metric:pardo_execution_time:process_bundle_msecs:v1'. Metric will not be reported.[localhost, taskmanager, 7fd4fbdf-6f32-43bb-80ff-3dde152eb117, test_windowing_1546545128.84, [5]{Map(<lambda at fn_api_runner_test.py:408>), assert_that}, 0]
[GroupByKey -> [5]{Map(<lambda at fn_api_runner_test.py:408>), assert_that} (1/1)] WARN org.apache.flink.metrics.MetricGroup - Name collision: Group already contains a Metric with the name 'beam.metric:pardo_execution_time:start_bundle_msecs:v1'. Metric will not be reported.[localhost, taskmanager, 7fd4fbdf-6f32-43bb-80ff-3dde152eb117, test_windowing_1546545128.84, [5]{Map(<lambda at fn_api_runner_test.py:408>), assert_that}, 0]
[GroupByKey -> [5]{Map(<lambda at fn_api_runner_test.py:408>), assert_that} (1/1)] WARN org.apache.flink.metrics.MetricGroup - Name collision: Group already contains a Metric with the name 'beam.metric:pardo_execution_time:finish_bundle_msecs:v1'. Metric will not be reported.[localhost, taskmanager, 7fd4fbdf-6f32-43bb-80ff-3dde152eb117, test_windowing_1546545128.84, [5]{Map(<lambda at fn_api_runner_test.py:408>), assert_that}, 0]
[GroupByKey -> [5]{Map(<lambda at fn_api_runner_test.py:408>), assert_that} (1/1)] WARN org.apache.flink.metrics.MetricGroup - Name collision: Group already contains a Metric with the name 'beam.metric:element_count:v1'. Metric will not be reported.[localhost, taskmanager, 7fd4fbdf-6f32-43bb-80ff-3dde152eb117, test_windowing_1546545128.84, [5]{Map(<lambda at fn_api_runner_test.py:408>), assert_that}, 0]
[GroupByKey -> [5]{Map(<lambda at fn_api_runner_test.py:408>), assert_that} (1/1)] WARN org.apache.flink.metrics.MetricGroup - Name collision: Group already contains a Metric with the name 'beam.metric:ptransform_execution_time:total_msecs:v1'. Metric will not be reported.[localhost, taskmanager, 7fd4fbdf-6f32-43bb-80ff-3dde152eb117, test_windowing_1546545128.84, [5]{Map(<lambda at fn_api_runner_test.py:408>), assert_that}, 0]
[GroupByKey -> [5]{Map(<lambda at fn_api_runner_test.py:408>), assert_that} (1/1)] INFO org.apache.flink.runtime.taskmanager.Task - GroupByKey -> [5]{Map(<lambda at fn_api_runner_test.py:408>), assert_that} (1/1) (93f9bdf92ddcc167be749dbbff5fa9be) switched from RUNNING to FINISHED.
[GroupByKey -> [5]{Map(<lambda at fn_api_runner_test.py:408>), assert_that} (1/1)] INFO org.apache.flink.runtime.taskmanager.Task - Freeing task resources for GroupByKey -> [5]{Map(<lambda at fn_api_runner_test.py:408>), assert_that} (1/1) (93f9bdf92ddcc167be749dbbff5fa9be).
[GroupByKey -> [5]{Map(<lambda at fn_api_runner_test.py:408>), assert_that} (1/1)] INFO org.apache.flink.runtime.taskmanager.Task - Ensuring all FileSystem streams are closed for task GroupByKey -> [5]{Map(<lambda at fn_api_runner_test.py:408>), assert_that} (1/1) (93f9bdf92ddcc167be749dbbff5fa9be) [FINISHED]
[flink-akka.actor.default-dispatcher-5] INFO org.apache.flink.runtime.taskexecutor.TaskExecutor - Un-registering task and sending final execution state FINISHED to JobManager for task GroupByKey -> [5]{Map(<lambda at fn_api_runner_test.py:408>), assert_that} 93f9bdf92ddcc167be749dbbff5fa9be.
[ToKeyedWorkItem (1/1)] INFO org.apache.flink.runtime.taskmanager.Task - ToKeyedWorkItem (1/1) (912eec61c677a47fd573072f94808a20) switched from RUNNING to FINISHED.
[ToKeyedWorkItem (1/1)] INFO org.apache.flink.runtime.taskmanager.Task - Freeing task resources for ToKeyedWorkItem (1/1) (912eec61c677a47fd573072f94808a20).
[ToKeyedWorkItem (1/1)] INFO org.apache.flink.runtime.taskmanager.Task - Ensuring all FileSystem streams are closed for task ToKeyedWorkItem (1/1) (912eec61c677a47fd573072f94808a20) [FINISHED]
[flink-akka.actor.default-dispatcher-5] INFO org.apache.flink.runtime.taskexecutor.TaskExecutor - Un-registering task and sending final execution state FINISHED to JobManager for task ToKeyedWorkItem 912eec61c677a47fd573072f94808a20.
[flink-akka.actor.default-dispatcher-2] INFO org.apache.flink.runtime.executiongraph.ExecutionGraph - GroupByKey -> [5]{Map(<lambda at fn_api_runner_test.py:408>), assert_that} (1/1) (93f9bdf92ddcc167be749dbbff5fa9be) switched from RUNNING to FINISHED.
[flink-akka.actor.default-dispatcher-2] INFO org.apache.flink.runtime.executiongraph.ExecutionGraph - ToKeyedWorkItem (1/1) (912eec61c677a47fd573072f94808a20) switched from RUNNING to FINISHED.
[grpc-default-executor-0] WARN bundle_processor.create_operation - No unique name set for transform fn/read/ref_PCollection_PCollection_27:0 
[assert_that/Group/GroupByKey -> [3]assert_that/{Group, Unkey, Match} (1/1)] WARN org.apache.flink.metrics.MetricGroup - Name collision: Group already contains a Metric with the name 'beam.metric:pardo_execution_time:process_bundle_msecs:v1'. Metric will not be reported.[localhost, taskmanager, 7fd4fbdf-6f32-43bb-80ff-3dde152eb117, test_windowing_1546545128.84, [3]assert_that/{Group, Unkey, Match}, 0]
[assert_that/Group/GroupByKey -> [3]assert_that/{Group, Unkey, Match} (1/1)] WARN org.apache.flink.metrics.MetricGroup - Name collision: Group already contains a Metric with the name 'beam.metric:pardo_execution_time:start_bundle_msecs:v1'. Metric will not be reported.[localhost, taskmanager, 7fd4fbdf-6f32-43bb-80ff-3dde152eb117, test_windowing_1546545128.84, [3]assert_that/{Group, Unkey, Match}, 0]
[assert_that/Group/GroupByKey -> [3]assert_that/{Group, Unkey, Match} (1/1)] WARN org.apache.flink.metrics.MetricGroup - Name collision: Group already contains a Metric with the name 'beam.metric:element_count:v1'. Metric will not be reported.[localhost, taskmanager, 7fd4fbdf-6f32-43bb-80ff-3dde152eb117, test_windowing_1546545128.84, [3]assert_that/{Group, Unkey, Match}, 0]
[assert_that/Group/GroupByKey -> [3]assert_that/{Group, Unkey, Match} (1/1)] WARN org.apache.flink.metrics.MetricGroup - Name collision: Group already contains a Metric with the name 'beam.metric:ptransform_execution_time:total_msecs:v1'. Metric will not be reported.[localhost, taskmanager, 7fd4fbdf-6f32-43bb-80ff-3dde152eb117, test_windowing_1546545128.84, [3]assert_that/{Group, Unkey, Match}, 0]
[assert_that/Group/GroupByKey -> [3]assert_that/{Group, Unkey, Match} (1/1)] WARN org.apache.flink.metrics.MetricGroup - Name collision: Group already contains a Metric with the name 'beam.metric:pardo_execution_time:finish_bundle_msecs:v1'. Metric will not be reported.[localhost, taskmanager, 7fd4fbdf-6f32-43bb-80ff-3dde152eb117, test_windowing_1546545128.84, [3]assert_that/{Group, Unkey, Match}, 0]
[grpc-default-executor-0] INFO sdk_worker.run - No more requests from control plane
[grpc-default-executor-0] INFO sdk_worker.run - SDK Harness waiting for in-flight requests to complete
[grpc-default-executor-0] INFO data_plane.close - Closing all cached grpc data channels.
[grpc-default-executor-0] WARN org.apache.beam.sdk.fn.data.BeamFnDataGrpcMultiplexer - Hanged up for unknown endpoint.
[grpc-default-executor-0] INFO sdk_worker.close - Closing all cached gRPC state handlers.
[grpc-default-executor-0] INFO sdk_worker.run - Done consuming work.
[grpc-default-executor-0] INFO sdk_worker_main.main - Python sdk harness exiting.
[grpc-default-executor-0] INFO org.apache.beam.runners.fnexecution.logging.GrpcLoggingService - Logging client hanged up.
[assert_that/Group/GroupByKey -> [3]assert_that/{Group, Unkey, Match} (1/1)] WARN org.apache.beam.sdk.fn.data.BeamFnDataGrpcMultiplexer - Hanged up for unknown endpoint.
[assert_that/Group/GroupByKey -> [3]assert_that/{Group, Unkey, Match} (1/1)] INFO org.apache.flink.runtime.taskmanager.Task - assert_that/Group/GroupByKey -> [3]assert_that/{Group, Unkey, Match} (1/1) (860e7cc8b754fd697560f64a6e9f9428) switched from RUNNING to FINISHED.
[assert_that/Group/GroupByKey -> [3]assert_that/{Group, Unkey, Match} (1/1)] INFO org.apache.flink.runtime.taskmanager.Task - Freeing task resources for assert_that/Group/GroupByKey -> [3]assert_that/{Group, Unkey, Match} (1/1) (860e7cc8b754fd697560f64a6e9f9428).
[assert_that/Group/GroupByKey -> [3]assert_that/{Group, Unkey, Match} (1/1)] INFO org.apache.flink.runtime.taskmanager.Task - Ensuring all FileSystem streams are closed for task assert_that/Group/GroupByKey -> [3]assert_that/{Group, Unkey, Match} (1/1) (860e7cc8b754fd697560f64a6e9f9428) [FINISHED]
[flink-akka.actor.default-dispatcher-3] INFO org.apache.flink.runtime.taskexecutor.TaskExecutor - Un-registering task and sending final execution state FINISHED to JobManager for task assert_that/Group/GroupByKey -> [3]assert_that/{Group, Unkey, Match} 860e7cc8b754fd697560f64a6e9f9428.
[flink-akka.actor.default-dispatcher-4] INFO org.apache.flink.runtime.executiongraph.ExecutionGraph - assert_that/Group/GroupByKey -> [3]assert_that/{Group, Unkey, Match} (1/1) (860e7cc8b754fd697560f64a6e9f9428) switched from RUNNING to FINISHED.
[flink-akka.actor.default-dispatcher-4] INFO org.apache.flink.runtime.executiongraph.ExecutionGraph - Job test_windowing_1546545128.84 (8a60c8f07ccf9f8cec553eaf2cbd3e0e) switched from state RUNNING to FINISHED.
[flink-akka.actor.default-dispatcher-4] INFO org.apache.flink.runtime.checkpoint.CheckpointCoordinator - Stopping checkpoint coordinator for job 8a60c8f07ccf9f8cec553eaf2cbd3e0e.
[flink-akka.actor.default-dispatcher-4] INFO org.apache.flink.runtime.checkpoint.StandaloneCompletedCheckpointStore - Shutting down
[flink-akka.actor.default-dispatcher-2] INFO org.apache.flink.runtime.dispatcher.StandaloneDispatcher - Job 8a60c8f07ccf9f8cec553eaf2cbd3e0e reached globally terminal state FINISHED.
[flink-akka.actor.default-dispatcher-4] INFO org.apache.flink.runtime.jobmaster.JobMaster - Stopping the JobMaster for job test_windowing_1546545128.84(8a60c8f07ccf9f8cec553eaf2cbd3e0e).
[flink-akka.actor.default-dispatcher-3] INFO org.apache.flink.runtime.taskexecutor.TaskExecutor - Close JobManager connection for job 8a60c8f07ccf9f8cec553eaf2cbd3e0e.
[flink-runner-job-server] INFO org.apache.flink.runtime.minicluster.MiniCluster - Shutting down Flink Mini Cluster
[flink-akka.actor.default-dispatcher-4] INFO org.apache.flink.runtime.jobmaster.JobMaster - Close ResourceManager connection 4b682bdc81e833294ca480c6f8c769c4: JobManager is shutting down..
[flink-akka.actor.default-dispatcher-5] INFO org.apache.flink.runtime.jobmaster.slotpool.SlotPool - Suspending SlotPool.
[flink-runner-job-server] INFO org.apache.flink.runtime.dispatcher.DispatcherRestEndpoint - Shutting down rest endpoint.
[flink-akka.actor.default-dispatcher-5] INFO org.apache.flink.runtime.jobmaster.slotpool.SlotPool - Stopping SlotPool.
[flink-akka.actor.default-dispatcher-2] INFO org.apache.flink.runtime.resourcemanager.StandaloneResourceManager - Disconnect job manager 8aa257ec4b83f45b8b2f5f331caf45ca@akka://flink/user/jobmanager_45 for job 8a60c8f07ccf9f8cec553eaf2cbd3e0e from the resource manager.
[flink-akka.actor.default-dispatcher-3] INFO org.apache.flink.runtime.taskexecutor.slot.TaskSlotTable - Free slot TaskSlot(index:0, state:ALLOCATED, resource profile: ResourceProfile{cpuCores=1.0, heapMemoryInMB=42, directMemoryInMB=0, nativeMemoryInMB=0, networkMemoryInMB=0}, allocationId: AllocationID{ec3f57061f92c0ff3e5cfe1e2e3c0fe3}, jobId: 8a60c8f07ccf9f8cec553eaf2cbd3e0e).
[flink-akka.actor.default-dispatcher-3] INFO org.apache.flink.runtime.taskexecutor.JobLeaderService - Remove job 8a60c8f07ccf9f8cec553eaf2cbd3e0e from job leader monitoring.
[flink-akka.actor.default-dispatcher-3] INFO org.apache.flink.runtime.taskexecutor.TaskExecutor - Close JobManager connection for job 8a60c8f07ccf9f8cec553eaf2cbd3e0e.
[flink-akka.actor.default-dispatcher-5] INFO org.apache.flink.runtime.dispatcher.StandaloneDispatcher - Stopping dispatcher akka://flink/user/dispatcher83fb0486-6d2e-4c83-9905-bcc912a80f23.
[flink-akka.actor.default-dispatcher-5] INFO org.apache.flink.runtime.dispatcher.StandaloneDispatcher - Stopping all currently running jobs of dispatcher akka://flink/user/dispatcher83fb0486-6d2e-4c83-9905-bcc912a80f23.
[flink-akka.actor.default-dispatcher-2] INFO org.apache.flink.runtime.resourcemanager.slotmanager.SlotManager - Closing the SlotManager.
[flink-akka.actor.default-dispatcher-2] INFO org.apache.flink.runtime.resourcemanager.slotmanager.SlotManager - Suspending the SlotManager.
[flink-akka.actor.default-dispatcher-3] INFO org.apache.flink.runtime.taskexecutor.TaskExecutor - Stopping TaskExecutor akka://flink/user/taskmanager_44.
[flink-akka.actor.default-dispatcher-3] INFO org.apache.flink.runtime.state.TaskExecutorLocalStateStoresManager - Shutting down TaskExecutorLocalStateStoresManager.
[flink-akka.actor.default-dispatcher-3] INFO org.apache.flink.runtime.io.disk.iomanager.IOManager - I/O manager removed spill file directory /tmp/flink-io-43b0a74d-e7d7-496a-9b35-b3453cb027f9
[flink-akka.actor.default-dispatcher-3] INFO org.apache.flink.runtime.io.network.NetworkEnvironment - Shutting down the network environment and its components.
[flink-akka.actor.default-dispatcher-5] INFO org.apache.flink.runtime.rest.handler.legacy.backpressure.StackTraceSampleCoordinator - Shutting down stack trace sample coordinator.
[ForkJoinPool.commonPool-worker-11] INFO org.apache.flink.runtime.dispatcher.DispatcherRestEndpoint - Removing cache directory /tmp/flink-web-ui
[ForkJoinPool.commonPool-worker-11] INFO org.apache.flink.runtime.dispatcher.DispatcherRestEndpoint - Shut down complete.
[flink-akka.actor.default-dispatcher-5] INFO org.apache.flink.runtime.dispatcher.StandaloneDispatcher - Stopped dispatcher akka://flink/user/dispatcher83fb0486-6d2e-4c83-9905-bcc912a80f23.
[flink-akka.actor.default-dispatcher-3] INFO org.apache.flink.runtime.taskexecutor.JobLeaderService - Stop job leader service.
[flink-akka.actor.default-dispatcher-3] INFO org.apache.flink.runtime.taskexecutor.TaskExecutor - Stopped TaskExecutor akka://flink/user/taskmanager_44.
[flink-akka.actor.default-dispatcher-3] INFO org.apache.beam.runners.flink.metrics.FileReporter - wrote metrics to /tmp/flinktest-confjSoOXH/test-metrics.txt
[flink-akka.actor.default-dispatcher-3] INFO org.apache.flink.runtime.rpc.akka.AkkaRpcService - Stopping Akka RPC service.
[flink-akka.actor.default-dispatcher-2] INFO org.apache.flink.runtime.blob.PermanentBlobCache - Shutting down BLOB cache
[flink-akka.actor.default-dispatcher-2] INFO org.apache.flink.runtime.blob.TransientBlobCache - Shutting down BLOB cache
[flink-akka.actor.default-dispatcher-2] INFO org.apache.flink.runtime.blob.BlobServer - Stopped BLOB server at 0.0.0.0:36117
[flink-akka.actor.default-dispatcher-2] INFO org.apache.flink.runtime.rpc.akka.AkkaRpcService - Stopped Akka RPC service.
[flink-runner-job-server] INFO org.apache.beam.runners.flink.FlinkRunner - Execution finished in 2585 msecs
[flink-runner-job-server] INFO org.apache.beam.runners.flink.FlinkRunner - Final accumulator values:
[flink-runner-job-server] INFO org.apache.beam.runners.flink.FlinkRunner - __metricscontainers : org.apache.beam.runners.core.metrics.MetricsContainerStepMap@f367da07
INFO:root:Job state changed to DONE
.INFO:root:removing conf dir: /tmp/flinktest-confjSoOXH

----------------------------------------------------------------------
Ran 27 tests in 115.529s

OK (skipped=6)
:beam-sdks-python:flinkCompatibilityMatrixStreamingDOCKER (Thread[Task worker for ':' Thread 5,5,main]) completed. Took 2 mins 8.833 secs.

FAILURE: Build failed with an exception.

* Where:
Build file '<https://builds.apache.org/job/beam_PostCommit_Python_VR_Flink/ws/src/sdks/python/build.gradle'> line: 347

* What went wrong:
Execution failed for task ':beam-sdks-python:flinkCompatibilityMatrixBatchDOCKER'.
> Process 'command 'sh'' finished with non-zero exit value 1

* Try:
Run with --stacktrace option to get the stack trace. Run with --debug option to get more log output. Run with --scan to get full insights.

* Get more help at https://help.gradle.org

Deprecated Gradle features were used in this build, making it incompatible with Gradle 5.0.
Use '--warning-mode all' to show the individual deprecation warnings.
See https://docs.gradle.org/4.10.2/userguide/command_line_interface.html#sec:command_line_warnings

BUILD FAILED in 17m 47s
60 actionable tasks: 55 executed, 4 from cache, 1 up-to-date

Publishing build scan...
https://gradle.com/s/fsv2boimaz2ec

Build step 'Invoke Gradle script' changed build result to FAILURE
Build step 'Invoke Gradle script' marked build as failure

---------------------------------------------------------------------
To unsubscribe, e-mail: builds-unsubscribe@beam.apache.org
For additional commands, e-mail: builds-help@beam.apache.org


Mime
View raw message