beam-builds mailing list archives

Site index · List index
Message view « Date » · « Thread »
Top « Date » · « Thread »
From Apache Jenkins Server <jenk...@builds.apache.org>
Subject Build failed in Jenkins: beam_PostCommit_Java #2297
Date Tue, 08 Jan 2019 17:50:50 GMT
See <https://builds.apache.org/job/beam_PostCommit_Java/2297/display/redirect?page=changes>

Changes:

[iemejia] [BEAM-5798] Add support to write to multiple topics with KafkaIO

------------------------------------------
[...truncated 15.43 KB...]
> Task :beam-runners-google-cloud-dataflow-java-windmill:compileJava FROM-CACHE
> Task :beam-runners-google-cloud-dataflow-java-windmill:processResources
> Task :beam-runners-google-cloud-dataflow-java-windmill:classes
> Task :beam-model-pipeline:compileJava FROM-CACHE
> Task :beam-model-pipeline:processResources
> Task :beam-model-pipeline:classes
> Task :beam-model-pipeline:jar
> Task :beam-model-job-management:extractIncludeProto
> Task :beam-model-fn-execution:extractIncludeProto
> Task :beam-model-job-management:generateProto
> Task :beam-model-fn-execution:generateProto
> Task :beam-model-job-management:compileJava FROM-CACHE
> Task :beam-model-job-management:classes
> Task :beam-model-fn-execution:compileJava FROM-CACHE
> Task :beam-model-fn-execution:classes
> Task :beam-runners-google-cloud-dataflow-java-windmill:shadowJar
> Task :beam-model-pipeline:shadowJar
> Task :beam-model-job-management:shadowJar
> Task :beam-sdks-java-core:compileJava FROM-CACHE
> Task :beam-sdks-java-core:classes
> Task :beam-model-fn-execution:shadowJar
> Task :beam-sdks-java-core:shadowJar
> Task :beam-sdks-java-extensions-protobuf:extractIncludeProto
> Task :beam-sdks-java-extensions-protobuf:generateProto NO-SOURCE

> Task :beam-vendor-sdks-java-extensions-protobuf:compileJava
Note: Some input files use or override a deprecated API.
Note: Recompile with -Xlint:deprecation for details.

> Task :beam-sdks-java-extensions-protobuf:compileJava
Note: Some input files use or override a deprecated API.
Note: Recompile with -Xlint:deprecation for details.

> Task :beam-runners-local-java-core:compileJava
> Task :beam-sdks-java-extensions-protobuf:classes
> Task :beam-vendor-sdks-java-extensions-protobuf:classes
> Task :beam-runners-local-java-core:classes

> Task :beam-sdks-java-fn-execution:compileJava
Note: Some input files use or override a deprecated API.
Note: Recompile with -Xlint:deprecation for details.
Note: Some input files use unchecked or unsafe operations.
Note: Recompile with -Xlint:unchecked for details.

> Task :beam-sdks-java-fn-execution:classes
> Task :beam-runners-local-java-core:shadowJar

> Task :beam-sdks-java-extensions-google-cloud-platform-core:compileJava
Note: <https://builds.apache.org/job/beam_PostCommit_Java/ws/src/sdks/java/extensions/google-cloud-platform-core/src/main/java/org/apache/beam/sdk/util/GcsUtil.java>
uses or overrides a deprecated API.
Note: Recompile with -Xlint:deprecation for details.

> Task :beam-sdks-java-extensions-google-cloud-platform-core:classes
> Task :beam-vendor-sdks-java-extensions-protobuf:shadowJar
> Task :beam-sdks-java-extensions-protobuf:shadowJar
> Task :beam-sdks-java-fn-execution:shadowJar
> Task :beam-sdks-java-extensions-google-cloud-platform-core:shadowJar

> Task :beam-runners-core-construction-java:compileJava
Note: Some input files use or override a deprecated API.
Note: Recompile with -Xlint:deprecation for details.
Note: Some input files use unchecked or unsafe operations.
Note: Recompile with -Xlint:unchecked for details.

> Task :beam-runners-core-construction-java:classes
> Task :beam-runners-core-construction-java:shadowJar

> Task :beam-sdks-java-io-google-cloud-platform:compileJava
Note: Some input files use or override a deprecated API.
Note: Recompile with -Xlint:deprecation for details.
Note: Some input files use unchecked or unsafe operations.
Note: Recompile with -Xlint:unchecked for details.

> Task :beam-sdks-java-io-google-cloud-platform:classes
> Task :beam-sdks-java-io-google-cloud-platform:shadowJar

> Task :beam-runners-core-java:compileJava
Note: Some input files use or override a deprecated API.
Note: Recompile with -Xlint:deprecation for details.
Note: Some input files use unchecked or unsafe operations.
Note: Recompile with -Xlint:unchecked for details.

> Task :beam-runners-core-java:classes
> Task :beam-sdks-java-core:compileTestJava
> Task :beam-runners-core-java:shadowJar

> Task :beam-sdks-java-core:compileTestJava
Note: Some input files use or override a deprecated API.
Note: Recompile with -Xlint:deprecation for details.
Note: Some input files use unchecked or unsafe operations.
Note: Recompile with -Xlint:unchecked for details.

> Task :beam-sdks-java-core:testClasses
> Task :beam-examples-java:compileJava
> Task :beam-examples-java:classes

> Task :beam-runners-google-cloud-dataflow-java:compileJava
Note: Some input files use or override a deprecated API.
Note: Recompile with -Xlint:deprecation for details.
Note: Some input files use unchecked or unsafe operations.
Note: Recompile with -Xlint:unchecked for details.

> Task :beam-runners-google-cloud-dataflow-java:classes
> Task :beam-runners-google-cloud-dataflow-java:shadowJar

> Task :beam-sdks-java-harness:compileJava
Note: Some input files use or override a deprecated API.
Note: Recompile with -Xlint:deprecation for details.
Note: Some input files use unchecked or unsafe operations.
Note: Recompile with -Xlint:unchecked for details.

> Task :beam-sdks-java-harness:classes
> Task :beam-sdks-java-harness:jar

> Task :beam-examples-java:compileTestJava
Note: Some input files use or override a deprecated API.
Note: Recompile with -Xlint:deprecation for details.
Note: Some input files use unchecked or unsafe operations.
Note: Recompile with -Xlint:unchecked for details.

> Task :beam-examples-java:testClasses
> Task :beam-sdks-java-core:shadowTestJar

> Task :beam-sdks-java-extensions-google-cloud-platform-core:compileTestJava
Note: Some input files use or override a deprecated API.
Note: Recompile with -Xlint:deprecation for details.

> Task :beam-sdks-java-extensions-google-cloud-platform-core:testClasses
> Task :beam-sdks-java-extensions-google-cloud-platform-core:shadowTestJar
> Task :beam-sdks-java-harness:shadowJar

> Task :beam-runners-java-fn-execution:compileJava
Note: <https://builds.apache.org/job/beam_PostCommit_Java/ws/src/runners/java-fn-execution/src/main/java/org/apache/beam/runners/fnexecution/ServerFactory.java>
uses or overrides a deprecated API.
Note: Recompile with -Xlint:deprecation for details.
Note: Some input files use unchecked or unsafe operations.
Note: Recompile with -Xlint:unchecked for details.

> Task :beam-runners-java-fn-execution:classes
> Task :beam-runners-java-fn-execution:shadowJar

> Task :beam-runners-direct-java:compileJava
Note: Some input files use or override a deprecated API.
Note: Recompile with -Xlint:deprecation for details.
Note: Some input files use unchecked or unsafe operations.
Note: Recompile with -Xlint:unchecked for details.

> Task :beam-runners-direct-java:classes

> Task :beam-runners-google-cloud-dataflow-java-legacy-worker:compileJava
Note: Some input files use or override a deprecated API.
Note: Recompile with -Xlint:deprecation for details.
Note: Some input files use unchecked or unsafe operations.
Note: Recompile with -Xlint:unchecked for details.

> Task :beam-runners-google-cloud-dataflow-java-legacy-worker:classes
> Task :beam-runners-direct-java:shadowJar
> Task :beam-examples-java:shadowJar
> Task :beam-examples-java:shadowTestJar

> Task :beam-sdks-java-io-google-cloud-platform:compileTestJava
Note: Some input files use or override a deprecated API.
Note: Recompile with -Xlint:deprecation for details.
Note: Some input files use unchecked or unsafe operations.
Note: Recompile with -Xlint:unchecked for details.

> Task :beam-runners-google-cloud-dataflow-java-legacy-worker:shadowJar
> Task :beam-sdks-java-io-google-cloud-platform:testClasses
> Task :beam-sdks-java-io-google-cloud-platform:shadowTestJar
> Task :beam-runners-google-cloud-dataflow-java:coreSDKJavaLegacyWorkerIntegrationTest
> Task :beam-sdks-java-io-google-cloud-platform:integrationTest
> Task :beam-runners-google-cloud-dataflow-java:examplesJavaLegacyWorkerIntegrationTest
> Task :beam-sdks-java-io-google-cloud-platform:postCommit

> Task :beam-runners-google-cloud-dataflow-java:examplesJavaLegacyWorkerIntegrationTest

***********************************************************
***********************************************************
**********************Set Up Pubsub************************
The Pub/Sub topic has been set up for this example: projects/apache-beam-testing/topics/testpipeline-jenkins-0108161310-d2e6542c
The Pub/Sub subscription has been set up for this example: projects/apache-beam-testing/subscriptions/testpipeline-jenkins-0108161310-d2e6542c
******************Set Up Big Query Table*******************
The BigQuery table has been set up for this example: apache-beam-testing:traffic_routes_1546963987551.traffic_routes_table
*************************Tear Down*************************
The Pub/Sub topic has been deleted: projects/apache-beam-testing/topics/testpipeline-jenkins-0108161310-d2e6542c
The Pub/Sub subscription has been deleted: projects/apache-beam-testing/subscriptions/testpipeline-jenkins-0108161310-d2e6542c
The BigQuery table might contain the example's output, and it is not deleted automatically:
apache-beam-testing:traffic_routes_1546963987551.traffic_routes_table
Please go to the Developers Console to delete it manually. Otherwise, you may be charged for
its usage.
***********************************************************
***********************************************************

***********************************************************
***********************************************************
*************************Tear Down*************************
The Pub/Sub topic has been deleted: projects/apache-beam-testing/topics/testpipeline-jenkins-0108161309-c9c9302c
The Pub/Sub subscription has been deleted: projects/apache-beam-testing/subscriptions/testpipeline-jenkins-0108161309-c9c9302c
The BigQuery table might contain the example's output, and it is not deleted automatically:
apache-beam-testing:beam_examples.testpipeline_jenkins_0108161309_c9c9302c
Please go to the Developers Console to delete it manually. Otherwise, you may be charged for
its usage.
***********************************************************
***********************************************************

***********************************************************
***********************************************************
**********************Set Up Pubsub************************
The Pub/Sub topic has been set up for this example: projects/apache-beam-testing/topics/testpipeline-jenkins-0108162045-36f7fac
The Pub/Sub subscription has been set up for this example: projects/apache-beam-testing/subscriptions/testpipeline-jenkins-0108162045-36f7fac
******************Set Up Big Query Table*******************
The BigQuery table has been set up for this example: apache-beam-testing:traffic_max_lane_flow_1546964445035.traffic_max_lane_flow_table
*************************Tear Down*************************
The Pub/Sub topic has been deleted: projects/apache-beam-testing/topics/testpipeline-jenkins-0108162045-36f7fac
The Pub/Sub subscription has been deleted: projects/apache-beam-testing/subscriptions/testpipeline-jenkins-0108162045-36f7fac
The BigQuery table might contain the example's output, and it is not deleted automatically:
apache-beam-testing:traffic_max_lane_flow_1546964445035.traffic_max_lane_flow_table
Please go to the Developers Console to delete it manually. Otherwise, you may be charged for
its usage.
***********************************************************
***********************************************************

> Task :beam-runners-google-cloud-dataflow-java:googleCloudPlatformLegacyWorkerIntegrationTest

org.apache.beam.sdk.io.gcp.spanner.SpannerWriteIT > testSequentialWrite FAILED
    java.lang.RuntimeException at SpannerWriteIT.java:173

org.apache.beam.sdk.io.gcp.spanner.SpannerWriteIT > testFailFast FAILED
    java.lang.AssertionError

24 tests completed, 2 failed

> Task :beam-runners-google-cloud-dataflow-java:googleCloudPlatformLegacyWorkerIntegrationTest
FAILED

FAILURE: Build failed with an exception.

* What went wrong:
Execution failed for task ':beam-runners-google-cloud-dataflow-java:googleCloudPlatformLegacyWorkerIntegrationTest'.
> There were failing tests. See the report at: file://<https://builds.apache.org/job/beam_PostCommit_Java/ws/src/runners/google-cloud-dataflow-java/build/reports/tests/googleCloudPlatformLegacyWorkerIntegrationTest/index.html>

* Try:
Run with --stacktrace option to get the stack trace. Run with --info or --debug option to
get more log output. Run with --scan to get full insights.

* Get more help at https://help.gradle.org

Deprecated Gradle features were used in this build, making it incompatible with Gradle 5.0.
Use '--warning-mode all' to show the individual deprecation warnings.
See https://docs.gradle.org/4.10.3/userguide/command_line_interface.html#sec:command_line_warnings

BUILD FAILED in 1h 44m 19s
74 actionable tasks: 69 executed, 5 from cache

Publishing build scan...
https://gradle.com/s/x7h75shnxf44g

Build step 'Invoke Gradle script' changed build result to FAILURE
Build step 'Invoke Gradle script' marked build as failure

---------------------------------------------------------------------
To unsubscribe, e-mail: builds-unsubscribe@beam.apache.org
For additional commands, e-mail: builds-help@beam.apache.org


Mime
View raw message