beam-builds mailing list archives

Site index · List index
Message view « Date » · « Thread »
Top « Date » · « Thread »
From Apache Jenkins Server <jenk...@builds.apache.org>
Subject Build failed in Jenkins: beam_PreCommit_Java_Cron #782
Date Fri, 04 Jan 2019 00:18:52 GMT
See <https://builds.apache.org/job/beam_PreCommit_Java_Cron/782/display/redirect?page=changes>

Changes:

[ehudm] [BEAM-5959] Reorder methods according to convention

------------------------------------------
[...truncated 553.40 KB...]
> Task :beam-sdks-java-extensions-google-cloud-platform-core:packageTests
> Task :beam-sdks-java-extensions-google-cloud-platform-core:assemble
> Task :beam-sdks-java-core:jar
> Task :beam-sdks-java-extensions-google-cloud-platform-core:checkstyleMain
> Task :beam-runners-reference-java:classes
> Task :beam-runners-reference-java:jar
> Task :beam-sdks-java-extensions-google-cloud-platform-core:checkstyleTest
> Task :beam-sdks-java-core:packageTests
> Task :beam-sdks-java-core:assemble

> Task :beam-runners-gearpump:javadoc
<https://builds.apache.org/job/beam_PreCommit_Java_Cron/ws/src/runners/gearpump/src/main/java/org/apache/beam/runners/gearpump/translators/utils/TranslatorUtils.java>:147:
warning: no @param for unionTag
    public RawUnionValue(String unionTag, Object value) {
           ^
<https://builds.apache.org/job/beam_PreCommit_Java_Cron/ws/src/runners/gearpump/src/main/java/org/apache/beam/runners/gearpump/translators/utils/TranslatorUtils.java>:147:
warning: no @param for value
    public RawUnionValue(String unionTag, Object value) {
           ^
2 warnings

> Task :beam-runners-samza:compileTestJava
> Task :beam-runners-local-java-core:compileTestJava
> Task :beam-runners-local-java-core:testClasses
> Task :beam-runners-local-java-core:packageTests
> Task :beam-runners-local-java-core:assemble
> Task :beam-runners-local-java-core:checkstyleMain
> Task :beam-runners-local-java-core:checkstyleTest
> Task :beam-runners-extensions-java-metrics:compileJava
> Task :beam-runners-extensions-java-metrics:classes
> Task :beam-runners-extensions-java-metrics:jar
> Task :beam-runners-samza:testClasses
> Task :beam-runners-samza:packageTests
> Task :beam-runners-samza:assemble
> Task :beam-sdks-java-extensions-google-cloud-platform-core:findbugsMain
> Task :beam-sdks-java-core:checkstyleMain

> Task :beam-runners-java-fn-execution:compileTestJava
Note: Some input files use or override a deprecated API.
Note: Recompile with -Xlint:deprecation for details.
Note: Some input files use unchecked or unsafe operations.
Note: Recompile with -Xlint:unchecked for details.

> Task :beam-runners-java-fn-execution:testClasses
> Task :beam-runners-samza:checkstyleMain
> Task :beam-runners-java-fn-execution:packageTests
> Task :beam-runners-java-fn-execution:assemble
> Task :beam-runners-local-java-core:findbugsMain
> Task :beam-runners-samza:checkstyleTest
> Task :beam-runners-java-fn-execution:checkstyleMain
> Task :beam-runners-gearpump:test
> Task :beam-runners-local-java-core:javadoc
> Task :beam-runners-java-fn-execution:checkstyleTest
> Task :beam-runners-local-java-core:test
> Task :beam-runners-local-java-core:validateShadedJarDoesntLeakNonProjectClasses
> Task :beam-runners-local-java-core:check
> Task :beam-runners-local-java-core:build
> Task :beam-sdks-java-extensions-google-cloud-platform-core:javadoc
> Task :beam-sdks-java-extensions-protobuf:jar
> Task :beam-sdks-java-extensions-protobuf:extractIncludeTestProto
> Task :beam-runners-reference-java:compileTestJava
> Task :beam-runners-reference-java:testClasses
> Task :beam-runners-reference-java:packageTests
> Task :beam-runners-reference-java:assemble
> Task :beam-runners-gearpump:shadowJar
> Task :beam-runners-reference-java:checkstyleMain
> Task :beam-runners-gearpump:validateShadedJarDoesntLeakNonProjectClasses
> Task :beam-runners-gearpump:check
> Task :beam-runners-gearpump:build
> Task :beam-runners-gearpump:buildDependents
> Task :beam-sdks-java-extensions-protobuf:generateTestProto
> Task :beam-sdks-java-fn-execution:jar
> Task :beam-runners-reference-java:checkstyleTest
> Task :beam-sdks-java-io-solr:shadowJar
> Task :beam-sdks-java-io-solr:validateShadedJarDoesntLeakNonProjectClasses
> Task :beam-sdks-java-io-solr:check
> Task :beam-sdks-java-io-solr:build
> Task :beam-sdks-java-io-solr:buildDependents
> Task :beam-sdks-java-io-common:packageTests
> Task :beam-sdks-java-io-common:assemble
> Task :beam-sdks-java-io-redis:shadowJar
> Task :beam-sdks-java-io-redis:validateShadedJarDoesntLeakNonProjectClasses
> Task :beam-sdks-java-io-redis:check
> Task :beam-sdks-java-io-redis:build
> Task :beam-sdks-java-io-redis:buildDependents
> Task :beam-sdks-java-io-elasticsearch:jar
> Task :beam-sdks-java-io-elasticsearch:compileTestJava NO-SOURCE
> Task :beam-sdks-java-io-elasticsearch:testClasses UP-TO-DATE
> Task :beam-sdks-java-io-elasticsearch:packageTests
> Task :beam-sdks-java-io-elasticsearch:assemble
> Task :beam-sdks-java-io-common:checkstyleTest
> Task :beam-sdks-java-io-elasticsearch:checkstyleMain
> Task :beam-sdks-java-io-elasticsearch:checkstyleTest NO-SOURCE
> Task :beam-sdks-java-harness:testClasses
> Task :beam-sdks-java-harness:packageTests
> Task :beam-sdks-java-harness:assemble
> Task :beam-sdks-java-core:checkstyleTest
> Task :beam-sdks-java-harness:checkstyleMain
> Task :beam-runners-extensions-java-metrics:compileTestJava
> Task :beam-runners-extensions-java-metrics:testClasses
> Task :beam-runners-extensions-java-metrics:packageTests
> Task :beam-runners-extensions-java-metrics:assemble
> Task :beam-runners-extensions-java-metrics:checkstyleMain
> Task :beam-runners-extensions-java-metrics:checkstyleTest
> Task :beam-sdks-java-harness:checkstyleTest
> Task :beam-sdks-java-extensions-google-cloud-platform-core:test
> Task :beam-sdks-java-extensions-google-cloud-platform-core:validateShadedJarDoesntLeakNonProjectClasses
> Task :beam-sdks-java-extensions-google-cloud-platform-core:check
> Task :beam-sdks-java-extensions-google-cloud-platform-core:build
> Task :beam-sdks-java-io-hadoop-common:jar
> Task :beam-runners-samza:findbugsMain
> Task :beam-runners-java-fn-execution:findbugsMain
> Task :beam-runners-reference-java:findbugsMain
> Task :beam-sdks-java-extensions-protobuf:compileTestJava
> Task :beam-sdks-java-fn-execution:compileTestJava
> Task :beam-sdks-java-io-common:test
> Task :beam-sdks-java-io-common:check
> Task :beam-sdks-java-io-common:build
> Task :beam-runners-extensions-java-metrics:findbugsMain
> Task :beam-vendor-sdks-java-extensions-protobuf:jar
> Task :beam-sdks-java-io-elasticsearch:findbugsMain
> Task :beam-vendor-sdks-java-extensions-protobuf:compileTestJava NO-SOURCE
> Task :beam-vendor-sdks-java-extensions-protobuf:testClasses UP-TO-DATE
> Task :beam-vendor-sdks-java-extensions-protobuf:packageTests
> Task :beam-vendor-sdks-java-extensions-protobuf:assemble
> Task :beam-vendor-sdks-java-extensions-protobuf:checkstyleMain NO-SOURCE
> Task :beam-runners-reference-java:javadoc
> Task :beam-vendor-sdks-java-extensions-protobuf:checkstyleTest NO-SOURCE
> Task :beam-sdks-java-core:findbugsMain
> Task :beam-runners-extensions-java-metrics:javadoc
> Task :beam-runners-samza:javadoc
> Task :beam-sdks-java-harness:findbugsMain
> Task :beam-sdks-java-io-elasticsearch:javadoc
> Task :beam-sdks-java-io-elasticsearch:test NO-SOURCE
> Task :beam-sdks-java-io-hadoop-common:compileTestJava
> Task :beam-sdks-java-io-elasticsearch:validateShadedJarDoesntLeakNonProjectClasses
> Task :beam-sdks-java-io-elasticsearch:check
> Task :beam-sdks-java-io-elasticsearch:build
> Task :beam-sdks-java-io-elasticsearch:buildDependents
> Task :beam-sdks-java-io-common:buildDependents
> Task :beam-runners-extensions-java-metrics:test
> Task :beam-runners-java-fn-execution:javadoc
> Task :beam-runners-reference-java:test
> Task :beam-vendor-sdks-java-extensions-protobuf:findbugsMain
> Task :beam-vendor-sdks-java-extensions-protobuf:javadoc NO-SOURCE
> Task :beam-vendor-sdks-java-extensions-protobuf:test NO-SOURCE
> Task :beam-vendor-sdks-java-extensions-protobuf:validateShadedJarDoesntLeakNonProjectClasses
> Task :beam-vendor-sdks-java-extensions-protobuf:check
> Task :beam-vendor-sdks-java-extensions-protobuf:build
> Task :beam-sdks-java-harness:javadoc
> Task :beam-sdks-java-io-hadoop-common:testClasses
> Task :beam-sdks-java-io-hadoop-common:packageTests
> Task :beam-sdks-java-io-hadoop-common:assemble
> Task :beam-runners-extensions-java-metrics:shadowJar
> Task :beam-runners-reference-java:shadowJar
> Task :beam-runners-extensions-java-metrics:validateShadedJarDoesntLeakNonProjectClasses
> Task :beam-runners-extensions-java-metrics:check
> Task :beam-runners-extensions-java-metrics:build
> Task :beam-runners-extensions-java-metrics:buildDependents
> Task :beam-runners-reference-java:validateShadedJarDoesntLeakNonProjectClasses
> Task :beam-runners-reference-java:check
> Task :beam-runners-reference-java:build
> Task :beam-runners-reference-java:buildDependents
> Task :beam-sdks-java-extensions-protobuf:testClasses
> Task :beam-sdks-java-extensions-protobuf:packageTests
> Task :beam-sdks-java-extensions-protobuf:assemble
> Task :beam-sdks-java-io-hadoop-common:checkstyleMain
> Task :beam-sdks-java-extensions-sql-jdbc:shadowJarTest
> Task :beam-sdks-java-extensions-sql-jdbc:preCommit
> Task :beam-sdks-java-io-hadoop-common:checkstyleTest
> Task :beam-sdks-java-extensions-protobuf:checkstyleMain
> Task :beam-runners-java-fn-execution:test
> Task :beam-runners-java-fn-execution:validateShadedJarDoesntLeakNonProjectClasses
> Task :beam-runners-java-fn-execution:check
> Task :beam-runners-java-fn-execution:build
> Task :beam-sdks-java-fn-execution:testClasses
> Task :beam-sdks-java-fn-execution:packageTests
> Task :beam-sdks-java-fn-execution:assemble
> Task :beam-runners-samza:test
> Task :beam-sdks-java-extensions-protobuf:checkstyleTest
> Task :beam-sdks-java-fn-execution:checkstyleMain
> Task :beam-sdks-java-fn-execution:checkstyleTest
> Task :beam-sdks-java-harness:test
> Task :beam-sdks-java-harness:check
> Task :beam-sdks-java-harness:build
> Task :beam-runners-samza:shadowJar
> Task :beam-runners-samza:validateShadedJarDoesntLeakNonProjectClasses
> Task :beam-runners-samza:check
> Task :beam-runners-samza:build
> Task :beam-runners-samza:buildDependents
> Task :beam-sdks-java-io-hadoop-common:findbugsMain
> Task :beam-sdks-java-extensions-protobuf:findbugsMain
> Task :beam-sdks-java-io-hadoop-common:javadoc
> Task :beam-sdks-java-extensions-protobuf:javadoc
> Task :beam-sdks-java-io-hadoop-common:test
> Task :beam-sdks-java-io-hadoop-common:validateShadedJarDoesntLeakNonProjectClasses
> Task :beam-sdks-java-io-hadoop-common:check
> Task :beam-sdks-java-io-hadoop-common:build
> Task :beam-sdks-java-io-hadoop-common:buildDependents
> Task :beam-sdks-java-extensions-protobuf:test
> Task :beam-sdks-java-fn-execution:findbugsMain
> Task :beam-sdks-java-extensions-protobuf:validateShadedJarDoesntLeakNonProjectClasses
> Task :beam-sdks-java-extensions-protobuf:check
> Task :beam-sdks-java-extensions-protobuf:build
> Task :beam-sdks-java-fn-execution:javadoc
> Task :beam-sdks-java-core:javadoc
> Task :beam-sdks-java-javadoc:allJavadoc
> Task :beam-sdks-java-fn-execution:test
> Task :beam-sdks-java-fn-execution:validateShadedJarDoesntLeakNonProjectClasses
> Task :beam-sdks-java-fn-execution:check
> Task :beam-sdks-java-fn-execution:build
> Task :beam-sdks-java-core:test
> Task :beam-sdks-java-core:validateShadedJarDoesntLeakNonProjectClasses
> Task :beam-sdks-java-core:check
> Task :beam-sdks-java-core:build
> Task :beam-sdks-java-core:buildNeeded
> Task :beam-sdks-java-nexmark:shadowJar
> Task :beam-sdks-java-nexmark:validateShadedJarDoesntLeakNonProjectClasses
> Task :beam-sdks-java-nexmark:check
> Task :beam-sdks-java-nexmark:build
> Task :beam-sdks-java-nexmark:buildDependents
> Task :beam-sdks-java-extensions-sql:buildDependents
> Task :beam-sdks-java-io-kafka:buildDependents
> Task :beam-sdks-java-test-utils:buildDependents
> Task :beam-sdks-java-extensions-join-library:buildDependents

FAILURE: Build failed with an exception.

* What went wrong:
Execution failed for task ':beam-runners-flink-1.6:test'.
> Process 'Gradle Test Executor 42' finished with non-zero exit value 1
  This problem might be caused by incorrect test process configuration.
  Please refer to the test execution section in the user guide at https://docs.gradle.org/4.10.2/userguide/java_plugin.html#sec:test_execution

* Try:
Run with --stacktrace option to get the stack trace. Run with --info or --debug option to
get more log output. Run with --scan to get full insights.

* Get more help at https://help.gradle.org

Deprecated Gradle features were used in this build, making it incompatible with Gradle 5.0.
Use '--warning-mode all' to show the individual deprecation warnings.
See https://docs.gradle.org/4.10.2/userguide/command_line_interface.html#sec:command_line_warnings

BUILD FAILED in 18m 20s
869 actionable tasks: 856 executed, 13 from cache

Publishing build scan...
https://gradle.com/s/pkspsk454kkli

Build step 'Invoke Gradle script' changed build result to FAILURE
Build step 'Invoke Gradle script' marked build as failure

---------------------------------------------------------------------
To unsubscribe, e-mail: builds-unsubscribe@beam.apache.org
For additional commands, e-mail: builds-help@beam.apache.org


Mime
View raw message