beam-builds mailing list archives

Site index · List index
Message view « Date » · « Thread »
Top « Date » · « Thread »
From Apache Jenkins Server <jenk...@builds.apache.org>
Subject Build failed in Jenkins: beam_PostCommit_Java_PortabilityApi #615
Date Mon, 07 Jan 2019 19:26:06 GMT
See <https://builds.apache.org/job/beam_PostCommit_Java_PortabilityApi/615/display/redirect?page=changes>

Changes:

[boyuanz] Fix Portable VR configuration

[ajamato] Change warning logic to only consider work items without an ID to be

------------------------------------------
[...truncated 40.15 KB...]

> Task :beam-runners-core-construction-java:compileJava
Note: Some input files use or override a deprecated API.
Note: Recompile with -Xlint:deprecation for details.
Note: Some input files use unchecked or unsafe operations.
Note: Recompile with -Xlint:unchecked for details.

> Task :beam-runners-core-construction-java:classes
> Task :beam-runners-core-construction-java:shadowJar

> Task :beam-sdks-java-io-google-cloud-platform:compileJava
Note: Some input files use or override a deprecated API.
Note: Recompile with -Xlint:deprecation for details.
Note: Some input files use unchecked or unsafe operations.
Note: Recompile with -Xlint:unchecked for details.

> Task :beam-sdks-java-io-google-cloud-platform:classes
> Task :beam-sdks-java-io-google-cloud-platform:shadowJar

> Task :beam-runners-core-java:compileJava
Note: Some input files use or override a deprecated API.
Note: Recompile with -Xlint:deprecation for details.
Note: Some input files use unchecked or unsafe operations.
Note: Recompile with -Xlint:unchecked for details.

> Task :beam-runners-core-java:classes
> Task :beam-sdks-java-core:compileTestJava
> Task :beam-runners-core-java:shadowJar

> Task :beam-sdks-java-core:compileTestJava
Note: Some input files use or override a deprecated API.
Note: Recompile with -Xlint:deprecation for details.
Note: Some input files use unchecked or unsafe operations.
Note: Recompile with -Xlint:unchecked for details.

> Task :beam-sdks-java-core:testClasses
> Task :beam-examples-java:compileJava
> Task :beam-examples-java:classes

> Task :beam-runners-google-cloud-dataflow-java:compileJava
Note: Some input files use or override a deprecated API.
Note: Recompile with -Xlint:deprecation for details.
Note: Some input files use unchecked or unsafe operations.
Note: Recompile with -Xlint:unchecked for details.

> Task :beam-runners-google-cloud-dataflow-java:classes

> Task :beam-sdks-java-harness:compileJava
Note: Some input files use or override a deprecated API.
Note: Recompile with -Xlint:deprecation for details.
Note: Some input files use unchecked or unsafe operations.
Note: Recompile with -Xlint:unchecked for details.

> Task :beam-runners-google-cloud-dataflow-java:shadowJar
> Task :beam-sdks-java-harness:classes

> Task :beam-examples-java:compileTestJava
Note: Some input files use or override a deprecated API.
Note: Recompile with -Xlint:deprecation for details.
Note: Some input files use unchecked or unsafe operations.
Note: Recompile with -Xlint:unchecked for details.

> Task :beam-examples-java:testClasses
> Task :beam-sdks-java-core:shadowTestJar

> Task :beam-sdks-java-extensions-google-cloud-platform-core:compileTestJava
Note: Some input files use or override a deprecated API.
Note: Recompile with -Xlint:deprecation for details.

> Task :beam-sdks-java-extensions-google-cloud-platform-core:testClasses
> Task :beam-sdks-java-extensions-google-cloud-platform-core:shadowTestJar
> Task :beam-sdks-java-harness:shadowJar

> Task :beam-sdks-go:resolveBuildDependencies
Resolving google.golang.org/api: commit='386d4e5f4f92f86e6aec85985761bba4b938a2d5', urls=[https://code.googlesource.com/google-api-go-client]

> Task :beam-sdks-java-harness:jar
> Task :beam-sdks-java-container:copyDockerfileDependencies

> Task :beam-sdks-go:resolveBuildDependencies
Resolving google.golang.org/genproto: commit='2b5a72b8730b0b16380010cfe5286c42108d88e7', urls=[https://github.com/google/go-genproto]
Resolving google.golang.org/grpc: commit='7646b5360d049a7ca31e9133315db43456f39e2e', urls=[https://github.com/grpc/grpc-go]
Resolving cached github.com/coreos/etcd: commit='11214aa33bf5a47d3d9d8dafe0f6b97237dfe921',
urls=[https://github.com/coreos/etcd.git, git@github.com:coreos/etcd.git]
Resolving cached github.com/coreos/etcd: commit='11214aa33bf5a47d3d9d8dafe0f6b97237dfe921',
urls=[https://github.com/coreos/etcd.git, git@github.com:coreos/etcd.git]

> Task :beam-sdks-go:installDependencies

> Task :beam-runners-java-fn-execution:compileJava
Note: <https://builds.apache.org/job/beam_PostCommit_Java_PortabilityApi/ws/src/runners/java-fn-execution/src/main/java/org/apache/beam/runners/fnexecution/ServerFactory.java>
uses or overrides a deprecated API.
Note: Recompile with -Xlint:deprecation for details.
Note: Some input files use unchecked or unsafe operations.
Note: Recompile with -Xlint:unchecked for details.

> Task :beam-sdks-go:buildLinuxAmd64
> Task :beam-sdks-go:build

> Task :beam-sdks-java-container:resolveBuildDependencies
Resolving ./github.com/apache/beam/sdks/go@<https://builds.apache.org/job/beam_PostCommit_Java_PortabilityApi/ws/src/sdks/go>

> Task :beam-sdks-java-container:installDependencies
> Task :beam-runners-java-fn-execution:classes
> Task :beam-sdks-java-container:buildLinuxAmd64
> Task :beam-sdks-java-container:build
> Task :beam-sdks-java-container:dockerPrepare
> Task :beam-runners-java-fn-execution:shadowJar

> Task :beam-sdks-java-container:docker
 ---> Running in 77febd480d68
 ---> 7c6af55b7758
Removing intermediate container 77febd480d68
Step 3/7 : ADD target/slf4j-api.jar /opt/apache/beam/jars/
 ---> 8e33e814496c
Removing intermediate container 00cd89f7201b
Step 4/7 : ADD target/slf4j-jdk14.jar /opt/apache/beam/jars/
 ---> cd088e6c925c
Removing intermediate container 126d31c5a855
Step 5/7 : ADD target/beam-sdks-java-harness.jar /opt/apache/beam/jars/
 ---> 94d8f890a0e8
Removing intermediate container 6efcc975ed63
Step 6/7 : ADD target/linux_amd64/boot /opt/apache/beam/
 ---> aa8b713a8987
Removing intermediate container 539f888ffa2c
Step 7/7 : ENTRYPOINT /opt/apache/beam/boot
 ---> Running in 96343bf76ccb
 ---> 609f006dee5f
Removing intermediate container 96343bf76ccb
Successfully built 609f006dee5f
Successfully tagged jenkins-docker-apache.bintray.io/beam/java:latest

> Task :beam-runners-google-cloud-dataflow-java:buildAndPushDockerContainer
The push refers to a repository [us.gcr.io/apache-beam-testing/java-postcommit-it/java]
95dcb0222c6e: Preparing
585c712b3107: Preparing
6311b57327a7: Preparing
3eba5178b7db: Preparing
08b1513fa90e: Preparing
38af37073821: Preparing
a7702ebc484e: Preparing
7b1186903462: Preparing
d2217ead3a1c: Preparing
b53b57a50746: Preparing
d2518892581f: Preparing
c581f4ede92d: Preparing
b53b57a50746: Waiting
d2518892581f: Waiting
c581f4ede92d: Waiting
a7702ebc484e: Waiting
7b1186903462: Waiting
d2217ead3a1c: Waiting
08b1513fa90e: Layer already exists
38af37073821: Layer already exists
a7702ebc484e: Layer already exists
7b1186903462: Layer already exists
d2217ead3a1c: Layer already exists
b53b57a50746: Layer already exists
d2518892581f: Layer already exists
c581f4ede92d: Layer already exists
6311b57327a7: Pushed
3eba5178b7db: Pushed
95dcb0222c6e: Pushed
585c712b3107: Pushed

> Task :beam-runners-direct-java:compileJava
Note: Some input files use or override a deprecated API.
Note: Recompile with -Xlint:deprecation for details.
Note: Some input files use unchecked or unsafe operations.
Note: Recompile with -Xlint:unchecked for details.

> Task :beam-runners-direct-java:classes

> Task :beam-runners-google-cloud-dataflow-java:buildAndPushDockerContainer
20190107172331: digest: sha256:0ec061b3e40f55dad090cb128345660c62f0d5345e6fc1780e350c0b4ede0cd3
size: 2841

> Task :beam-runners-google-cloud-dataflow-java-fn-api-worker:compileJava
Note: Some input files use or override a deprecated API.
Note: Recompile with -Xlint:deprecation for details.
Note: Some input files use unchecked or unsafe operations.
Note: Recompile with -Xlint:unchecked for details.

> Task :beam-runners-google-cloud-dataflow-java-fn-api-worker:classes
> Task :beam-runners-direct-java:shadowJar
> Task :beam-examples-java:shadowJar
> Task :beam-examples-java:shadowTestJar
> Task :beam-runners-google-cloud-dataflow-java-fn-api-worker:shadowJar

> Task :beam-sdks-java-io-google-cloud-platform:compileTestJava
Note: Some input files use or override a deprecated API.
Note: Recompile with -Xlint:deprecation for details.
Note: Some input files use unchecked or unsafe operations.
Note: Recompile with -Xlint:unchecked for details.

> Task :beam-sdks-java-io-google-cloud-platform:testClasses
> Task :beam-sdks-java-io-google-cloud-platform:shadowTestJar
> Task :beam-runners-google-cloud-dataflow-java:coreSDKJavaFnApiWorkerIntegrationTest
> Task :beam-runners-google-cloud-dataflow-java:examplesJavaFnApiWorkerIntegrationTest
> Task :beam-runners-google-cloud-dataflow-java:googleCloudPlatformFnApiWorkerIntegrationTest

org.apache.beam.sdk.io.gcp.bigquery.BigQueryToTableIT > testLegacyQueryWithoutReshuffle
FAILED
    java.lang.RuntimeException at BigQueryToTableIT.java:111

7 tests completed, 1 failed

> Task :beam-runners-google-cloud-dataflow-java:googleCloudPlatformFnApiWorkerIntegrationTest
FAILED

> Task :beam-runners-google-cloud-dataflow-java:cleanUpDockerImages
Untagged: us.gcr.io/apache-beam-testing/java-postcommit-it/java:20190107172331
Untagged: us.gcr.io/apache-beam-testing/java-postcommit-it/java@sha256:0ec061b3e40f55dad090cb128345660c62f0d5345e6fc1780e350c0b4ede0cd3
Deleted: sha256:609f006dee5f14eb0d442470fbca97bd96940ab32000c9c5ee04c1f9b569dba4
Deleted: sha256:aa8b713a8987deedbb5a59b67c9cbde3074010ed59ccc60be8d5d56ab37da7ef
Deleted: sha256:d4458592ee109df337f9a60016bab6632b1472e364a7fc59b1f83feb8eb5b507
Deleted: sha256:94d8f890a0e81a296de2c4d8969b82df6b8fedd97fde30dc8faf25c8dc275cf2
Deleted: sha256:81ecab5ec4d768f258bb7b9d66f80b2be789be0b5504a10a099c8b7ffee90109
Deleted: sha256:cd088e6c925c044dc5cc03a407f93f337430a72fb4d95777208e88630166b040
Deleted: sha256:2d44b149677ff427271e170a74f0841aa2ce3195d16bfff2a0d3f6aab8f0a609
Deleted: sha256:8e33e814496ccee6724c12d1bc80366b8efd69b16ffcc3d65e7039f79c5de98f
Deleted: sha256:fcb4f3e154cf732051af5860b1b12bccbd140a15afda8ea9fd191c437481d764
Deleted: sha256:7c6af55b775802fcbbb5cf27539b23acc5529b4607121b83baa467b07185db42
Digests:
- us.gcr.io/apache-beam-testing/java-postcommit-it/java@sha256:0ec061b3e40f55dad090cb128345660c62f0d5345e6fc1780e350c0b4ede0cd3
  Associated tags:
 - 20190107172331
Tags:
- us.gcr.io/apache-beam-testing/java-postcommit-it/java:20190107172331
Deleted [us.gcr.io/apache-beam-testing/java-postcommit-it/java:20190107172331].
Deleted [us.gcr.io/apache-beam-testing/java-postcommit-it/java@sha256:0ec061b3e40f55dad090cb128345660c62f0d5345e6fc1780e350c0b4ede0cd3].

FAILURE: Build failed with an exception.

* What went wrong:
Execution failed for task ':beam-runners-google-cloud-dataflow-java:googleCloudPlatformFnApiWorkerIntegrationTest'.
> There were failing tests. See the report at: file://<https://builds.apache.org/job/beam_PostCommit_Java_PortabilityApi/ws/src/runners/google-cloud-dataflow-java/build/reports/tests/googleCloudPlatformFnApiWorkerIntegrationTest/index.html>

* Try:
Run with --stacktrace option to get the stack trace. Run with --info or --debug option to
get more log output. Run with --scan to get full insights.

* Get more help at https://help.gradle.org

Deprecated Gradle features were used in this build, making it incompatible with Gradle 5.0.
Use '--warning-mode all' to show the individual deprecation warnings.
See https://docs.gradle.org/4.10.3/userguide/command_line_interface.html#sec:command_line_warnings

BUILD FAILED in 2h 2m 45s
90 actionable tasks: 84 executed, 5 from cache, 1 up-to-date

Publishing build scan...
https://gradle.com/s/6bcickjfoaguw

Build step 'Invoke Gradle script' changed build result to FAILURE
Build step 'Invoke Gradle script' marked build as failure

---------------------------------------------------------------------
To unsubscribe, e-mail: builds-unsubscribe@beam.apache.org
For additional commands, e-mail: builds-help@beam.apache.org


Mime
View raw message