beam-builds mailing list archives

Site index · List index
Message view « Date » · « Thread »
Top « Date » · « Thread »
From Apache Jenkins Server <jenk...@builds.apache.org>
Subject Build failed in Jenkins: beam_PreCommit_Java_Cron #803
Date Wed, 09 Jan 2019 06:19:47 GMT
See <https://builds.apache.org/job/beam_PreCommit_Java_Cron/803/display/redirect?page=changes>

Changes:

[robbe.sneyders] Python 3 port textio

[robbe.sneyders] Copy helpers into textio_test

------------------------------------------
[...truncated 631.83 KB...]
> Task :beam-sdks-java-io-tika:packageTests
> Task :beam-sdks-java-io-tika:assemble
> Task :beam-sdks-java-io-tika:checkstyleTest
> Task :beam-sdks-java-io-redis:test
> Task :beam-runners-samza:checkstyleMain
> Task :beam-runners-samza:checkstyleTest
> Task :beam-sdks-java-test-utils:test
> Task :beam-sdks-java-test-utils:check
> Task :beam-sdks-java-test-utils:build
> Task :beam-sdks-java-io-rabbitmq:check
> Task :beam-sdks-java-io-rabbitmq:build
> Task :beam-sdks-java-io-rabbitmq:buildDependents
> Task :beam-sdks-java-io-synthetic:findbugsMain
> Task :beam-runners-direct-java:jar
> Task :beam-sdks-java-io-xml:test
> Task :beam-sdks-java-io-solr:test
> Task :beam-runners-direct-java:packageTests
> Task :beam-runners-direct-java:assemble
> Task :beam-runners-reference-java:javadoc
> Task :beam-sdks-java-io-synthetic:javadoc
> Task :beam-runners-direct-java:checkstyleMain
> Task :beam-runners-java-fn-execution:javadoc
> Task :beam-sdks-java-io-xml:check
> Task :beam-sdks-java-io-xml:build
> Task :beam-sdks-java-io-xml:buildDependents
> Task :beam-runners-direct-java:checkstyleTest
> Task :beam-sdks-java-io-tika:test
> Task :beam-sdks-java-io-tika:check
> Task :beam-sdks-java-io-tika:build
> Task :beam-sdks-java-io-tika:buildDependents
> Task :beam-sdks-java-extensions-kryo:compileTestJava
> Task :beam-sdks-java-extensions-kryo:testClasses
> Task :beam-sdks-java-extensions-kryo:packageTests
> Task :beam-sdks-java-extensions-kryo:assemble
> Task :beam-sdks-java-extensions-kryo:checkstyleTest
> Task :beam-runners-samza:findbugsMain
> Task :beam-sdks-java-extensions-sql:validateShadedJarDoesntLeakNonProjectClasses
> Task :beam-sdks-java-extensions-sql:check
> Task :beam-sdks-java-extensions-sql:build
> Task :beam-sdks-java-io-synthetic:test
> Task :beam-sdks-java-io-synthetic:validateShadedJarDoesntLeakNonProjectClasses
> Task :beam-sdks-java-io-synthetic:check
> Task :beam-sdks-java-io-synthetic:build
> Task :beam-sdks-java-io-synthetic:buildDependents
> Task :beam-runners-local-java-core:testClasses
> Task :beam-runners-reference-java:test
> Task :beam-runners-local-java-core:packageTests
> Task :beam-runners-local-java-core:assemble
> Task :beam-runners-local-java-core:checkstyleMain
> Task :beam-sdks-java-extensions-kryo:test
> Task :beam-sdks-java-extensions-kryo:check
> Task :beam-sdks-java-extensions-kryo:build
> Task :beam-runners-local-java-core:checkstyleTest
> Task :beam-runners-extensions-java-metrics:shadowJar
> Task :beam-runners-extensions-java-metrics:validateShadedJarDoesntLeakNonProjectClasses
> Task :beam-runners-extensions-java-metrics:check
> Task :beam-runners-extensions-java-metrics:build
> Task :beam-runners-extensions-java-metrics:buildDependents
> Task :beam-sdks-java-extensions-google-cloud-platform-core:jar
> Task :beam-sdks-java-extensions-google-cloud-platform-core:packageTests
> Task :beam-sdks-java-extensions-google-cloud-platform-core:assemble
> Task :beam-sdks-java-core:jar
> Task :beam-sdks-java-extensions-euphoria:compileTestJava
> Task :beam-runners-samza:javadoc
> Task :beam-runners-reference-java:shadowJar
> Task :beam-runners-java-fn-execution:test
> Task :beam-sdks-java-io-solr:check
> Task :beam-sdks-java-io-solr:build
> Task :beam-sdks-java-io-solr:buildDependents
> Task :beam-sdks-java-extensions-protobuf:jar
> Task :beam-sdks-java-extensions-google-cloud-platform-core:checkstyleMain
> Task :beam-runners-reference-java:validateShadedJarDoesntLeakNonProjectClasses
> Task :beam-runners-reference-java:check
> Task :beam-runners-reference-java:build
> Task :beam-runners-reference-java:buildDependents
> Task :beam-runners-java-fn-execution:validateShadedJarDoesntLeakNonProjectClasses
> Task :beam-runners-java-fn-execution:check
> Task :beam-runners-java-fn-execution:build
> Task :beam-runners-local-java-core:findbugsMain
> Task :beam-sdks-java-io-common:packageTests
> Task :beam-sdks-java-io-common:assemble
> Task :beam-sdks-java-fn-execution:jar
> Task :beam-runners-direct-java:findbugsMain
> Task :beam-sdks-java-io-common:checkstyleTest
> Task :beam-sdks-java-extensions-google-cloud-platform-core:checkstyleTest
> Task :beam-sdks-java-core:packageTests
> Task :beam-sdks-java-core:assemble
> Task :beam-runners-local-java-core:javadoc
> Task :beam-sdks-java-extensions-protobuf:extractIncludeTestProto
> Task :beam-sdks-java-extensions-protobuf:generateTestProto
> Task :beam-runners-local-java-core:test
> Task :beam-runners-local-java-core:validateShadedJarDoesntLeakNonProjectClasses
> Task :beam-runners-local-java-core:check
> Task :beam-runners-local-java-core:build
> Task :beam-sdks-java-io-elasticsearch:jar
> Task :beam-sdks-java-io-elasticsearch:compileTestJava NO-SOURCE
> Task :beam-sdks-java-io-elasticsearch:testClasses UP-TO-DATE
> Task :beam-sdks-java-io-elasticsearch:packageTests
> Task :beam-sdks-java-io-elasticsearch:assemble
> Task :beam-sdks-java-io-elasticsearch:checkstyleMain
> Task :beam-sdks-java-io-elasticsearch:checkstyleTest NO-SOURCE
> Task :beam-runners-direct-java:javadoc
> Task :beam-sdks-java-extensions-google-cloud-platform-core:findbugsMain
> Task :beam-sdks-java-io-elasticsearch:findbugsMain
> Task :beam-runners-samza:test
> Task :beam-sdks-java-io-elasticsearch:javadoc
> Task :beam-sdks-java-extensions-google-cloud-platform-core:javadoc
> Task :beam-sdks-java-io-elasticsearch:test NO-SOURCE
> Task :beam-sdks-java-io-common:test
> Task :beam-sdks-java-io-common:check
> Task :beam-sdks-java-io-common:build
> Task :beam-sdks-java-io-elasticsearch:validateShadedJarDoesntLeakNonProjectClasses
> Task :beam-sdks-java-fn-execution:compileTestJava
> Task :beam-sdks-java-io-elasticsearch:check
> Task :beam-sdks-java-io-elasticsearch:build
> Task :beam-sdks-java-io-hadoop-common:jar
> Task :beam-sdks-java-io-elasticsearch:buildDependents
> Task :beam-vendor-sdks-java-extensions-protobuf:jar
> Task :beam-vendor-sdks-java-extensions-protobuf:compileTestJava NO-SOURCE
> Task :beam-vendor-sdks-java-extensions-protobuf:testClasses UP-TO-DATE
> Task :beam-vendor-sdks-java-extensions-protobuf:packageTests
> Task :beam-vendor-sdks-java-extensions-protobuf:assemble
> Task :beam-vendor-sdks-java-extensions-protobuf:checkstyleMain NO-SOURCE
> Task :beam-vendor-sdks-java-extensions-protobuf:checkstyleTest NO-SOURCE
> Task :beam-sdks-java-core:checkstyleMain
> Task :beam-sdks-java-io-redis:check
> Task :beam-sdks-java-io-redis:build
> Task :beam-sdks-java-io-redis:buildDependents
> Task :beam-sdks-java-extensions-protobuf:compileTestJava
> Task :beam-sdks-java-extensions-euphoria:testClasses
> Task :beam-sdks-java-extensions-euphoria:packageTests
> Task :beam-sdks-java-extensions-euphoria:assemble
> Task :beam-sdks-java-extensions-euphoria:checkstyleTest
> Task :beam-sdks-java-extensions-google-cloud-platform-core:test
> Task :beam-runners-samza:shadowJar
> Task :beam-sdks-java-extensions-google-cloud-platform-core:validateShadedJarDoesntLeakNonProjectClasses
> Task :beam-runners-samza:validateShadedJarDoesntLeakNonProjectClasses
> Task :beam-runners-samza:check
> Task :beam-runners-samza:build
> Task :beam-runners-samza:buildDependents
> Task :beam-sdks-java-extensions-google-cloud-platform-core:check
> Task :beam-sdks-java-extensions-google-cloud-platform-core:build
> Task :beam-vendor-sdks-java-extensions-protobuf:findbugsMain
> Task :beam-vendor-sdks-java-extensions-protobuf:javadoc NO-SOURCE
> Task :beam-vendor-sdks-java-extensions-protobuf:test NO-SOURCE
> Task :beam-vendor-sdks-java-extensions-protobuf:validateShadedJarDoesntLeakNonProjectClasses
> Task :beam-vendor-sdks-java-extensions-protobuf:check
> Task :beam-vendor-sdks-java-extensions-protobuf:build
> Task :beam-runners-direct-java:test
> Task :beam-sdks-java-fn-execution:testClasses
> Task :beam-sdks-java-fn-execution:packageTests
> Task :beam-sdks-java-fn-execution:assemble
> Task :beam-sdks-java-extensions-protobuf:testClasses
> Task :beam-sdks-java-extensions-protobuf:packageTests
> Task :beam-sdks-java-extensions-protobuf:assemble
> Task :beam-sdks-java-extensions-protobuf:checkstyleMain
> Task :beam-sdks-java-fn-execution:checkstyleMain
> Task :beam-sdks-java-extensions-protobuf:checkstyleTest
> Task :beam-sdks-java-core:checkstyleTest
> Task :beam-sdks-java-core:findbugsMain FROM-CACHE
> Task :beam-sdks-java-fn-execution:checkstyleTest
> Task :beam-sdks-java-io-hadoop-common:compileTestJava
> Task :beam-sdks-java-io-hadoop-common:testClasses
> Task :beam-sdks-java-io-hadoop-common:packageTests
> Task :beam-sdks-java-io-hadoop-common:assemble
> Task :beam-sdks-java-io-hadoop-common:checkstyleMain
> Task :beam-sdks-java-extensions-sql-jdbc:shadowJarTest
> Task :beam-sdks-java-extensions-sql-jdbc:preCommit
> Task :beam-sdks-java-io-hadoop-common:checkstyleTest
> Task :beam-sdks-java-extensions-protobuf:findbugsMain
> Task :beam-sdks-java-extensions-euphoria:test
> Task :beam-sdks-java-io-hadoop-common:findbugsMain
> Task :beam-sdks-java-extensions-protobuf:javadoc
> Task :beam-sdks-java-fn-execution:findbugsMain
> Task :beam-runners-direct-java:validateShadedJarDoesntLeakNonProjectClasses
> Task :beam-runners-direct-java:check
> Task :beam-runners-direct-java:build
> Task :beam-sdks-java-io-hadoop-common:javadoc
> Task :beam-sdks-java-extensions-protobuf:test
> Task :beam-sdks-java-extensions-protobuf:validateShadedJarDoesntLeakNonProjectClasses
> Task :beam-sdks-java-extensions-protobuf:check
> Task :beam-sdks-java-extensions-protobuf:build
> Task :beam-sdks-java-fn-execution:javadoc
> Task :beam-sdks-java-io-hadoop-common:test
> Task :beam-sdks-java-io-hadoop-common:validateShadedJarDoesntLeakNonProjectClasses
> Task :beam-sdks-java-io-hadoop-common:check
> Task :beam-sdks-java-io-hadoop-common:build
> Task :beam-sdks-java-core:javadoc
> Task :beam-sdks-java-javadoc:allJavadoc
> Task :beam-sdks-java-extensions-euphoria:check
> Task :beam-sdks-java-extensions-euphoria:build
> Task :beam-sdks-java-extensions-euphoria:buildDependents
> Task :beam-sdks-java-extensions-kryo:buildDependents
> Task :beam-sdks-java-fn-execution:test
> Task :beam-sdks-java-fn-execution:validateShadedJarDoesntLeakNonProjectClasses
> Task :beam-sdks-java-fn-execution:check
> Task :beam-sdks-java-fn-execution:build
> Task :beam-sdks-java-io-hbase:check
> Task :beam-sdks-java-io-hbase:build
> Task :beam-sdks-java-io-hbase:buildDependents
> Task :beam-sdks-java-io-common:buildDependents
> Task :beam-sdks-java-io-hadoop-common:buildDependents
> Task :beam-sdks-java-core:test
> Task :beam-sdks-java-core:validateShadedJarDoesntLeakNonProjectClasses
> Task :beam-sdks-java-core:check
> Task :beam-sdks-java-core:build
> Task :beam-sdks-java-core:buildNeeded
> Task :beam-sdks-java-nexmark:shadowJar
> Task :beam-sdks-java-nexmark:validateShadedJarDoesntLeakNonProjectClasses

FAILURE: Build completed with 2 failures.

1: Task failed with an exception.
-----------
* What went wrong:
Execution failed for task ':beam-sdks-java-nexmark:findbugsMain'.
> Failed to run Gradle FindBugs Worker
   > Process 'Gradle FindBugs Worker 99' finished with non-zero exit value 1

* Try:
Run with --stacktrace option to get the stack trace. Run with --info or --debug option to
get more log output. Run with --scan to get full insights.
==============================================================================

2: Task failed with an exception.
-----------
* What went wrong:
Execution failed for task ':beam-runners-flink-1.6:test'.
> Process 'Gradle Test Executor 89' finished with non-zero exit value 137
  This problem might be caused by incorrect test process configuration.
  Please refer to the test execution section in the user guide at https://docs.gradle.org/4.10.3/userguide/java_plugin.html#sec:test_execution

* Try:
Run with --stacktrace option to get the stack trace. Run with --info or --debug option to
get more log output. Run with --scan to get full insights.
==============================================================================

* Get more help at https://help.gradle.org

Deprecated Gradle features were used in this build, making it incompatible with Gradle 5.0.
Use '--warning-mode all' to show the individual deprecation warnings.
See https://docs.gradle.org/4.10.3/userguide/command_line_interface.html#sec:command_line_warnings

BUILD FAILED in 19m 33s
878 actionable tasks: 868 executed, 10 from cache

Publishing build scan...
https://gradle.com/s/ououk2phopkwk

Build step 'Invoke Gradle script' changed build result to FAILURE
Build step 'Invoke Gradle script' marked build as failure

---------------------------------------------------------------------
To unsubscribe, e-mail: builds-unsubscribe@beam.apache.org
For additional commands, e-mail: builds-help@beam.apache.org


Mime
View raw message