beam-builds mailing list archives

Site index · List index
Message view « Date » · « Thread »
Top « Date » · « Thread »
From Apache Jenkins Server <jenk...@builds.apache.org>
Subject Build failed in Jenkins: beam_PostCommit_Java #2742
Date Sat, 02 Mar 2019 02:33:37 GMT
See <https://builds.apache.org/job/beam_PostCommit_Java/2742/display/redirect?page=changes>

Changes:

[github] [BEAM-6711] Fix bq_to_table test for google (#7968)

------------------------------------------
Started by GitHub push by pabloem
[EnvInject] - Loading node environment variables.
Building remotely on beam4 (beam) in workspace <https://builds.apache.org/job/beam_PostCommit_Java/ws/>
No credentials specified
 > git rev-parse --is-inside-work-tree # timeout=10
Fetching changes from the remote Git repository
 > git config remote.origin.url https://github.com/apache/beam.git # timeout=10
Fetching upstream changes from https://github.com/apache/beam.git
 > git --version # timeout=10
 > git fetch --tags --progress https://github.com/apache/beam.git +refs/heads/*:refs/remotes/origin/*
+refs/pull/${ghprbPullId}/*:refs/remotes/origin/pr/${ghprbPullId}/*
 > git rev-parse origin/master^{commit} # timeout=10
Checking out Revision d49960b781dc341d2e7b380efb99da40be959f42 (origin/master)
 > git config core.sparsecheckout # timeout=10
 > git checkout -f d49960b781dc341d2e7b380efb99da40be959f42
Commit message: "[BEAM-6711] Fix bq_to_table test for google (#7968)"
 > git rev-list --no-walk c783c45538c51146036139f11f7d2b9ebfa975b1 # timeout=10
Cleaning workspace
 > git rev-parse --verify HEAD # timeout=10
Resetting working tree
 > git reset --hard # timeout=10
 > git clean -fdx # timeout=10
No emails were triggered.
[EnvInject] - Executing scripts and injecting environment variables after the SCM step.
[EnvInject] - Injecting as environment variables the properties content 
SPARK_LOCAL_IP=127.0.0.1

[EnvInject] - Variables injected successfully.
[Gradle] - Launching build.
[src] $ <https://builds.apache.org/job/beam_PostCommit_Java/ws/src/gradlew> --continue
--max-workers=12 -Dorg.gradle.jvmargs=-Xms2g -Dorg.gradle.jvmargs=-Xmx4g -Pmaven_home=/home/jenkins/tools/maven/apache-maven-3.5.2
:javaPostCommit
To honour the JVM settings for this build a new JVM will be forked. Please consider using
the daemon: https://docs.gradle.org/5.2.1/userguide/gradle_daemon.html.
Daemon will be stopped at the end of the build stopping after processing
> Task :buildSrc:compileJava NO-SOURCE
> Task :buildSrc:compileGroovy FROM-CACHE
> Task :buildSrc:pluginDescriptors
> Task :buildSrc:processResources
> Task :buildSrc:classes
> Task :buildSrc:jar
> Task :buildSrc:assemble
> Task :buildSrc:spotlessGroovy
> Task :buildSrc:spotlessGroovyCheck
> Task :buildSrc:spotlessGroovyGradle
> Task :buildSrc:spotlessGroovyGradleCheck
> Task :buildSrc:spotlessCheck
> Task :buildSrc:pluginUnderTestMetadata
> Task :buildSrc:compileTestJava NO-SOURCE
> Task :buildSrc:compileTestGroovy NO-SOURCE
> Task :buildSrc:processTestResources NO-SOURCE
> Task :buildSrc:testClasses UP-TO-DATE
> Task :buildSrc:test NO-SOURCE
> Task :buildSrc:validateTaskProperties FROM-CACHE
> Task :buildSrc:check
> Task :buildSrc:build
Configuration on demand is an incubating feature.
> Task :beam-sdks-java-io-google-cloud-platform:processResources NO-SOURCE
> Task :beam-sdks-java-extensions-google-cloud-platform-core:processResources NO-SOURCE
> Task :beam-sdks-java-core:generateAvroProtocol NO-SOURCE
> Task :beam-runners-core-construction-java:processResources NO-SOURCE
> Task :beam-runners-core-java:processResources NO-SOURCE
> Task :beam-sdks-java-fn-execution:processResources NO-SOURCE
> Task :beam-sdks-java-harness:processResources NO-SOURCE
> Task :beam-sdks-java-core:generateAvroJava NO-SOURCE
> Task :beam-model-job-management:extractProto
> Task :beam-model-fn-execution:extractProto
> Task :beam-sdks-java-extensions-protobuf:extractProto
> Task :beam-vendor-sdks-java-extensions-protobuf:processResources NO-SOURCE
> Task :beam-sdks-java-extensions-protobuf:processResources NO-SOURCE
> Task :beam-runners-java-fn-execution:processResources NO-SOURCE
> Task :beam-examples-java:processResources NO-SOURCE
> Task :beam-runners-local-java-core:processResources NO-SOURCE
> Task :beam-runners-google-cloud-dataflow-java-legacy-worker:processResources NO-SOURCE
> Task :beam-sdks-java-io-google-cloud-platform:processTestResources NO-SOURCE
> Task :beam-sdks-java-extensions-google-cloud-platform-core:processTestResources NO-SOURCE
> Task :beam-runners-direct-java:processResources NO-SOURCE
> Task :beam-model-job-management:processResources
> Task :beam-runners-google-cloud-dataflow-java:processResources
> Task :beam-examples-java:processTestResources
> Task :beam-sdks-java-core:generateGrammarSource FROM-CACHE
> Task :beam-model-fn-execution:processResources
> Task :beam-sdks-java-core:processResources
> Task :beam-sdks-java-core:generateTestAvroProtocol NO-SOURCE
> Task :beam-sdks-java-core:generateTestAvroJava
> Task :beam-sdks-java-core:generateTestGrammarSource NO-SOURCE
> Task :beam-sdks-java-core:processTestResources NO-SOURCE
> Task :beam-runners-google-cloud-dataflow-java-windmill:extractIncludeProto
> Task :beam-model-pipeline:extractIncludeProto
> Task :beam-runners-google-cloud-dataflow-java-windmill:extractProto
> Task :beam-model-pipeline:extractProto
> Task :beam-model-pipeline:generateProto FAILED
> Task :beam-runners-google-cloud-dataflow-java-windmill:generateProto FAILED
> Task :beam-model-pipeline:processResources
> Task :beam-runners-google-cloud-dataflow-java-windmill:processResources

FAILURE: Build completed with 2 failures.

1: Task failed with an exception.
-----------
* What went wrong:
Execution failed for task ':beam-model-pipeline:generateProto'.
> unable to create new native thread

* Try:
Run with --stacktrace option to get the stack trace. Run with --info or --debug option to
get more log output. Run with --scan to get full insights.
==============================================================================

2: Task failed with an exception.
-----------
* What went wrong:
Execution failed for task ':beam-runners-google-cloud-dataflow-java-windmill:generateProto'.
> unable to create new native thread

* Try:
Run with --stacktrace option to get the stack trace. Run with --info or --debug option to
get more log output. Run with --scan to get full insights.
==============================================================================

* Get more help at https://help.gradle.org

Deprecated Gradle features were used in this build, making it incompatible with Gradle 6.0.
Use '--warning-mode all' to show the individual deprecation warnings.
See https://docs.gradle.org/5.2.1/userguide/command_line_interface.html#sec:command_line_warnings

BUILD FAILED in 23s
18 actionable tasks: 17 executed, 1 from cache

Publishing build scan...
https://gradle.com/s/c3zgyvlvrgefc

Build step 'Invoke Gradle script' changed build result to FAILURE
Build step 'Invoke Gradle script' marked build as failure

---------------------------------------------------------------------
To unsubscribe, e-mail: builds-unsubscribe@beam.apache.org
For additional commands, e-mail: builds-help@beam.apache.org


Mime
View raw message