beam-builds mailing list archives

Site index · List index
Message view « Date » · « Thread »
Top « Date » · « Thread »
From Apache Jenkins Server <jenk...@builds.apache.org>
Subject Build failed in Jenkins: beam_PostCommit_Py_ValCont #3735
Date Mon, 08 Jul 2019 18:17:23 GMT
See <https://builds.apache.org/job/beam_PostCommit_Py_ValCont/3735/display/redirect>

------------------------------------------
[...truncated 193.28 KB...]
copying apache_beam/runners/portability/artifact_service_test.py -> apache-beam-2.15.0.dev0/apache_beam/runners/portability
copying apache_beam/runners/portability/expansion_service.py -> apache-beam-2.15.0.dev0/apache_beam/runners/portability
copying apache_beam/runners/portability/expansion_service_test.py -> apache-beam-2.15.0.dev0/apache_beam/runners/portability
copying apache_beam/runners/portability/flink_runner_test.py -> apache-beam-2.15.0.dev0/apache_beam/runners/portability
copying apache_beam/runners/portability/fn_api_runner.py -> apache-beam-2.15.0.dev0/apache_beam/runners/portability
copying apache_beam/runners/portability/fn_api_runner_test.py -> apache-beam-2.15.0.dev0/apache_beam/runners/portability
copying apache_beam/runners/portability/fn_api_runner_transforms.py -> apache-beam-2.15.0.dev0/apache_beam/runners/portability
copying apache_beam/runners/portability/job_server.py -> apache-beam-2.15.0.dev0/apache_beam/runners/portability
copying apache_beam/runners/portability/local_job_service.py -> apache-beam-2.15.0.dev0/apache_beam/runners/portability
copying apache_beam/runners/portability/local_job_service_main.py -> apache-beam-2.15.0.dev0/apache_beam/runners/portability
copying apache_beam/runners/portability/portable_runner.py -> apache-beam-2.15.0.dev0/apache_beam/runners/portability
copying apache_beam/runners/portability/portable_runner_test.py -> apache-beam-2.15.0.dev0/apache_beam/runners/portability
copying apache_beam/runners/portability/portable_stager.py -> apache-beam-2.15.0.dev0/apache_beam/runners/portability
copying apache_beam/runners/portability/portable_stager_test.py -> apache-beam-2.15.0.dev0/apache_beam/runners/portability
copying apache_beam/runners/portability/spark_runner_test.py -> apache-beam-2.15.0.dev0/apache_beam/runners/portability
copying apache_beam/runners/portability/stager.py -> apache-beam-2.15.0.dev0/apache_beam/runners/portability
copying apache_beam/runners/portability/stager_test.py -> apache-beam-2.15.0.dev0/apache_beam/runners/portability
copying apache_beam/runners/test/__init__.py -> apache-beam-2.15.0.dev0/apache_beam/runners/test
copying apache_beam/runners/worker/__init__.py -> apache-beam-2.15.0.dev0/apache_beam/runners/worker
copying apache_beam/runners/worker/bundle_processor.py -> apache-beam-2.15.0.dev0/apache_beam/runners/worker
copying apache_beam/runners/worker/channel_factory.py -> apache-beam-2.15.0.dev0/apache_beam/runners/worker
copying apache_beam/runners/worker/data_plane.py -> apache-beam-2.15.0.dev0/apache_beam/runners/worker
copying apache_beam/runners/worker/data_plane_test.py -> apache-beam-2.15.0.dev0/apache_beam/runners/worker
copying apache_beam/runners/worker/log_handler.py -> apache-beam-2.15.0.dev0/apache_beam/runners/worker
copying apache_beam/runners/worker/log_handler_test.py -> apache-beam-2.15.0.dev0/apache_beam/runners/worker
copying apache_beam/runners/worker/logger.py -> apache-beam-2.15.0.dev0/apache_beam/runners/worker
copying apache_beam/runners/worker/logger_test.py -> apache-beam-2.15.0.dev0/apache_beam/runners/worker
copying apache_beam/runners/worker/opcounters.pxd -> apache-beam-2.15.0.dev0/apache_beam/runners/worker
copying apache_beam/runners/worker/opcounters.py -> apache-beam-2.15.0.dev0/apache_beam/runners/worker
copying apache_beam/runners/worker/opcounters_test.py -> apache-beam-2.15.0.dev0/apache_beam/runners/worker
copying apache_beam/runners/worker/operation_specs.py -> apache-beam-2.15.0.dev0/apache_beam/runners/worker
copying apache_beam/runners/worker/operations.pxd -> apache-beam-2.15.0.dev0/apache_beam/runners/worker
copying apache_beam/runners/worker/operations.py -> apache-beam-2.15.0.dev0/apache_beam/runners/worker
copying apache_beam/runners/worker/sdk_worker.py -> apache-beam-2.15.0.dev0/apache_beam/runners/worker
copying apache_beam/runners/worker/sdk_worker_main.py -> apache-beam-2.15.0.dev0/apache_beam/runners/worker
copying apache_beam/runners/worker/sdk_worker_main_test.py -> apache-beam-2.15.0.dev0/apache_beam/runners/worker
copying apache_beam/runners/worker/sdk_worker_test.py -> apache-beam-2.15.0.dev0/apache_beam/runners/worker
copying apache_beam/runners/worker/sideinputs.py -> apache-beam-2.15.0.dev0/apache_beam/runners/worker
copying apache_beam/runners/worker/sideinputs_test.py -> apache-beam-2.15.0.dev0/apache_beam/runners/worker
copying apache_beam/runners/worker/statesampler.py -> apache-beam-2.15.0.dev0/apache_beam/runners/worker
copying apache_beam/runners/worker/statesampler_fast.pxd -> apache-beam-2.15.0.dev0/apache_beam/runners/worker
copying apache_beam/runners/worker/statesampler_fast.pyx -> apache-beam-2.15.0.dev0/apache_beam/runners/worker
copying apache_beam/runners/worker/statesampler_slow.py -> apache-beam-2.15.0.dev0/apache_beam/runners/worker
copying apache_beam/runners/worker/statesampler_test.py -> apache-beam-2.15.0.dev0/apache_beam/runners/worker
copying apache_beam/runners/worker/worker_id_interceptor.py -> apache-beam-2.15.0.dev0/apache_beam/runners/worker
copying apache_beam/runners/worker/worker_id_interceptor_test.py -> apache-beam-2.15.0.dev0/apache_beam/runners/worker
copying apache_beam/testing/__init__.py -> apache-beam-2.15.0.dev0/apache_beam/testing
copying apache_beam/testing/metric_result_matchers.py -> apache-beam-2.15.0.dev0/apache_beam/testing
copying apache_beam/testing/metric_result_matchers_test.py -> apache-beam-2.15.0.dev0/apache_beam/testing
copying apache_beam/testing/pipeline_verifiers.py -> apache-beam-2.15.0.dev0/apache_beam/testing
copying apache_beam/testing/pipeline_verifiers_test.py -> apache-beam-2.15.0.dev0/apache_beam/testing
copying apache_beam/testing/synthetic_pipeline.py -> apache-beam-2.15.0.dev0/apache_beam/testing
copying apache_beam/testing/synthetic_pipeline_test.py -> apache-beam-2.15.0.dev0/apache_beam/testing
copying apache_beam/testing/test_pipeline.py -> apache-beam-2.15.0.dev0/apache_beam/testing
copying apache_beam/testing/test_pipeline_test.py -> apache-beam-2.15.0.dev0/apache_beam/testing
copying apache_beam/testing/test_stream.py -> apache-beam-2.15.0.dev0/apache_beam/testing
copying apache_beam/testing/test_stream_test.py -> apache-beam-2.15.0.dev0/apache_beam/testing
copying apache_beam/testing/test_utils.py -> apache-beam-2.15.0.dev0/apache_beam/testing
copying apache_beam/testing/test_utils_test.py -> apache-beam-2.15.0.dev0/apache_beam/testing
copying apache_beam/testing/util.py -> apache-beam-2.15.0.dev0/apache_beam/testing
copying apache_beam/testing/util_test.py -> apache-beam-2.15.0.dev0/apache_beam/testing
copying apache_beam/testing/benchmarks/__init__.py -> apache-beam-2.15.0.dev0/apache_beam/testing/benchmarks
copying apache_beam/testing/benchmarks/nexmark/__init__.py -> apache-beam-2.15.0.dev0/apache_beam/testing/benchmarks/nexmark
copying apache_beam/testing/benchmarks/nexmark/nexmark_launcher.py -> apache-beam-2.15.0.dev0/apache_beam/testing/benchmarks/nexmark
copying apache_beam/testing/benchmarks/nexmark/nexmark_util.py -> apache-beam-2.15.0.dev0/apache_beam/testing/benchmarks/nexmark
copying apache_beam/testing/benchmarks/nexmark/models/__init__.py -> apache-beam-2.15.0.dev0/apache_beam/testing/benchmarks/nexmark/models
copying apache_beam/testing/benchmarks/nexmark/models/nexmark_model.py -> apache-beam-2.15.0.dev0/apache_beam/testing/benchmarks/nexmark/models
copying apache_beam/testing/benchmarks/nexmark/queries/__init__.py -> apache-beam-2.15.0.dev0/apache_beam/testing/benchmarks/nexmark/queries
copying apache_beam/testing/benchmarks/nexmark/queries/query0.py -> apache-beam-2.15.0.dev0/apache_beam/testing/benchmarks/nexmark/queries
copying apache_beam/testing/benchmarks/nexmark/queries/query1.py -> apache-beam-2.15.0.dev0/apache_beam/testing/benchmarks/nexmark/queries
copying apache_beam/testing/benchmarks/nexmark/queries/query2.py -> apache-beam-2.15.0.dev0/apache_beam/testing/benchmarks/nexmark/queries
copying apache_beam/testing/data/trigger_transcripts.yaml -> apache-beam-2.15.0.dev0/apache_beam/testing/data
copying apache_beam/testing/load_tests/__init__.py -> apache-beam-2.15.0.dev0/apache_beam/testing/load_tests
copying apache_beam/testing/load_tests/co_group_by_key_test.py -> apache-beam-2.15.0.dev0/apache_beam/testing/load_tests
copying apache_beam/testing/load_tests/combine_test.py -> apache-beam-2.15.0.dev0/apache_beam/testing/load_tests
copying apache_beam/testing/load_tests/group_by_key_test.py -> apache-beam-2.15.0.dev0/apache_beam/testing/load_tests
copying apache_beam/testing/load_tests/load_test.py -> apache-beam-2.15.0.dev0/apache_beam/testing/load_tests
copying apache_beam/testing/load_tests/load_test_metrics_utils.py -> apache-beam-2.15.0.dev0/apache_beam/testing/load_tests
copying apache_beam/testing/load_tests/pardo_test.py -> apache-beam-2.15.0.dev0/apache_beam/testing/load_tests
copying apache_beam/testing/load_tests/sideinput_test.py -> apache-beam-2.15.0.dev0/apache_beam/testing/load_tests
copying apache_beam/tools/__init__.py -> apache-beam-2.15.0.dev0/apache_beam/tools
copying apache_beam/tools/coders_microbenchmark.py -> apache-beam-2.15.0.dev0/apache_beam/tools
copying apache_beam/tools/distribution_counter_microbenchmark.py -> apache-beam-2.15.0.dev0/apache_beam/tools
copying apache_beam/tools/map_fn_microbenchmark.py -> apache-beam-2.15.0.dev0/apache_beam/tools
copying apache_beam/tools/microbenchmarks_test.py -> apache-beam-2.15.0.dev0/apache_beam/tools
copying apache_beam/tools/sideinput_microbenchmark.py -> apache-beam-2.15.0.dev0/apache_beam/tools
copying apache_beam/tools/utils.py -> apache-beam-2.15.0.dev0/apache_beam/tools
copying apache_beam/transforms/__init__.py -> apache-beam-2.15.0.dev0/apache_beam/transforms
copying apache_beam/transforms/combiners.py -> apache-beam-2.15.0.dev0/apache_beam/transforms
copying apache_beam/transforms/combiners_test.py -> apache-beam-2.15.0.dev0/apache_beam/transforms
copying apache_beam/transforms/core.py -> apache-beam-2.15.0.dev0/apache_beam/transforms
copying apache_beam/transforms/create_source.py -> apache-beam-2.15.0.dev0/apache_beam/transforms
copying apache_beam/transforms/create_test.py -> apache-beam-2.15.0.dev0/apache_beam/transforms
copying apache_beam/transforms/cy_combiners.pxd -> apache-beam-2.15.0.dev0/apache_beam/transforms
copying apache_beam/transforms/cy_combiners.py -> apache-beam-2.15.0.dev0/apache_beam/transforms
copying apache_beam/transforms/cy_dataflow_distribution_counter.pxd -> apache-beam-2.15.0.dev0/apache_beam/transforms
copying apache_beam/transforms/cy_dataflow_distribution_counter.pyx -> apache-beam-2.15.0.dev0/apache_beam/transforms
copying apache_beam/transforms/dataflow_distribution_counter_test.py -> apache-beam-2.15.0.dev0/apache_beam/transforms
copying apache_beam/transforms/display.py -> apache-beam-2.15.0.dev0/apache_beam/transforms
copying apache_beam/transforms/display_test.py -> apache-beam-2.15.0.dev0/apache_beam/transforms
copying apache_beam/transforms/dofn_lifecycle_test.py -> apache-beam-2.15.0.dev0/apache_beam/transforms
copying apache_beam/transforms/external.py -> apache-beam-2.15.0.dev0/apache_beam/transforms
copying apache_beam/transforms/external_test.py -> apache-beam-2.15.0.dev0/apache_beam/transforms
copying apache_beam/transforms/external_test_it.py -> apache-beam-2.15.0.dev0/apache_beam/transforms
copying apache_beam/transforms/ptransform.py -> apache-beam-2.15.0.dev0/apache_beam/transforms
copying apache_beam/transforms/ptransform_test.py -> apache-beam-2.15.0.dev0/apache_beam/transforms
copying apache_beam/transforms/py_dataflow_distribution_counter.py -> apache-beam-2.15.0.dev0/apache_beam/transforms
copying apache_beam/transforms/sideinputs.py -> apache-beam-2.15.0.dev0/apache_beam/transforms
copying apache_beam/transforms/sideinputs_test.py -> apache-beam-2.15.0.dev0/apache_beam/transforms
copying apache_beam/transforms/stats.py -> apache-beam-2.15.0.dev0/apache_beam/transforms
copying apache_beam/transforms/stats_test.py -> apache-beam-2.15.0.dev0/apache_beam/transforms
copying apache_beam/transforms/timeutil.py -> apache-beam-2.15.0.dev0/apache_beam/transforms
copying apache_beam/transforms/trigger.py -> apache-beam-2.15.0.dev0/apache_beam/transforms
copying apache_beam/transforms/trigger_test.py -> apache-beam-2.15.0.dev0/apache_beam/transforms
copying apache_beam/transforms/userstate.py -> apache-beam-2.15.0.dev0/apache_beam/transforms
copying apache_beam/transforms/userstate_test.py -> apache-beam-2.15.0.dev0/apache_beam/transforms
copying apache_beam/transforms/util.py -> apache-beam-2.15.0.dev0/apache_beam/transforms
copying apache_beam/transforms/util_test.py -> apache-beam-2.15.0.dev0/apache_beam/transforms
copying apache_beam/transforms/window.py -> apache-beam-2.15.0.dev0/apache_beam/transforms
copying apache_beam/transforms/window_test.py -> apache-beam-2.15.0.dev0/apache_beam/transforms
copying apache_beam/transforms/write_ptransform_test.py -> apache-beam-2.15.0.dev0/apache_beam/transforms
copying apache_beam/typehints/__init__.py -> apache-beam-2.15.0.dev0/apache_beam/typehints
copying apache_beam/typehints/decorators.py -> apache-beam-2.15.0.dev0/apache_beam/typehints
copying apache_beam/typehints/native_type_compatibility.py -> apache-beam-2.15.0.dev0/apache_beam/typehints
copying apache_beam/typehints/native_type_compatibility_test.py -> apache-beam-2.15.0.dev0/apache_beam/typehints
copying apache_beam/typehints/opcodes.py -> apache-beam-2.15.0.dev0/apache_beam/typehints
copying apache_beam/typehints/trivial_inference.py -> apache-beam-2.15.0.dev0/apache_beam/typehints
copying apache_beam/typehints/trivial_inference_test.py -> apache-beam-2.15.0.dev0/apache_beam/typehints
copying apache_beam/typehints/typecheck.py -> apache-beam-2.15.0.dev0/apache_beam/typehints
copying apache_beam/typehints/typed_pipeline_test.py -> apache-beam-2.15.0.dev0/apache_beam/typehints
copying apache_beam/typehints/typehints.py -> apache-beam-2.15.0.dev0/apache_beam/typehints
copying apache_beam/typehints/typehints_test.py -> apache-beam-2.15.0.dev0/apache_beam/typehints
copying apache_beam/utils/__init__.py -> apache-beam-2.15.0.dev0/apache_beam/utils
copying apache_beam/utils/annotations.py -> apache-beam-2.15.0.dev0/apache_beam/utils
copying apache_beam/utils/annotations_test.py -> apache-beam-2.15.0.dev0/apache_beam/utils
copying apache_beam/utils/counters.pxd -> apache-beam-2.15.0.dev0/apache_beam/utils
copying apache_beam/utils/counters.py -> apache-beam-2.15.0.dev0/apache_beam/utils
copying apache_beam/utils/counters_test.py -> apache-beam-2.15.0.dev0/apache_beam/utils
copying apache_beam/utils/plugin.py -> apache-beam-2.15.0.dev0/apache_beam/utils
copying apache_beam/utils/processes.py -> apache-beam-2.15.0.dev0/apache_beam/utils
copying apache_beam/utils/processes_test.py -> apache-beam-2.15.0.dev0/apache_beam/utils
copying apache_beam/utils/profiler.py -> apache-beam-2.15.0.dev0/apache_beam/utils
copying apache_beam/utils/proto_utils.py -> apache-beam-2.15.0.dev0/apache_beam/utils
copying apache_beam/utils/retry.py -> apache-beam-2.15.0.dev0/apache_beam/utils
copying apache_beam/utils/retry_test.py -> apache-beam-2.15.0.dev0/apache_beam/utils
copying apache_beam/utils/timestamp.py -> apache-beam-2.15.0.dev0/apache_beam/utils
copying apache_beam/utils/timestamp_test.py -> apache-beam-2.15.0.dev0/apache_beam/utils
copying apache_beam/utils/urns.py -> apache-beam-2.15.0.dev0/apache_beam/utils
copying apache_beam/utils/windowed_value.pxd -> apache-beam-2.15.0.dev0/apache_beam/utils
copying apache_beam/utils/windowed_value.py -> apache-beam-2.15.0.dev0/apache_beam/utils
copying apache_beam/utils/windowed_value_test.py -> apache-beam-2.15.0.dev0/apache_beam/utils
Writing apache-beam-2.15.0.dev0/setup.cfg
creating dist
Creating tar archive
removing 'apache-beam-2.15.0.dev0' (and everything under it)
SDK_LOCATION=$(find dist/apache-beam-*.tar.gz)
find dist/apache-beam-*.tar.gz

# Run ValidatesRunner tests on Google Cloud Dataflow service
echo ">>> RUNNING DATAFLOW RUNNER VALIDATESCONTAINER TEST"
>>> RUNNING DATAFLOW RUNNER VALIDATESCONTAINER TEST
python setup.py nosetests \
  --attr ValidatesContainer \
  --nologcapture \
  --processes=1 \
  --process-timeout=900 \
  --test-pipeline-options=" \
    --runner=TestDataflowRunner \
    --project=$PROJECT \
    --worker_harness_container_image=$CONTAINER:$TAG \
    --staging_location=$GCS_LOCATION/staging-validatesrunner-test \
    --temp_location=$GCS_LOCATION/temp-validatesrunner-test \
    --output=$GCS_LOCATION/output \
    --sdk_location=$SDK_LOCATION \
    --num_workers=1"
<https://builds.apache.org/job/beam_PostCommit_Py_ValCont/ws/src/sdks/python/container/venv/python/local/lib/python2.7/site-packages/setuptools/dist.py>:472:
UserWarning: Normalizing '2.15.0.dev' to '2.15.0.dev0'
  normalized_version,
running nosetests
running egg_info
<https://builds.apache.org/job/beam_PostCommit_Py_ValCont/ws/src/sdks/python/gen_protos.py>:57:
UserWarning: Installing grpcio-tools is recommended for development.
  warnings.warn('Installing grpcio-tools is recommended for development.')
writing requirements to apache_beam.egg-info/requires.txt
writing apache_beam.egg-info/PKG-INFO
writing top-level names to apache_beam.egg-info/top_level.txt
writing dependency_links to apache_beam.egg-info/dependency_links.txt
writing entry points to apache_beam.egg-info/entry_points.txt
reading manifest file 'apache_beam.egg-info/SOURCES.txt'
reading manifest template 'MANIFEST.in'
warning: no files found matching 'README.md'
warning: no files found matching 'NOTICE'
warning: no files found matching 'LICENSE'
writing manifest file 'apache_beam.egg-info/SOURCES.txt'
WARNING:root:Using deprecated Datastore client.
This client will be removed in Beam 3.0 (next Beam major release).
Please migrate to apache_beam.io.gcp.datastore.v1new.datastoreio.
WARNING:root:python-snappy is not installed; some tests will be skipped.
WARNING:root:Tensorflow is not installed, so skipping some tests.
test_wordcount_fnapi_it (apache_beam.examples.wordcount_it_test.WordCountIT) ... ok
WARNING:root:Discarding unparseable args: ['--output=gs://temp-storage-for-end-to-end-tests/output']
WARNING:root:Discarding unparseable args: ['--output=gs://temp-storage-for-end-to-end-tests/output']
test_metrics_fnapi_it (apache_beam.runners.dataflow.dataflow_exercise_metrics_pipeline_test.ExerciseMetricsPipelineTest)
... FAIL

======================================================================
FAIL: test_metrics_fnapi_it (apache_beam.runners.dataflow.dataflow_exercise_metrics_pipeline_test.ExerciseMetricsPipelineTest)
----------------------------------------------------------------------
Traceback (most recent call last):
  File "<https://builds.apache.org/job/beam_PostCommit_Py_ValCont/ws/src/sdks/python/apache_beam/runners/dataflow/dataflow_exercise_metrics_pipeline_test.py",>
line 64, in test_metrics_fnapi_it
    self.assertFalse(errors, str(errors))
AssertionError: Unable to match metrics for matcher  namespace: 'apache_beam.runners.dataflow.dataflow_exercise_metrics_pipeline.UserMetricsDoFn'
name: 'total_values' step: 'metrics' attempted: <100> committed: <100>Unable to
match metrics for matcher  name: 'ExecutionTime_StartBundle' step: 'metrics' attempted: a
value greater than <0> committed: a value greater than <0>Unable to match metrics
for matcher  name: 'ExecutionTime_ProcessElement' step: 'metrics' attempted: a value greater
than <0> committed: a value greater than <0>Unable to match metrics for matcher
 name: 'ExecutionTime_FinishBundle' step: 'metrics' attempted: a value greater than <0>
committed: a value greater than <0>Unable to match metrics for matcher  name: 'ElementCount'
(label_key: 'original_name' label_value: 'GroupByKey/Reify-out0-ElementCount').  (label_key:
'output_user_name' label_value: 'GroupByKey/Reify-out0').  attempted: a value greater than
<0> committed: a value greater than <0>Unable to match metrics for matcher  name:
'MeanByteCount' (label_key: 'output_user_name' label_value: 'GroupByKey/Reify-out0').  (label_key:
'original_name' label_value: 'GroupByKey/Reify-out0-MeanByteCount').  attempted: a value greater
than <0> committed: a value greater than <0>Unable to match metrics for matcher
 name: 'ElementCount' (label_key: 'output_user_name' label_value: 'GroupByKey/Read-out0').
 (label_key: 'original_name' label_value: 'GroupByKey/Read-out0-ElementCount').  attempted:
a value greater than <0> committed: a value greater than <0>Unable to match metrics
for matcher  name: 'MeanByteCount' (label_key: 'output_user_name' label_value: 'GroupByKey/Read-out0').
 (label_key: 'original_name' label_value: 'GroupByKey/Read-out0-MeanByteCount').  attempted:
a value greater than <0> committed: a value greater than <0>Unable to match metrics
for matcher  name: 'ElementCount' (label_key: 'original_name' label_value: 'map_to_common_key-out0-ElementCount').
 (label_key: 'output_user_name' label_value: 'map_to_common_key-out0').  attempted: a value
greater than <0> committed: a value greater than <0>Unable to match metrics for
matcher  name: 'MeanByteCount' (label_key: 'output_user_name' label_value: 'map_to_common_key-out0').
 (label_key: 'original_name' label_value: 'map_to_common_key-out0-MeanByteCount').  attempted:
a value greater than <0> committed: a value greater than <0>Unable to match metrics
for matcher  name: 'ElementCount' (label_key: 'output_user_name' label_value: 'GroupByKey/GroupByWindow-out0').
 (label_key: 'original_name' label_value: 'GroupByKey/GroupByWindow-out0-ElementCount'). 
attempted: a value greater than <0> committed: a value greater than <0>Unable
to match metrics for matcher  name: 'MeanByteCount' (label_key: 'output_user_name' label_value:
'GroupByKey/GroupByWindow-out0').  (label_key: 'original_name' label_value: 'GroupByKey/GroupByWindow-out0-MeanByteCount').
 attempted: a value greater than <0> committed: a value greater than <0>Unable
to match metrics for matcher  name: 'ElementCount' (label_key: 'output_user_name' label_value:
'GroupByKey/Read-out0').  (label_key: 'original_name' label_value: 'GroupByKey/Read-out0-ElementCount').
 attempted: a value greater than <0> committed: a value greater than <0>Unable
to match metrics for matcher  name: 'MeanByteCount' (label_key: 'output_user_name' label_value:
'GroupByKey/Read-out0').  (label_key: 'original_name' label_value: 'GroupByKey/Read-out0-MeanByteCount').
 attempted: a value greater than <0> committed: a value greater than <0>Unable
to match metrics for matcher  name: 'ElementCount' (label_key: 'original_name' label_value:
'GroupByKey/Reify-out0-ElementCount').  (label_key: 'output_user_name' label_value: 'GroupByKey/Reify-out0').
 attempted: a value greater than <0> committed: a value greater than <0>Unable
to match metrics for matcher  name: 'MeanByteCount' (label_key: 'output_user_name' label_value:
'GroupByKey/Reify-out0').  (label_key: 'original_name' label_value: 'GroupByKey/Reify-out0-MeanByteCount').
 attempted: a value greater than <0> committed: a value greater than <0>
Actual MetricResults:

-------------------- >> begin captured stdout << ---------------------
Found: https://console.cloud.google.com/dataflow/jobsDetail/locations/us-central1/jobs/2019-07-08_11_17_06-9635917281144634609?project=apache-beam-testing.

--------------------- >> end captured stdout << ----------------------

----------------------------------------------------------------------
XML: <https://builds.apache.org/job/beam_PostCommit_Py_ValCont/ws/src/sdks/python/nosetests.xml>
----------------------------------------------------------------------
Ran 2 tests in 509.466s

FAILED (failures=1)
cleanup_container
Untagged: us.gcr.io/apache-beam-testing/jenkins/python:20190708-180016
Untagged: us.gcr.io/apache-beam-testing/jenkins/python@sha256:ef51837727ad72c49c99c191e7d1c5d093f84b52ddbfcae0ea8430a91299cc5a
Deleted: sha256:9fff83d91ff342d0acdc4200751332e1cdd31cbeed0fb20e6639ade2e9e0962e
Deleted: sha256:b998f6b735700ee173cd3902341957767567e2e2086c614a9dc14d516936dd53
Deleted: sha256:e17c18cff096f9902fe6680808cff937760cd210bde46d284bbee3204e3c7704
Deleted: sha256:7a4c3d641fa2f5927e1e0c044e4ff297df89ba5c84a918c8cb6ed57ebefb93ad
Deleted: sha256:2a888a6c53bce4bf01eb888c9ea699986d9f2446c16269a2098d5fd939c708b0
Deleted: sha256:e01199e7f35c0c9cc1f3e5c2ffd7e8b89ae982f0b2ab8f157d31d90a1ec1ba5a
Deleted: sha256:04b2b0bcb753301e460fa6e00c908ee80fd6ba3cee5d297df5bd2d1ae192066d
Deleted: sha256:9c4eea4bec3eeaef6a6b1af1ed6dc93b3df81bfda296d9aea83ca22e3bfc7d37
Deleted: sha256:571946ff112b03cbe8489ce41dc6edadde00ba2943872a5983a12b9b0bbb7b7d
Deleted: sha256:4992f64057163aeb7132190c2272208ec5f1b3488e67f0b2dc817a0575bb0658
Deleted: sha256:682a905fe8494b5e17008bf3a7f636a061c13aec2840fb9c09cf337debd49ce6
Deleted: sha256:308a1e70ecd571de24084bdff5bc552892a44776a7691b12d307ef43b4c350d1
Deleted: sha256:20d99c5298ee93e7903306911da0d5f1ba268dc3c0593dca003045ae7f96056b
Deleted: sha256:66a92ada9cb8d3167bd4edb4ac72897611c6ff12d965db2607309cff1b215bce
Digests:
- us.gcr.io/apache-beam-testing/jenkins/python@sha256:ef51837727ad72c49c99c191e7d1c5d093f84b52ddbfcae0ea8430a91299cc5a
  Associated tags:
 - 20190708-180016
Tags:
- us.gcr.io/apache-beam-testing/jenkins/python:20190708-180016
Deleted [us.gcr.io/apache-beam-testing/jenkins/python:20190708-180016].
Deleted [us.gcr.io/apache-beam-testing/jenkins/python@sha256:ef51837727ad72c49c99c191e7d1c5d093f84b52ddbfcae0ea8430a91299cc5a].
Removed the container
Build step 'Execute shell' marked build as failure

---------------------------------------------------------------------
To unsubscribe, e-mail: builds-unsubscribe@beam.apache.org
For additional commands, e-mail: builds-help@beam.apache.org


Mime
View raw message