beam-builds mailing list archives

Site index · List index
Message view « Date » · « Thread »
Top « Date » · « Thread »
From Apache Jenkins Server <jenk...@builds.apache.org>
Subject Build failed in Jenkins: beam_PostCommit_Python37 #20
Date Mon, 22 Jul 2019 16:35:08 GMT
See <https://builds.apache.org/job/beam_PostCommit_Python37/20/display/redirect?page=changes>

Changes:

[ehudm] [BEAM-7679] Add randomness to ITs' BQ dataset name

------------------------------------------
[...truncated 243.59 KB...]
warning: no files found matching 'NOTICE'
warning: no files found matching 'LICENSE'
writing manifest file 'apache_beam.egg-info/SOURCES.txt'
<https://builds.apache.org/job/beam_PostCommit_Python37/ws/src/sdks/python/apache_beam/__init__.py>:84:
UserWarning: Some syntactic constructs of Python 3 are not yet fully supported by Apache Beam.
  'Some syntactic constructs of Python 3 are not yet fully supported by '
<https://builds.apache.org/job/beam_PostCommit_Python37/ws/src/sdks/python/apache_beam/io/gcp/bigquery.py>:1137:
BeamDeprecationWarning: options is deprecated since First stable release. References to <pipeline>.options
will not be supported
  self.table_reference.projectId = pcoll.pipeline.options.view_as(
<https://builds.apache.org/job/beam_PostCommit_Python37/ws/src/sdks/python/apache_beam/io/gcp/bigquery.py>:1137:
BeamDeprecationWarning: options is deprecated since First stable release. References to <pipeline>.options
will not be supported
  self.table_reference.projectId = pcoll.pipeline.options.view_as(
<https://builds.apache.org/job/beam_PostCommit_Python37/ws/src/sdks/python/apache_beam/io/gcp/bigquery_file_loads.py>:557:
BeamDeprecationWarning: options is deprecated since First stable release. References to <pipeline>.options
will not be supported
  temp_location = p.options.view_as(GoogleCloudOptions).temp_location
test_bigquery_read_1M_python (apache_beam.io.gcp.bigquery_io_read_it_test.BigqueryIOReadIT)
... ERROR
test_datastore_write_limit (apache_beam.io.gcp.datastore.v1new.datastore_write_it_test.DatastoreWriteIT)
... ok
test_big_query_read (apache_beam.io.gcp.bigquery_read_it_test.BigQueryReadIntegrationTests)
... ok
test_big_query_read_new_types (apache_beam.io.gcp.bigquery_read_it_test.BigQueryReadIntegrationTests)
... ok
test_big_query_write (apache_beam.io.gcp.bigquery_write_it_test.BigQueryWriteIntegrationTests)
... ok
test_big_query_write_new_types (apache_beam.io.gcp.bigquery_write_it_test.BigQueryWriteIntegrationTests)
... ok
test_big_query_write_schema_autodetect (apache_beam.io.gcp.bigquery_write_it_test.BigQueryWriteIntegrationTests)
... ok
test_big_query_write_without_schema (apache_beam.io.gcp.bigquery_write_it_test.BigQueryWriteIntegrationTests)
... ok
test_streaming_data_only (apache_beam.io.gcp.pubsub_integration_test.PubSubIntegrationTest)
... ok
test_streaming_with_attributes (apache_beam.io.gcp.pubsub_integration_test.PubSubIntegrationTest)
... ok
test_big_query_legacy_sql (apache_beam.io.gcp.big_query_query_to_table_it_test.BigQueryQueryToTableIT)
... ok
test_big_query_new_types (apache_beam.io.gcp.big_query_query_to_table_it_test.BigQueryQueryToTableIT)
... ok
test_big_query_standard_sql (apache_beam.io.gcp.big_query_query_to_table_it_test.BigQueryQueryToTableIT)
... ok
test_big_query_standard_sql_kms_key_native (apache_beam.io.gcp.big_query_query_to_table_it_test.BigQueryQueryToTableIT)
... SKIP: This test doesn't work on DirectRunner.
test_wordcount_it (apache_beam.examples.wordcount_it_test.WordCountIT) ... ok

======================================================================
ERROR: test_bigquery_read_1M_python (apache_beam.io.gcp.bigquery_io_read_it_test.BigqueryIOReadIT)
----------------------------------------------------------------------
Traceback (most recent call last):
  File "<https://builds.apache.org/job/beam_PostCommit_Python37/ws/src/sdks/python/apache_beam/io/gcp/bigquery_io_read_it_test.py",>
line 58, in test_bigquery_read_1M_python
    self.run_bigquery_io_read_pipeline('1M')
  File "<https://builds.apache.org/job/beam_PostCommit_Python37/ws/src/sdks/python/apache_beam/io/gcp/bigquery_io_read_it_test.py",>
line 54, in run_bigquery_io_read_pipeline
    **extra_opts))
  File "<https://builds.apache.org/job/beam_PostCommit_Python37/ws/src/sdks/python/apache_beam/io/gcp/bigquery_io_read_pipeline.py",>
line 74, in run
    p.run()
  File "<https://builds.apache.org/job/beam_PostCommit_Python37/ws/src/sdks/python/apache_beam/testing/test_pipeline.py",>
line 107, in run
    else test_runner_api))
  File "<https://builds.apache.org/job/beam_PostCommit_Python37/ws/src/sdks/python/apache_beam/pipeline.py",>
line 406, in run
    self._options).run(False)
  File "<https://builds.apache.org/job/beam_PostCommit_Python37/ws/src/sdks/python/apache_beam/pipeline.py",>
line 419, in run
    return self.runner.run_pipeline(self, self._options)
  File "<https://builds.apache.org/job/beam_PostCommit_Python37/ws/src/sdks/python/apache_beam/runners/direct/test_direct_runner.py",>
line 43, in run_pipeline
    self.result = super(TestDirectRunner, self).run_pipeline(pipeline, options)
  File "<https://builds.apache.org/job/beam_PostCommit_Python37/ws/src/sdks/python/apache_beam/runners/direct/direct_runner.py",>
line 129, in run_pipeline
    return runner.run_pipeline(pipeline, options)
  File "<https://builds.apache.org/job/beam_PostCommit_Python37/ws/src/sdks/python/apache_beam/runners/direct/direct_runner.py",>
line 355, in run_pipeline
    pipeline.replace_all(_get_transform_overrides(options))
  File "<https://builds.apache.org/job/beam_PostCommit_Python37/ws/src/sdks/python/apache_beam/pipeline.py",>
line 389, in replace_all
    self._replace(override)
  File "<https://builds.apache.org/job/beam_PostCommit_Python37/ws/src/sdks/python/apache_beam/pipeline.py",>
line 300, in _replace
    self.visit(TransformUpdater(self))
  File "<https://builds.apache.org/job/beam_PostCommit_Python37/ws/src/sdks/python/apache_beam/pipeline.py",>
line 447, in visit
    self._root_transform().visit(visitor, self, visited)
  File "<https://builds.apache.org/job/beam_PostCommit_Python37/ws/src/sdks/python/apache_beam/pipeline.py",>
line 824, in visit
    part.visit(visitor, pipeline, visited)
  File "<https://builds.apache.org/job/beam_PostCommit_Python37/ws/src/sdks/python/apache_beam/pipeline.py",>
line 824, in visit
    part.visit(visitor, pipeline, visited)
  File "<https://builds.apache.org/job/beam_PostCommit_Python37/ws/src/sdks/python/apache_beam/pipeline.py",>
line 824, in visit
    part.visit(visitor, pipeline, visited)
  File "<https://builds.apache.org/job/beam_PostCommit_Python37/ws/src/sdks/python/apache_beam/pipeline.py",>
line 822, in visit
    visitor.enter_composite_transform(self)
  File "<https://builds.apache.org/job/beam_PostCommit_Python37/ws/src/sdks/python/apache_beam/pipeline.py",>
line 295, in enter_composite_transform
    self._replace_if_needed(transform_node)
  File "<https://builds.apache.org/job/beam_PostCommit_Python37/ws/src/sdks/python/apache_beam/pipeline.py",>
line 264, in _replace_if_needed
    new_output = replacement_transform.expand(input_node)
  File "<https://builds.apache.org/job/beam_PostCommit_Python37/ws/src/sdks/python/apache_beam/runners/direct/helper_transforms.py",>
line 51, in expand
    | beam.ParDo(FinishCombine(self._combine_fn)))
  File "<https://builds.apache.org/job/beam_PostCommit_Python37/ws/src/sdks/python/apache_beam/pvalue.py",>
line 111, in __or__
    return self.pipeline.apply(ptransform, self)
  File "<https://builds.apache.org/job/beam_PostCommit_Python37/ws/src/sdks/python/apache_beam/pipeline.py",>
line 514, in apply
    transform.type_check_inputs(pvalueish)
  File "<https://builds.apache.org/job/beam_PostCommit_Python37/ws/src/sdks/python/apache_beam/transforms/ptransform.py",>
line 758, in type_check_inputs
    type_hints = self.get_type_hints().input_types
  File "<https://builds.apache.org/job/beam_PostCommit_Python37/ws/src/sdks/python/apache_beam/typehints/decorators.py",>
line 213, in get_type_hints
    .with_defaults(self.default_type_hints())
  File "<https://builds.apache.org/job/beam_PostCommit_Python37/ws/src/sdks/python/apache_beam/transforms/core.py",>
line 1068, in default_type_hints
    return self.fn.get_type_hints()
  File "<https://builds.apache.org/job/beam_PostCommit_Python37/ws/src/sdks/python/apache_beam/typehints/decorators.py",>
line 213, in get_type_hints
    .with_defaults(self.default_type_hints())
  File "<https://builds.apache.org/job/beam_PostCommit_Python37/ws/src/sdks/python/apache_beam/runners/direct/helper_transforms.py",>
line 81, in default_type_hints
    args = (typing.Tuple[K, args[0]],) + args[1:]
  File "/usr/lib/python3.7/typing.py", line 743, in __getitem__
    return self.__getitem_inner__(params)
  File "/usr/lib/python3.7/typing.py", line 251, in inner
    return func(*args, **kwds)
  File "/usr/lib/python3.7/typing.py", line 769, in __getitem_inner__
    params = tuple(_type_check(p, msg) for p in params)
  File "/usr/lib/python3.7/typing.py", line 769, in <genexpr>
    params = tuple(_type_check(p, msg) for p in params)
  File "/usr/lib/python3.7/typing.py", line 139, in _type_check
    raise TypeError(f"{msg} Got {arg!r:.100}.")
TypeError: Tuple[t0, t1, ...]: each t must be a type. Got Any.

----------------------------------------------------------------------
XML: nosetests-postCommitIT-direct-py37.xml
----------------------------------------------------------------------
XML: <https://builds.apache.org/job/beam_PostCommit_Python37/ws/src/sdks/python/nosetests.xml>
----------------------------------------------------------------------
Ran 15 tests in 23.564s

FAILED (SKIP=1, errors=1)

> Task :sdks:python:test-suites:direct:py37:postCommitIT FAILED

> Task :sdks:python:test-suites:dataflow:py37:postCommitIT
Found: https://console.cloud.google.com/dataflow/jobsDetail/locations/us-central1/jobs/2019-07-22_08_40_06-1205122535173842800?project=apache-beam-testing.
<https://builds.apache.org/job/beam_PostCommit_Python37/ws/src/sdks/python/apache_beam/io/gcp/bigquery.py>:1140:
BeamDeprecationWarning: options is deprecated since First stable release. References to <pipeline>.options
will not be supported
Found: https://console.cloud.google.com/dataflow/jobsDetail/locations/us-central1/jobs/2019-07-22_08_55_38-2418424432131017697?project=apache-beam-testing.
  method_to_use = self._compute_method(p, p.options)
Found: https://console.cloud.google.com/dataflow/jobsDetail/locations/us-central1/jobs/2019-07-22_09_04_10-16467595599862205216?project=apache-beam-testing.
Found: https://console.cloud.google.com/dataflow/jobsDetail/locations/us-central1/jobs/2019-07-22_09_12_22-2916904645730898872?project=apache-beam-testing.
Found: https://console.cloud.google.com/dataflow/jobsDetail/locations/us-central1/jobs/2019-07-22_09_21_13-2616786824919782145?project=apache-beam-testing.
Found: https://console.cloud.google.com/dataflow/jobsDetail/locations/us-central1/jobs/2019-07-22_08_40_04-10052756611213486211?project=apache-beam-testing.
Found: https://console.cloud.google.com/dataflow/jobsDetail/locations/us-central1/jobs/2019-07-22_09_04_46-18442108123975872804?project=apache-beam-testing.
Found: https://console.cloud.google.com/dataflow/jobsDetail/locations/us-central1/jobs/2019-07-22_09_13_22-11032433438983509662?project=apache-beam-testing.
<https://builds.apache.org/job/beam_PostCommit_Python37/ws/src/sdks/python/apache_beam/runners/dataflow/dataflow_runner.py>:686:
BeamDeprecationWarning: BigQuerySink is deprecated since 2.11.0. Use WriteToBigQuery instead.
  kms_key=transform.kms_key))
<https://builds.apache.org/job/beam_PostCommit_Python37/ws/src/sdks/python/apache_beam/io/fileio_test.py>:232:
FutureWarning: MatchAll is experimental.
  | 'GetPath' >> beam.Map(lambda metadata: metadata.path))
<https://builds.apache.org/job/beam_PostCommit_Python37/ws/src/sdks/python/apache_beam/io/fileio_test.py>:243:
FutureWarning: MatchAll is experimental.
  | 'Checksums' >> beam.Map(compute_hash))
<https://builds.apache.org/job/beam_PostCommit_Python37/ws/src/sdks/python/apache_beam/io/fileio_test.py>:243:
FutureWarning: ReadMatches is experimental.
  | 'Checksums' >> beam.Map(compute_hash))
Found: https://console.cloud.google.com/dataflow/jobsDetail/locations/us-central1/jobs/2019-07-22_08_40_09-13602174330573901377?project=apache-beam-testing.
<https://builds.apache.org/job/beam_PostCommit_Python37/ws/src/sdks/python/apache_beam/io/gcp/bigquery.py>:1140:
BeamDeprecationWarning: options is deprecated since First stable release. References to <pipeline>.options
will not be supported
  method_to_use = self._compute_method(p, p.options)
Found: https://console.cloud.google.com/dataflow/jobsDetail/locations/us-central1/jobs/2019-07-22_08_53_35-10871442335607189410?project=apache-beam-testing.
Found: https://console.cloud.google.com/dataflow/jobsDetail/locations/us-central1/jobs/2019-07-22_09_02_52-10210381917228970287?project=apache-beam-testing.
Found: https://console.cloud.google.com/dataflow/jobsDetail/locations/us-central1/jobs/2019-07-22_09_11_21-15903527222852253513?project=apache-beam-testing.
Found: https://console.cloud.google.com/dataflow/jobsDetail/locations/us-central1/jobs/2019-07-22_08_40_03-9821037298667655213?project=apache-beam-testing.
<https://builds.apache.org/job/beam_PostCommit_Python37/ws/src/sdks/python/apache_beam/runners/dataflow/dataflow_runner.py>:686:
BeamDeprecationWarning: BigQuerySink is deprecated since 2.11.0. Use WriteToBigQuery instead.
  kms_key=transform.kms_key))
Found: https://console.cloud.google.com/dataflow/jobsDetail/locations/us-central1/jobs/2019-07-22_09_01_30-3773135842932602818?project=apache-beam-testing.
Found: https://console.cloud.google.com/dataflow/jobsDetail/locations/us-central1/jobs/2019-07-22_09_11_37-1643626558777574543?project=apache-beam-testing.
Found: https://console.cloud.google.com/dataflow/jobsDetail/locations/us-central1/jobs/2019-07-22_09_23_25-4238446176861552458?project=apache-beam-testing.
Found: https://console.cloud.google.com/dataflow/jobsDetail/locations/us-central1/jobs/2019-07-22_08_40_03-14536811607991667424?project=apache-beam-testing.
Found: https://console.cloud.google.com/dataflow/jobsDetail/locations/us-central1/jobs/2019-07-22_08_49_33-769333533706445813?project=apache-beam-testing.
Found: https://console.cloud.google.com/dataflow/jobsDetail/locations/us-central1/jobs/2019-07-22_08_57_24-6755571151311520030?project=apache-beam-testing.
Found: https://console.cloud.google.com/dataflow/jobsDetail/locations/us-central1/jobs/2019-07-22_09_07_05-5797268027114370637?project=apache-beam-testing.
Found: https://console.cloud.google.com/dataflow/jobsDetail/locations/us-central1/jobs/2019-07-22_09_15_22-14882906732164666579?project=apache-beam-testing.
Found: https://console.cloud.google.com/dataflow/jobsDetail/locations/us-central1/jobs/2019-07-22_09_24_08-12986371213132019465?project=apache-beam-testing.
Found: https://console.cloud.google.com/dataflow/jobsDetail/locations/us-central1/jobs/2019-07-22_08_40_02-8235550688408705978?project=apache-beam-testing.
<https://builds.apache.org/job/beam_PostCommit_Python37/ws/src/sdks/python/apache_beam/runners/dataflow/dataflow_runner.py>:686:
BeamDeprecationWarning: BigQuerySink is deprecated since 2.11.0. Use WriteToBigQuery instead.
  kms_key=transform.kms_key))
Found: https://console.cloud.google.com/dataflow/jobsDetail/locations/us-central1/jobs/2019-07-22_08_48_49-8664963160240846280?project=apache-beam-testing.
<https://builds.apache.org/job/beam_PostCommit_Python37/ws/src/sdks/python/apache_beam/io/gcp/bigquery_test.py>:565:
BeamDeprecationWarning: options is deprecated since First stable release. References to <pipeline>.options
will not be supported
  streaming = self.test_pipeline.options.view_as(StandardOptions).streaming
<https://builds.apache.org/job/beam_PostCommit_Python37/ws/src/sdks/python/apache_beam/io/gcp/bigquery.py>:1140:
BeamDeprecationWarning: options is deprecated since First stable release. References to <pipeline>.options
will not be supported
Found: https://console.cloud.google.com/dataflow/jobsDetail/locations/us-central1/jobs/2019-07-22_08_59_31-9471704641440788457?project=apache-beam-testing.
  method_to_use = self._compute_method(p, p.options)
Found: https://console.cloud.google.com/dataflow/jobsDetail/locations/us-central1/jobs/2019-07-22_09_08_17-5893282251679782430?project=apache-beam-testing.
<https://builds.apache.org/job/beam_PostCommit_Python37/ws/src/sdks/python/apache_beam/io/gcp/bigquery_file_loads.py>:557:
BeamDeprecationWarning: options is deprecated since First stable release. References to <pipeline>.options
will not be supported
  temp_location = p.options.view_as(GoogleCloudOptions).temp_location
Found: https://console.cloud.google.com/dataflow/jobsDetail/locations/us-central1/jobs/2019-07-22_08_40_08-13134320062752305233?project=apache-beam-testing.
<https://builds.apache.org/job/beam_PostCommit_Python37/ws/src/sdks/python/apache_beam/io/gcp/bigquery.py>:1140:
BeamDeprecationWarning: options is deprecated since First stable release. References to <pipeline>.options
will not be supported
Found: https://console.cloud.google.com/dataflow/jobsDetail/locations/us-central1/jobs/2019-07-22_08_50_03-6500521969476926466?project=apache-beam-testing.
Found: https://console.cloud.google.com/dataflow/jobsDetail/locations/us-central1/jobs/2019-07-22_09_01_49-13149198340706499437?project=apache-beam-testing.
Found: https://console.cloud.google.com/dataflow/jobsDetail/locations/us-central1/jobs/2019-07-22_09_11_48-9935053352209424992?project=apache-beam-testing.
  method_to_use = self._compute_method(p, p.options)
<https://builds.apache.org/job/beam_PostCommit_Python37/ws/src/sdks/python/apache_beam/io/gcp/bigquery_file_loads.py>:557:
BeamDeprecationWarning: options is deprecated since First stable release. References to <pipeline>.options
will not be supported
  temp_location = p.options.view_as(GoogleCloudOptions).temp_location
Found: https://console.cloud.google.com/dataflow/jobsDetail/locations/us-central1/jobs/2019-07-22_08_40_04-13986511810498613970?project=apache-beam-testing.
<https://builds.apache.org/job/beam_PostCommit_Python37/ws/src/sdks/python/apache_beam/runners/dataflow/dataflow_runner.py>:686:
BeamDeprecationWarning: BigQuerySink is deprecated since 2.11.0. Use WriteToBigQuery instead.
  kms_key=transform.kms_key))
Found: https://console.cloud.google.com/dataflow/jobsDetail/locations/us-central1/jobs/2019-07-22_08_49_56-7518588339980471447?project=apache-beam-testing.
Found: https://console.cloud.google.com/dataflow/jobsDetail/locations/us-central1/jobs/2019-07-22_08_59_13-16375662296065352730?project=apache-beam-testing.
Found: https://console.cloud.google.com/dataflow/jobsDetail/locations/us-central1/jobs/2019-07-22_09_07_30-9465979003760367086?project=apache-beam-testing.
<https://builds.apache.org/job/beam_PostCommit_Python37/ws/src/sdks/python/apache_beam/io/gcp/big_query_query_to_table_pipeline.py>:73:
BeamDeprecationWarning: BigQuerySink is deprecated since 2.11.0. Use WriteToBigQuery instead.
  kms_key=kms_key))
Found: https://console.cloud.google.com/dataflow/jobsDetail/locations/us-central1/jobs/2019-07-22_09_15_22-13182900672088323193?project=apache-beam-testing.
test_datastore_wordcount_it (apache_beam.examples.cookbook.datastore_wordcount_it_test.DatastoreWordCountIT)
... SKIP: This test still needs to be fixed on Python 3TODO: BEAM-4543
test_avro_it (apache_beam.examples.fastavro_it_test.FastavroIT) ... SKIP: Due to a known issue
in avro-python3 package, thistest is skipped until BEAM-6522 is addressed. 
test_bigquery_tornadoes_it (apache_beam.examples.cookbook.bigquery_tornadoes_it_test.BigqueryTornadoesIT)
... ok
test_autocomplete_it (apache_beam.examples.complete.autocomplete_test.AutocompleteTest) ...
ok
test_wordcount_fnapi_it (apache_beam.examples.wordcount_it_test.WordCountIT) ... ok
test_streaming_wordcount_it (apache_beam.examples.streaming_wordcount_it_test.StreamingWordCountIT)
... ok
test_leader_board_it (apache_beam.examples.complete.game.leader_board_it_test.LeaderBoardIT)
... ok
test_game_stats_it (apache_beam.examples.complete.game.game_stats_it_test.GameStatsIT) ...
ok
test_wordcount_it (apache_beam.examples.wordcount_it_test.WordCountIT) ... ok
test_user_score_it (apache_beam.examples.complete.game.user_score_it_test.UserScoreIT) ...
ok
test_bigquery_read_1M_python (apache_beam.io.gcp.bigquery_io_read_it_test.BigqueryIOReadIT)
... ok
test_datastore_write_limit (apache_beam.io.gcp.datastore_write_it_test.DatastoreWriteIT) ...
SKIP: This test still needs to be fixed on Python 3TODO: BEAM-4543
test_copy (apache_beam.io.gcp.gcsio_integration_test.GcsIOIntegrationTest) ... ok
test_copy_batch (apache_beam.io.gcp.gcsio_integration_test.GcsIOIntegrationTest) ... ok
test_copy_batch_kms (apache_beam.io.gcp.gcsio_integration_test.GcsIOIntegrationTest) ... ok
test_copy_batch_rewrite_token (apache_beam.io.gcp.gcsio_integration_test.GcsIOIntegrationTest)
... ok
test_copy_kms (apache_beam.io.gcp.gcsio_integration_test.GcsIOIntegrationTest) ... ok
test_copy_rewrite_token (apache_beam.io.gcp.gcsio_integration_test.GcsIOIntegrationTest) ...
ok
test_hourly_team_score_it (apache_beam.examples.complete.game.hourly_team_score_it_test.HourlyTeamScoreIT)
... ok
test_multiple_destinations_transform (apache_beam.io.gcp.bigquery_file_loads_test.BigQueryFileLoadsIT)
... ok
test_one_job_fails_all_jobs_fail (apache_beam.io.gcp.bigquery_file_loads_test.BigQueryFileLoadsIT)
... ok
test_big_query_read (apache_beam.io.gcp.bigquery_read_it_test.BigQueryReadIntegrationTests)
... ok
test_big_query_read_new_types (apache_beam.io.gcp.bigquery_read_it_test.BigQueryReadIntegrationTests)
... ok
test_transform_on_gcs (apache_beam.io.fileio_test.MatchIntegrationTest) ... ok
test_multiple_destinations_transform (apache_beam.io.gcp.bigquery_test.BigQueryStreamingInsertTransformIntegrationTests)
... ok
test_value_provider_transform (apache_beam.io.gcp.bigquery_test.BigQueryStreamingInsertTransformIntegrationTests)
... ok
test_streaming_data_only (apache_beam.io.gcp.pubsub_integration_test.PubSubIntegrationTest)
... ok
test_streaming_with_attributes (apache_beam.io.gcp.pubsub_integration_test.PubSubIntegrationTest)
... ok
test_job_python_from_python_it (apache_beam.transforms.external_test_it.ExternalTransformIT)
... ok
test_parquetio_it (apache_beam.io.parquetio_it_test.TestParquetIT) ... ok
test_big_query_legacy_sql (apache_beam.io.gcp.big_query_query_to_table_it_test.BigQueryQueryToTableIT)
... ok
test_big_query_new_types (apache_beam.io.gcp.big_query_query_to_table_it_test.BigQueryQueryToTableIT)
... ok
test_big_query_standard_sql (apache_beam.io.gcp.big_query_query_to_table_it_test.BigQueryQueryToTableIT)
... ok
test_big_query_standard_sql_kms_key_native (apache_beam.io.gcp.big_query_query_to_table_it_test.BigQueryQueryToTableIT)
... ok
test_metrics_fnapi_it (apache_beam.runners.dataflow.dataflow_exercise_metrics_pipeline_test.ExerciseMetricsPipelineTest)
... ok
test_metrics_it (apache_beam.runners.dataflow.dataflow_exercise_metrics_pipeline_test.ExerciseMetricsPipelineTest)
... ok
test_big_query_write (apache_beam.io.gcp.bigquery_write_it_test.BigQueryWriteIntegrationTests)
... ok
test_big_query_write_new_types (apache_beam.io.gcp.bigquery_write_it_test.BigQueryWriteIntegrationTests)
... ok
test_big_query_write_schema_autodetect (apache_beam.io.gcp.bigquery_write_it_test.BigQueryWriteIntegrationTests)
... SKIP: DataflowRunner does not support schema autodetection
test_big_query_write_without_schema (apache_beam.io.gcp.bigquery_write_it_test.BigQueryWriteIntegrationTests)
... ok
test_datastore_write_limit (apache_beam.io.gcp.datastore.v1new.datastore_write_it_test.DatastoreWriteIT)
... ok

----------------------------------------------------------------------
XML: nosetests-postCommitIT-df-py37.xml
----------------------------------------------------------------------
XML: <https://builds.apache.org/job/beam_PostCommit_Python37/ws/src/sdks/python/nosetests.xml>
----------------------------------------------------------------------
Ran 41 tests in 3315.451s

OK (SKIP=4)

FAILURE: Build failed with an exception.

* Where:
Build file '<https://builds.apache.org/job/beam_PostCommit_Python37/ws/src/sdks/python/test-suites/direct/py37/build.gradle'>
line: 49

* What went wrong:
Execution failed for task ':sdks:python:test-suites:direct:py37:postCommitIT'.
> Process 'command 'sh'' finished with non-zero exit value 1

* Try:
Run with --stacktrace option to get the stack trace. Run with --info or --debug option to
get more log output. Run with --scan to get full insights.

* Get more help at https://help.gradle.org

Deprecated Gradle features were used in this build, making it incompatible with Gradle 6.0.
Use '--warning-mode all' to show the individual deprecation warnings.
See https://docs.gradle.org/5.2.1/userguide/command_line_interface.html#sec:command_line_warnings

BUILD FAILED in 56m 7s
64 actionable tasks: 47 executed, 17 from cache

Publishing build scan...
https://gradle.com/s/5mii3zd2cd3tc

Build step 'Invoke Gradle script' changed build result to FAILURE
Build step 'Invoke Gradle script' marked build as failure

---------------------------------------------------------------------
To unsubscribe, e-mail: builds-unsubscribe@beam.apache.org
For additional commands, e-mail: builds-help@beam.apache.org


Mime
View raw message