beam-builds mailing list archives

Site index · List index
Message view « Date » · « Thread »
Top « Date » · « Thread »
From Apache Jenkins Server <jenk...@builds.apache.org>
Subject Build failed in Jenkins: beam_PostCommit_Java_PortabilityApi #2290
Date Tue, 09 Jul 2019 09:55:17 GMT
See <https://builds.apache.org/job/beam_PostCommit_Java_PortabilityApi/2290/display/redirect?page=changes>

Changes:

[ryan] Consider Elasticsearch as one word in camelCase.

------------------------------------------
[...truncated 40.69 KB...]
> Task :runners:core-java:jar
> Task :sdks:java:harness:compileJava FROM-CACHE
> Task :sdks:java:harness:classes UP-TO-DATE
> Task :sdks:java:io:google-cloud-platform:compileJava FROM-CACHE
> Task :sdks:java:io:google-cloud-platform:classes UP-TO-DATE
> Task :sdks:java:io:google-cloud-platform:jar
> Task :examples:java:compileJava FROM-CACHE
> Task :examples:java:classes UP-TO-DATE

> Task :sdks:go:resolveBuildDependencies
Resolving golang.org/x/crypto: commit='d9133f5469342136e669e85192a26056b587f503', urls=[https://go.googlesource.com/crypto]

> Task :runners:google-cloud-dataflow-java:compileJava FROM-CACHE
> Task :runners:google-cloud-dataflow-java:classes
> Task :examples:java:jar
> Task :runners:google-cloud-dataflow-java:jar
> Task :examples:java:compileTestJava FROM-CACHE
> Task :examples:java:testClasses
> Task :examples:java:testJar
> Task :vendor:sdks-java-extensions-protobuf:shadowJar

> Task :sdks:go:resolveBuildDependencies
Resolving golang.org/x/debug: commit='95515998a8a4bd7448134b2cb5971dbeb12e0b77', urls=[https://go.googlesource.com/debug]
Resolving golang.org/x/net: commit='2fb46b16b8dda405028c50f7c7f0f9dd1fa6bfb1', urls=[https://go.googlesource.com/net]
Resolving golang.org/x/oauth2: commit='a032972e28060ca4f5644acffae3dfc268cc09db', urls=[https://go.googlesource.com/oauth2]
Resolving golang.org/x/sync: commit='fd80eb99c8f653c847d294a001bdf2a3a6f768f5', urls=[https://go.googlesource.com/sync]

> Task :sdks:java:core:shadowTestJar
> Task :sdks:java:extensions:google-cloud-platform-core:compileTestJava FROM-CACHE
> Task :sdks:java:extensions:google-cloud-platform-core:testClasses UP-TO-DATE
> Task :sdks:java:extensions:google-cloud-platform-core:testJar

> Task :sdks:go:resolveBuildDependencies
Resolving golang.org/x/sys: commit='37707fdb30a5b38865cfb95e5aab41707daec7fd', urls=[https://go.googlesource.com/sys]
Resolving cached github.com/coreos/etcd: commit='11214aa33bf5a47d3d9d8dafe0f6b97237dfe921',
urls=[https://github.com/coreos/etcd.git, git@github.com:coreos/etcd.git]
Resolving cached github.com/coreos/etcd: commit='11214aa33bf5a47d3d9d8dafe0f6b97237dfe921',
urls=[https://github.com/coreos/etcd.git, git@github.com:coreos/etcd.git]

> Task :sdks:java:harness:shadowJar
> Task :sdks:java:harness:jar
> Task :sdks:java:container:copyDockerfileDependencies
> Task :runners:java-fn-execution:compileJava FROM-CACHE
> Task :runners:java-fn-execution:classes UP-TO-DATE
> Task :runners:java-fn-execution:jar
> Task :runners:direct-java:compileJava FROM-CACHE
> Task :runners:direct-java:classes UP-TO-DATE
> Task :runners:google-cloud-dataflow-java:worker:compileJava FROM-CACHE
> Task :runners:google-cloud-dataflow-java:worker:classes
> Task :runners:direct-java:shadowJar
> Task :sdks:java:io:google-cloud-platform:compileTestJava FROM-CACHE
> Task :sdks:java:io:google-cloud-platform:testClasses UP-TO-DATE
> Task :sdks:java:io:google-cloud-platform:testJar
> Task :runners:google-cloud-dataflow-java:worker:shadowJar

> Task :sdks:go:resolveBuildDependencies
Resolving google.golang.org/api: commit='386d4e5f4f92f86e6aec85985761bba4b938a2d5', urls=[https://code.googlesource.com/google-api-go-client]
Resolving google.golang.org/genproto: commit='2b5a72b8730b0b16380010cfe5286c42108d88e7', urls=[https://github.com/google/go-genproto]
Resolving google.golang.org/grpc: commit='7646b5360d049a7ca31e9133315db43456f39e2e', urls=[https://github.com/grpc/grpc-go]
Resolving cached github.com/coreos/etcd: commit='11214aa33bf5a47d3d9d8dafe0f6b97237dfe921',
urls=[https://github.com/coreos/etcd.git, git@github.com:coreos/etcd.git]
Resolving cached github.com/coreos/etcd: commit='11214aa33bf5a47d3d9d8dafe0f6b97237dfe921',
urls=[https://github.com/coreos/etcd.git, git@github.com:coreos/etcd.git]

> Task :sdks:go:installDependencies
> Task :sdks:go:buildLinuxAmd64
> Task :sdks:go:goBuild

> Task :sdks:java:container:resolveBuildDependencies
Resolving ./github.com/apache/beam/sdks/go@<https://builds.apache.org/job/beam_PostCommit_Java_PortabilityApi/ws/src/sdks/go>

> Task :sdks:java:container:installDependencies
> Task :sdks:java:container:buildLinuxAmd64
> Task :sdks:java:container:goBuild
> Task :sdks:java:container:dockerPrepare
> Task :sdks:java:container:docker

> Task :runners:google-cloud-dataflow-java:buildAndPushDockerContainer
WARNING: `gcloud docker` will not be supported for Docker client versions above 18.03.

As an alternative, use `gcloud auth configure-docker` to configure `docker` to
use `gcloud` as a credential helper, then use `docker` as you would for non-GCR
registries, e.g. `docker pull gcr.io/project-id/my-image`. Add
`--verbosity=error` to silence this warning: `gcloud docker
--verbosity=error -- pull gcr.io/project-id/my-image`.

See: https://cloud.google.com/container-registry/docs/support/deprecation-notices#gcloud-docker

The push refers to repository [us.gcr.io/apache-beam-testing/java-postcommit-it/java]
940b4fb09470: Preparing
1313e4a1bd19: Preparing
8d0c7489f10f: Preparing
150134b77bf0: Preparing
f7d12d471667: Preparing
f350d0146bb3: Preparing
e38df31d449c: Preparing
af5ae4841776: Preparing
b17cc31e431b: Preparing
12cb127eee44: Preparing
604829a174eb: Preparing
fbb641a8b943: Preparing
af5ae4841776: Waiting
b17cc31e431b: Waiting
604829a174eb: Waiting
fbb641a8b943: Waiting
f350d0146bb3: Waiting
12cb127eee44: Waiting
e38df31d449c: Waiting
150134b77bf0: Layer already exists
8d0c7489f10f: Layer already exists
1313e4a1bd19: Layer already exists
f7d12d471667: Layer already exists
940b4fb09470: Layer already exists
f350d0146bb3: Layer already exists
e38df31d449c: Layer already exists
af5ae4841776: Layer already exists
b17cc31e431b: Layer already exists
604829a174eb: Layer already exists
12cb127eee44: Layer already exists
fbb641a8b943: Layer already exists
20190403225916: digest: sha256:113fa82e6d8fced5253734660525f85a82b72d7b5313e19474602d26be100c80
size: 2841
390c371de3d5: Preparing
307bb83b3ba0: Preparing
ac8285d40836: Preparing
dfd8c5ea34c4: Preparing
59a9ca5606e4: Preparing
05c39d326d02: Preparing
cad0181e2290: Preparing
a8122da79081: Preparing
483b6afcd302: Preparing
f4aaad5a2844: Preparing
f0fa4eb58fbc: Preparing
4230ff7f2288: Preparing
2c719774c1e1: Preparing
ec62f19bb3aa: Preparing
f94641f1fe1f: Preparing
4230ff7f2288: Waiting
2c719774c1e1: Waiting
f0fa4eb58fbc: Waiting
a8122da79081: Waiting
483b6afcd302: Waiting
05c39d326d02: Waiting
ec62f19bb3aa: Waiting
f4aaad5a2844: Waiting
cad0181e2290: Waiting
f94641f1fe1f: Waiting
390c371de3d5: Layer already exists
ac8285d40836: Layer already exists
307bb83b3ba0: Layer already exists
59a9ca5606e4: Layer already exists
dfd8c5ea34c4: Layer already exists
05c39d326d02: Layer already exists
cad0181e2290: Layer already exists
a8122da79081: Layer already exists
483b6afcd302: Layer already exists
f0fa4eb58fbc: Layer already exists
4230ff7f2288: Layer already exists
f4aaad5a2844: Layer already exists
2c719774c1e1: Layer already exists
f94641f1fe1f: Layer already exists
ec62f19bb3aa: Layer already exists
20190523000039: digest: sha256:498c15976a3790d5c9b8177f63ffaeff26640edccd005aa933276431cdc1ab72
size: 3469
e9a2d04639eb: Preparing
2b8aca292ea4: Preparing
7c148c2898fb: Preparing
205ce3f9b411: Preparing
a9fbbdfb5c44: Preparing
9835161c3fd6: Preparing
f7d12d471667: Preparing
f350d0146bb3: Preparing
e38df31d449c: Preparing
af5ae4841776: Preparing
b17cc31e431b: Preparing
12cb127eee44: Preparing
f350d0146bb3: Waiting
604829a174eb: Preparing
fbb641a8b943: Preparing
e38df31d449c: Waiting
af5ae4841776: Waiting
12cb127eee44: Waiting
b17cc31e431b: Waiting
fbb641a8b943: Waiting
604829a174eb: Waiting
9835161c3fd6: Waiting
f7d12d471667: Waiting
a9fbbdfb5c44: Pushed
2b8aca292ea4: Pushed
b17cc31e431b: Layer already exists
af5ae4841776: Layer already exists
f7d12d471667: Layer already exists
f350d0146bb3: Layer already exists
e38df31d449c: Layer already exists
12cb127eee44: Layer already exists
604829a174eb: Layer already exists
fbb641a8b943: Layer already exists
7c148c2898fb: Pushed
e9a2d04639eb: Pushed
9835161c3fd6: Pushed
205ce3f9b411: Pushed
20190709091656: digest: sha256:23f89d90812ad13a663e497bb37ccd2e1ea9b2be6626c41ea8a87a81dd25ed0c
size: 3262

> Task :runners:google-cloud-dataflow-java:coreSDKJavaFnApiWorkerIntegrationTest NO-SOURCE
> Task :runners:google-cloud-dataflow-java:examplesJavaFnApiWorkerIntegrationTest
> Task :runners:google-cloud-dataflow-java:googleCloudPlatformFnApiWorkerIntegrationTest

org.apache.beam.sdk.io.gcp.bigquery.BigQueryToTableIT > testNewTypesQueryWithReshuffle
FAILED
    java.lang.RuntimeException at BigQueryToTableIT.java:118

org.apache.beam.sdk.io.gcp.bigquery.BigQueryToTableIT > testLegacyQueryWithoutReshuffle
FAILED
    java.lang.RuntimeException at BigQueryToTableIT.java:118

org.apache.beam.sdk.io.gcp.bigtable.BigtableWriteIT > testE2EBigtableWrite FAILED
    java.lang.RuntimeException at BigtableWriteIT.java:130

7 tests completed, 3 failed

> Task :runners:google-cloud-dataflow-java:googleCloudPlatformFnApiWorkerIntegrationTest
FAILED

> Task :runners:google-cloud-dataflow-java:cleanUpDockerImages
Untagged: us.gcr.io/apache-beam-testing/java-postcommit-it/java:20190709091656
Untagged: us.gcr.io/apache-beam-testing/java-postcommit-it/java@sha256:23f89d90812ad13a663e497bb37ccd2e1ea9b2be6626c41ea8a87a81dd25ed0c
Digests:
- us.gcr.io/apache-beam-testing/java-postcommit-it/java@sha256:23f89d90812ad13a663e497bb37ccd2e1ea9b2be6626c41ea8a87a81dd25ed0c
  Associated tags:
 - 20190709091656
Tags:
- us.gcr.io/apache-beam-testing/java-postcommit-it/java:20190709091656
Deleted [us.gcr.io/apache-beam-testing/java-postcommit-it/java:20190709091656].
Deleted [us.gcr.io/apache-beam-testing/java-postcommit-it/java@sha256:23f89d90812ad13a663e497bb37ccd2e1ea9b2be6626c41ea8a87a81dd25ed0c].

FAILURE: Build failed with an exception.

* What went wrong:
Execution failed for task ':runners:google-cloud-dataflow-java:googleCloudPlatformFnApiWorkerIntegrationTest'.
> There were failing tests. See the report at: file://<https://builds.apache.org/job/beam_PostCommit_Java_PortabilityApi/ws/src/runners/google-cloud-dataflow-java/build/reports/tests/googleCloudPlatformFnApiWorkerIntegrationTest/index.html>

* Try:
Run with --stacktrace option to get the stack trace. Run with --info or --debug option to
get more log output. Run with --scan to get full insights.

* Get more help at https://help.gradle.org

Deprecated Gradle features were used in this build, making it incompatible with Gradle 6.0.
Use '--warning-mode all' to show the individual deprecation warnings.
See https://docs.gradle.org/5.2.1/userguide/command_line_interface.html#sec:command_line_warnings

BUILD FAILED in 38m 34s
93 actionable tasks: 67 executed, 25 from cache, 1 up-to-date

Publishing build scan...
https://gradle.com/s/e4kp2gzkbifu6

Build step 'Invoke Gradle script' changed build result to FAILURE
Build step 'Invoke Gradle script' marked build as failure

---------------------------------------------------------------------
To unsubscribe, e-mail: builds-unsubscribe@beam.apache.org
For additional commands, e-mail: builds-help@beam.apache.org


Mime
View raw message