beam-builds mailing list archives

Site index · List index
Message view « Date » · « Thread »
Top « Date » · « Thread »
From Apache Jenkins Server <jenk...@builds.apache.org>
Subject Build failed in Jenkins: beam_PostCommit_Java_Nexmark_Dataflow #3179
Date Mon, 08 Jul 2019 18:12:38 GMT
See <https://builds.apache.org/job/beam_PostCommit_Java_Nexmark_Dataflow/3179/display/redirect>

------------------------------------------
[...truncated 203.06 KB...]
  0008  query:MONITOR_NEW_USERS; exportSummaryToBigQuery:true; numEvents:10000000
  0009  query:WINNING_BIDS; exportSummaryToBigQuery:true; numEvents:1000000
  0010  query:LOG_TO_SHARDED_FILES; exportSummaryToBigQuery:true; numEvents:10000000
  0011  query:USER_SESSIONS; exportSummaryToBigQuery:true; numEvents:10000000
  0012  query:PROCESSING_TIME_WINDOWS; exportSummaryToBigQuery:true; numEvents:10000000
  0013  query:BOUNDED_SIDE_INPUT_JOIN; exportSummaryToBigQuery:true; numEvents:10000000
  0014  query:SESSION_SIDE_INPUT_JOIN; exportSummaryToBigQuery:true; numEvents:10000000

Performance:
  Conf  Runtime(sec)    (Baseline)  Events(/sec)    (Baseline)       Results    (Baseline)
  0000          -1.0                        -1.0                          -1             

        *** Job was unexpectedly updated ***
  0001          -1.0                        -1.0                          -1             

        *** Job was unexpectedly updated ***
  0002          -1.0                        -1.0                          -1             

        *** Job was unexpectedly updated ***
  0003          -1.0                        -1.0                          -1             

        *** Job was unexpectedly updated ***
  0004          -1.0                        -1.0                          -1             

        *** Job was unexpectedly updated ***
  0005          -1.0                        -1.0                          -1             

        *** Job was unexpectedly updated ***
  0006          -1.0                        -1.0                          -1             

        *** Job was unexpectedly updated ***
  0007          -1.0                        -1.0                          -1             

        *** Job was unexpectedly updated ***
  0008  *** not run ***
  0009          -1.0                        -1.0                          -1             

        *** Job was unexpectedly updated ***
  0010  *** not run ***
  0011          -1.0                        -1.0                          -1             

        *** Job was unexpectedly updated ***
  0012          -1.0                        -1.0                          -1             

        *** Job was unexpectedly updated ***
  0013          -1.0                        -1.0                          -1             

        *** Job was unexpectedly updated ***
  0014          -1.0                        -1.0                          -1             

        *** Job was unexpectedly updated ***
==========================================================================================

2019-07-08T18:12:32.671Z 0 samples not enough to calculate steady-state event rate

==========================================================================================
Run started 2019-07-08T18:12:11.101Z and ran for PT21.570S

Default configuration:
{"debug":true,"query":null,"sourceType":"DIRECT","sinkType":"DEVNULL","exportSummaryToBigQuery":false,"pubSubMode":"COMBINED","sideInputType":"DIRECT","sideInputRowCount":500,"sideInputNumShards":3,"sideInputUrl":null,"sessionGap":{"standardDays":0,"standardHours":0,"standardMinutes":10,"standardSeconds":600,"millis":600000},"numEvents":100000,"numEventGenerators":100,"rateShape":"SINE","firstEventRate":10000,"nextEventRate":10000,"rateUnit":"PER_SECOND","ratePeriodSec":600,"preloadSeconds":0,"streamTimeout":240,"isRateLimited":false,"useWallclockEventTime":false,"avgPersonByteSize":200,"avgAuctionByteSize":500,"avgBidByteSize":100,"hotAuctionRatio":2,"hotSellersRatio":4,"hotBiddersRatio":4,"windowSizeSec":10,"windowPeriodSec":5,"watermarkHoldbackSec":0,"numInFlightAuctions":100,"numActivePeople":1000,"coderStrategy":"HAND","cpuDelayMs":0,"diskBusyBytes":0,"auctionSkip":123,"fanout":5,"maxAuctionsWaitingTime":600,"occasionalDelaySec":3,"probDelayedEvent":0.1,"maxLogEvents":100000,"usePubsubPublishTime":false,"outOfOrderGroupSize":1}

Configurations:
  Conf  Description
  0000  query:PASSTHROUGH; exportSummaryToBigQuery:true; numEvents:10000000
  0001  query:CURRENCY_CONVERSION; exportSummaryToBigQuery:true; numEvents:10000000
  0002  query:SELECTION; exportSummaryToBigQuery:true; numEvents:10000000
  0003  query:LOCAL_ITEM_SUGGESTION; exportSummaryToBigQuery:true; numEvents:10000000
  0004  query:AVERAGE_PRICE_FOR_CATEGORY; exportSummaryToBigQuery:true; numEvents:1000000
  0005  query:HOT_ITEMS; exportSummaryToBigQuery:true; numEvents:10000000
  0006  query:AVERAGE_SELLING_PRICE_BY_SELLER; exportSummaryToBigQuery:true; numEvents:1000000
  0007  query:HIGHEST_BID; exportSummaryToBigQuery:true; numEvents:10000000
  0008  query:MONITOR_NEW_USERS; exportSummaryToBigQuery:true; numEvents:10000000
  0009  query:WINNING_BIDS; exportSummaryToBigQuery:true; numEvents:1000000
  0010  query:LOG_TO_SHARDED_FILES; exportSummaryToBigQuery:true; numEvents:10000000
  0011  query:USER_SESSIONS; exportSummaryToBigQuery:true; numEvents:10000000
  0012  query:PROCESSING_TIME_WINDOWS; exportSummaryToBigQuery:true; numEvents:10000000
  0013  query:BOUNDED_SIDE_INPUT_JOIN; exportSummaryToBigQuery:true; numEvents:10000000
  0014  query:SESSION_SIDE_INPUT_JOIN; exportSummaryToBigQuery:true; numEvents:10000000

Performance:
  Conf  Runtime(sec)    (Baseline)  Events(/sec)    (Baseline)       Results    (Baseline)
  0000          -1.0                        -1.0                          -1             

        *** Job was unexpectedly updated ***
  0001          -1.0                        -1.0                          -1             

        *** Job was unexpectedly updated ***
  0002          -1.0                        -1.0                          -1             

        *** Job was unexpectedly updated ***
  0003          -1.0                        -1.0                          -1             

        *** Job was unexpectedly updated ***
  0004          -1.0                        -1.0                          -1             

        *** Job was unexpectedly updated ***
  0005          -1.0                        -1.0                          -1             

        *** Job was unexpectedly updated ***
  0006          -1.0                        -1.0                          -1             

        *** Job was unexpectedly updated ***
  0007          -1.0                        -1.0                          -1             

        *** Job was unexpectedly updated ***
  0008          -1.0                        -1.0                          -1             

        *** Job was unexpectedly updated ***
  0009          -1.0                        -1.0                          -1             

        *** Job was unexpectedly updated ***
  0010  *** not run ***
  0011          -1.0                        -1.0                          -1             

        *** Job was unexpectedly updated ***
  0012          -1.0                        -1.0                          -1             

        *** Job was unexpectedly updated ***
  0013          -1.0                        -1.0                          -1             

        *** Job was unexpectedly updated ***
  0014          -1.0                        -1.0                          -1             

        *** Job was unexpectedly updated ***
==========================================================================================

2019-07-08T18:12:33.759Z Waiting for main pipeline to 'finish'
2019-07-08T18:12:33.759Z FAILED Query10
2019-07-08T18:12:33.786Z 0 samples not enough to calculate steady-state event rate

==========================================================================================
Run started 2019-07-08T18:12:11.101Z and ran for PT22.686S

Default configuration:
{"debug":true,"query":null,"sourceType":"DIRECT","sinkType":"DEVNULL","exportSummaryToBigQuery":false,"pubSubMode":"COMBINED","sideInputType":"DIRECT","sideInputRowCount":500,"sideInputNumShards":3,"sideInputUrl":null,"sessionGap":{"standardDays":0,"standardHours":0,"standardMinutes":10,"standardSeconds":600,"millis":600000},"numEvents":100000,"numEventGenerators":100,"rateShape":"SINE","firstEventRate":10000,"nextEventRate":10000,"rateUnit":"PER_SECOND","ratePeriodSec":600,"preloadSeconds":0,"streamTimeout":240,"isRateLimited":false,"useWallclockEventTime":false,"avgPersonByteSize":200,"avgAuctionByteSize":500,"avgBidByteSize":100,"hotAuctionRatio":2,"hotSellersRatio":4,"hotBiddersRatio":4,"windowSizeSec":10,"windowPeriodSec":5,"watermarkHoldbackSec":0,"numInFlightAuctions":100,"numActivePeople":1000,"coderStrategy":"HAND","cpuDelayMs":0,"diskBusyBytes":0,"auctionSkip":123,"fanout":5,"maxAuctionsWaitingTime":600,"occasionalDelaySec":3,"probDelayedEvent":0.1,"maxLogEvents":100000,"usePubsubPublishTime":false,"outOfOrderGroupSize":1}

Configurations:
  Conf  Description
  0000  query:PASSTHROUGH; exportSummaryToBigQuery:true; numEvents:10000000
  0001  query:CURRENCY_CONVERSION; exportSummaryToBigQuery:true; numEvents:10000000
  0002  query:SELECTION; exportSummaryToBigQuery:true; numEvents:10000000
  0003  query:LOCAL_ITEM_SUGGESTION; exportSummaryToBigQuery:true; numEvents:10000000
  0004  query:AVERAGE_PRICE_FOR_CATEGORY; exportSummaryToBigQuery:true; numEvents:1000000
  0005  query:HOT_ITEMS; exportSummaryToBigQuery:true; numEvents:10000000
  0006  query:AVERAGE_SELLING_PRICE_BY_SELLER; exportSummaryToBigQuery:true; numEvents:1000000
  0007  query:HIGHEST_BID; exportSummaryToBigQuery:true; numEvents:10000000
  0008  query:MONITOR_NEW_USERS; exportSummaryToBigQuery:true; numEvents:10000000
  0009  query:WINNING_BIDS; exportSummaryToBigQuery:true; numEvents:1000000
  0010  query:LOG_TO_SHARDED_FILES; exportSummaryToBigQuery:true; numEvents:10000000
  0011  query:USER_SESSIONS; exportSummaryToBigQuery:true; numEvents:10000000
  0012  query:PROCESSING_TIME_WINDOWS; exportSummaryToBigQuery:true; numEvents:10000000
  0013  query:BOUNDED_SIDE_INPUT_JOIN; exportSummaryToBigQuery:true; numEvents:10000000
  0014  query:SESSION_SIDE_INPUT_JOIN; exportSummaryToBigQuery:true; numEvents:10000000

Performance:
  Conf  Runtime(sec)    (Baseline)  Events(/sec)    (Baseline)       Results    (Baseline)
  0000          -1.0                        -1.0                          -1             

        *** Job was unexpectedly updated ***
  0001          -1.0                        -1.0                          -1             

        *** Job was unexpectedly updated ***
  0002          -1.0                        -1.0                          -1             

        *** Job was unexpectedly updated ***
  0003          -1.0                        -1.0                          -1             

        *** Job was unexpectedly updated ***
  0004          -1.0                        -1.0                          -1             

        *** Job was unexpectedly updated ***
  0005          -1.0                        -1.0                          -1             

        *** Job was unexpectedly updated ***
  0006          -1.0                        -1.0                          -1             

        *** Job was unexpectedly updated ***
  0007          -1.0                        -1.0                          -1             

        *** Job was unexpectedly updated ***
  0008          -1.0                        -1.0                          -1             

        *** Job was unexpectedly updated ***
  0009          -1.0                        -1.0                          -1             

        *** Job was unexpectedly updated ***
  0010          -1.0                        -1.0                          -1             

        *** Job was unexpectedly updated ***
  0011          -1.0                        -1.0                          -1             

        *** Job was unexpectedly updated ***
  0012          -1.0                        -1.0                          -1             

        *** Job was unexpectedly updated ***
  0013          -1.0                        -1.0                          -1             

        *** Job was unexpectedly updated ***
  0014          -1.0                        -1.0                          -1             

        *** Job was unexpectedly updated ***
==========================================================================================


==========================================================================================
Run started 2019-07-08T18:12:11.101Z and ran for PT25.530S

Default configuration:
{"debug":true,"query":null,"sourceType":"DIRECT","sinkType":"DEVNULL","exportSummaryToBigQuery":false,"pubSubMode":"COMBINED","sideInputType":"DIRECT","sideInputRowCount":500,"sideInputNumShards":3,"sideInputUrl":null,"sessionGap":{"standardDays":0,"standardHours":0,"standardMinutes":10,"standardSeconds":600,"millis":600000},"numEvents":100000,"numEventGenerators":100,"rateShape":"SINE","firstEventRate":10000,"nextEventRate":10000,"rateUnit":"PER_SECOND","ratePeriodSec":600,"preloadSeconds":0,"streamTimeout":240,"isRateLimited":false,"useWallclockEventTime":false,"avgPersonByteSize":200,"avgAuctionByteSize":500,"avgBidByteSize":100,"hotAuctionRatio":2,"hotSellersRatio":4,"hotBiddersRatio":4,"windowSizeSec":10,"windowPeriodSec":5,"watermarkHoldbackSec":0,"numInFlightAuctions":100,"numActivePeople":1000,"coderStrategy":"HAND","cpuDelayMs":0,"diskBusyBytes":0,"auctionSkip":123,"fanout":5,"maxAuctionsWaitingTime":600,"occasionalDelaySec":3,"probDelayedEvent":0.1,"maxLogEvents":100000,"usePubsubPublishTime":false,"outOfOrderGroupSize":1}

Configurations:
  Conf  Description
  0000  query:PASSTHROUGH; exportSummaryToBigQuery:true; numEvents:10000000
  0001  query:CURRENCY_CONVERSION; exportSummaryToBigQuery:true; numEvents:10000000
  0002  query:SELECTION; exportSummaryToBigQuery:true; numEvents:10000000
  0003  query:LOCAL_ITEM_SUGGESTION; exportSummaryToBigQuery:true; numEvents:10000000
  0004  query:AVERAGE_PRICE_FOR_CATEGORY; exportSummaryToBigQuery:true; numEvents:1000000
  0005  query:HOT_ITEMS; exportSummaryToBigQuery:true; numEvents:10000000
  0006  query:AVERAGE_SELLING_PRICE_BY_SELLER; exportSummaryToBigQuery:true; numEvents:1000000
  0007  query:HIGHEST_BID; exportSummaryToBigQuery:true; numEvents:10000000
  0008  query:MONITOR_NEW_USERS; exportSummaryToBigQuery:true; numEvents:10000000
  0009  query:WINNING_BIDS; exportSummaryToBigQuery:true; numEvents:1000000
  0010  query:LOG_TO_SHARDED_FILES; exportSummaryToBigQuery:true; numEvents:10000000
  0011  query:USER_SESSIONS; exportSummaryToBigQuery:true; numEvents:10000000
  0012  query:PROCESSING_TIME_WINDOWS; exportSummaryToBigQuery:true; numEvents:10000000
  0013  query:BOUNDED_SIDE_INPUT_JOIN; exportSummaryToBigQuery:true; numEvents:10000000
  0014  query:SESSION_SIDE_INPUT_JOIN; exportSummaryToBigQuery:true; numEvents:10000000
Exception in thread "main" 
Performance:
  Conf  Runtime(sec)    (Baseline)  Events(/sec)    (Baseline)       Results    (Baseline)
  0000          -1.0                        -1.0                          -1             

        *** Job was unexpectedly updated ***
  0001          -1.0                        -1.0                          -1             

        *** Job was unexpectedly updated ***
  0002          -1.0                        -1.0                          -1             

        *** Job was unexpectedly updated ***
  0003          -1.0                        -1.0                          -1             

        *** Job was unexpectedly updated ***
  0004          -1.0                        -1.0                          -1             

        *** Job was unexpectedly updated ***
  0005          -1.0                        -1.0                          -1             

        *** Job was unexpectedly updated ***
  0006          -1.0                        -1.0                          -1             

        *** Job was unexpectedly updated ***
  0007          -1.0                        -1.0                          -1             

        *** Job was unexpectedly updated ***
  0008          -1.0                        -1.0                          -1             

        *** Job was unexpectedly updated ***
  0009          -1.0                        -1.0                          -1             

        *** Job was unexpectedly updated ***
  0010          -1.0                        -1.0                          -1             

        *** Job was unexpectedly updated ***
  0011          -1.0                        -1.0                          -1             

        *** Job was unexpectedly updated ***
  0012          -1.0                        -1.0                          -1             

        *** Job was unexpectedly updated ***
  0013          -1.0                        -1.0                          -1             

        *** Job was unexpectedly updated ***
  0014          -1.0                        -1.0                          -1             

        *** Job was unexpectedly updated ***
==========================================================================================

java.lang.RuntimeException: Execution was not successful
	at org.apache.beam.sdk.nexmark.Main.runAll(Main.java:170)
	at org.apache.beam.sdk.nexmark.Main.main(Main.java:415)

> Task :sdks:java:testing:nexmark:run FAILED

FAILURE: Build failed with an exception.

* What went wrong:
Execution failed for task ':sdks:java:testing:nexmark:run'.
> Process 'command '/usr/lib/jvm/java-8-openjdk-amd64/bin/java'' finished with non-zero
exit value 1

* Try:
Run with --stacktrace option to get the stack trace. Run with --info or --debug option to
get more log output. Run with --scan to get full insights.

* Get more help at https://help.gradle.org

Deprecated Gradle features were used in this build, making it incompatible with Gradle 6.0.
Use '--warning-mode all' to show the individual deprecation warnings.
See https://docs.gradle.org/5.2.1/userguide/command_line_interface.html#sec:command_line_warnings

BUILD FAILED in 33s
76 actionable tasks: 2 executed, 74 up-to-date

Publishing build scan...
https://gradle.com/s/mn5kasx3msy3c

Build step 'Invoke Gradle script' changed build result to FAILURE
Build step 'Invoke Gradle script' marked build as failure

---------------------------------------------------------------------
To unsubscribe, e-mail: builds-unsubscribe@beam.apache.org
For additional commands, e-mail: builds-help@beam.apache.org


Mime
View raw message