beam-builds mailing list archives

Site index · List index
Message view « Date » · « Thread »
Top « Date » · « Thread »
From Apache Jenkins Server <jenk...@builds.apache.org>
Subject Build failed in Jenkins: beam_PostCommit_Py_VR_Dataflow #4018
Date Mon, 15 Jul 2019 06:47:46 GMT
See <https://builds.apache.org/job/beam_PostCommit_Py_VR_Dataflow/4018/display/redirect>

------------------------------------------
[...truncated 166.44 KB...]
> Task :sdks:python:validatesRunnerBatchTests
test_multi_valued_singleton_side_input (apache_beam.transforms.sideinputs_test.SideInputsTest)
... ok

----------------------------------------------------------------------
XML: <https://builds.apache.org/job/beam_PostCommit_Py_VR_Dataflow/ws/src/sdks/python/nosetests.xml>
----------------------------------------------------------------------
Ran 17 tests in 1344.792s

OK
Found: https://console.cloud.google.com/dataflow/jobsDetail/locations/us-central1/jobs/2019-07-14_23_01_28-10149049084641384505?project=apache-beam-testing.
Found: https://console.cloud.google.com/dataflow/jobsDetail/locations/us-central1/jobs/2019-07-14_23_08_38-12494675144501712131?project=apache-beam-testing.
Found: https://console.cloud.google.com/dataflow/jobsDetail/locations/us-central1/jobs/2019-07-14_23_16_18-11826139512530191670?project=apache-beam-testing.
Found: https://console.cloud.google.com/dataflow/jobsDetail/locations/us-central1/jobs/2019-07-14_23_01_25-16576144461738754090?project=apache-beam-testing.
Found: https://console.cloud.google.com/dataflow/jobsDetail/locations/us-central1/jobs/2019-07-14_23_08_35-7590452408303162340?project=apache-beam-testing.
Found: https://console.cloud.google.com/dataflow/jobsDetail/locations/us-central1/jobs/2019-07-14_23_01_27-12442582711912763138?project=apache-beam-testing.
Found: https://console.cloud.google.com/dataflow/jobsDetail/locations/us-central1/jobs/2019-07-14_23_10_57-15813656792419795698?project=apache-beam-testing.
Found: https://console.cloud.google.com/dataflow/jobsDetail/locations/us-central1/jobs/2019-07-14_23_01_28-4397127701779518434?project=apache-beam-testing.
Found: https://console.cloud.google.com/dataflow/jobsDetail/locations/us-central1/jobs/2019-07-14_23_09_33-17290831791020481028?project=apache-beam-testing.
Found: https://console.cloud.google.com/dataflow/jobsDetail/locations/us-central1/jobs/2019-07-14_23_01_28-11632973803556542315?project=apache-beam-testing.
Found: https://console.cloud.google.com/dataflow/jobsDetail/locations/us-central1/jobs/2019-07-14_23_11_01-2299661191449904623?project=apache-beam-testing.
Found: https://console.cloud.google.com/dataflow/jobsDetail/locations/us-central1/jobs/2019-07-14_23_01_28-18271305651783866998?project=apache-beam-testing.
Found: https://console.cloud.google.com/dataflow/jobsDetail/locations/us-central1/jobs/2019-07-14_23_09_34-16759676730103901017?project=apache-beam-testing.
Found: https://console.cloud.google.com/dataflow/jobsDetail/locations/us-central1/jobs/2019-07-14_23_01_27-4560957684686057479?project=apache-beam-testing.
Found: https://console.cloud.google.com/dataflow/jobsDetail/locations/us-central1/jobs/2019-07-14_23_09_41-13443150000539561410?project=apache-beam-testing.
Found: https://console.cloud.google.com/dataflow/jobsDetail/locations/us-central1/jobs/2019-07-14_23_01_29-2378550311809303891?project=apache-beam-testing.
Found: https://console.cloud.google.com/dataflow/jobsDetail/locations/us-central1/jobs/2019-07-14_23_09_34-3189654438669136544?project=apache-beam-testing.

> Task :sdks:python:validatesRunnerStreamingTests
>>> RUNNING integration tests with pipeline options: --runner=TestDataflowRunner
--project=apache-beam-testing --staging_location=gs://temp-storage-for-end-to-end-tests/staging-it
--temp_location=gs://temp-storage-for-end-to-end-tests/temp-it --output=gs://temp-storage-for-end-to-end-tests/py-it-cloud/output
--sdk_location=build/apache-beam.tar.gz --requirements_file=postcommit_requirements.txt --num_workers=1
--sleep_secs=20 --streaming --dataflow_worker_jar=<https://builds.apache.org/job/beam_PostCommit_Py_VR_Dataflow/ws/src/runners/google-cloud-dataflow-java/worker/build/libs/beam-runners-google-cloud-dataflow-java-fn-api-worker-2.15.0-SNAPSHOT.jar>
--kms_key_name=projects/apache-beam-testing/locations/global/keyRings/beam-it/cryptoKeys/test
--dataflow_kms_key=projects/apache-beam-testing/locations/global/keyRings/beam-it/cryptoKeys/test
>>>   test options: --nocapture --processes=8 --process-timeout=4500 --attr=ValidatesRunner,!sickbay-streaming
<https://builds.apache.org/job/beam_PostCommit_Py_VR_Dataflow/ws/src/build/gradleenv/1922375555/local/lib/python2.7/site-packages/setuptools/dist.py>:472:
UserWarning: Normalizing '2.15.0.dev' to '2.15.0.dev0'
  normalized_version,
running nosetests
running egg_info
writing requirements to apache_beam.egg-info/requires.txt
writing apache_beam.egg-info/PKG-INFO
writing top-level names to apache_beam.egg-info/top_level.txt
writing dependency_links to apache_beam.egg-info/dependency_links.txt
writing entry points to apache_beam.egg-info/entry_points.txt
reading manifest file 'apache_beam.egg-info/SOURCES.txt'
reading manifest template 'MANIFEST.in'
warning: no files found matching 'README.md'
warning: no files found matching 'NOTICE'
warning: no files found matching 'LICENSE'
writing manifest file 'apache_beam.egg-info/SOURCES.txt'

> Task :sdks:python:test-suites:dataflow:py37:validatesRunnerBatchTests
Found: https://console.cloud.google.com/dataflow/jobsDetail/locations/us-central1/jobs/2019-07-14_23_01_26-17438188586436928222?project=apache-beam-testing.
Found: https://console.cloud.google.com/dataflow/jobsDetail/locations/us-central1/jobs/2019-07-14_23_09_32-17759282690270130747?project=apache-beam-testing.
Found: https://console.cloud.google.com/dataflow/jobsDetail/locations/us-central1/jobs/2019-07-14_23_01_27-5783121953813118973?project=apache-beam-testing.
Found: https://console.cloud.google.com/dataflow/jobsDetail/locations/us-central1/jobs/2019-07-14_23_11_14-12998367001617241731?project=apache-beam-testing.
Found: https://console.cloud.google.com/dataflow/jobsDetail/locations/us-central1/jobs/2019-07-14_23_01_28-4067165764499285473?project=apache-beam-testing.
Found: https://console.cloud.google.com/dataflow/jobsDetail/locations/us-central1/jobs/2019-07-14_23_11_02-6882113335055588990?project=apache-beam-testing.
Found: https://console.cloud.google.com/dataflow/jobsDetail/locations/us-central1/jobs/2019-07-14_23_01_27-2268813078922613935?project=apache-beam-testing.
Found: https://console.cloud.google.com/dataflow/jobsDetail/locations/us-central1/jobs/2019-07-14_23_10_23-1880908031700760967?project=apache-beam-testing.
Found: https://console.cloud.google.com/dataflow/jobsDetail/locations/us-central1/jobs/2019-07-14_23_01_28-7607395361062607311?project=apache-beam-testing.
Found: https://console.cloud.google.com/dataflow/jobsDetail/locations/us-central1/jobs/2019-07-14_23_11_28-15570045299987147461?project=apache-beam-testing.
Found: https://console.cloud.google.com/dataflow/jobsDetail/locations/us-central1/jobs/2019-07-14_23_01_25-10969200444409331718?project=apache-beam-testing.
Found: https://console.cloud.google.com/dataflow/jobsDetail/locations/us-central1/jobs/2019-07-14_23_11_00-4978155453139653224?project=apache-beam-testing.
Found: https://console.cloud.google.com/dataflow/jobsDetail/locations/us-central1/jobs/2019-07-14_23_19_05-6979746520444781614?project=apache-beam-testing.
Found: https://console.cloud.google.com/dataflow/jobsDetail/locations/us-central1/jobs/2019-07-14_23_01_27-1715393220526800364?project=apache-beam-testing.
Found: https://console.cloud.google.com/dataflow/jobsDetail/locations/us-central1/jobs/2019-07-14_23_11_27-12652614528601854812?project=apache-beam-testing.
Found: https://console.cloud.google.com/dataflow/jobsDetail/locations/us-central1/jobs/2019-07-14_23_01_27-3328086437061930651?project=apache-beam-testing.
Found: https://console.cloud.google.com/dataflow/jobsDetail/locations/us-central1/jobs/2019-07-14_23_09_27-13572593598775386301?project=apache-beam-testing.
test_as_dict_twice (apache_beam.transforms.sideinputs_test.SideInputsTest) ... ok
test_dofn_lifecycle (apache_beam.transforms.dofn_lifecycle_test.DoFnLifecycleTest) ... ok
test_par_do_with_multiple_outputs_and_using_return (apache_beam.transforms.ptransform_test.PTransformTest)
... ok
test_read_metrics (apache_beam.transforms.ptransform_test.PTransformTest) ... ok
test_multiple_empty_outputs (apache_beam.transforms.ptransform_test.PTransformTest) ... ok
test_flatten_multiple_pcollections_having_multiple_consumers (apache_beam.transforms.ptransform_test.PTransformTest)
... ok
test_undeclared_outputs (apache_beam.transforms.ptransform_test.PTransformTest) ... ok
test_par_do_with_multiple_outputs_and_using_yield (apache_beam.transforms.ptransform_test.PTransformTest)
... ok
test_as_singleton_without_unique_labels (apache_beam.transforms.sideinputs_test.SideInputsTest)
... ok
test_as_singleton_with_different_defaults (apache_beam.transforms.sideinputs_test.SideInputsTest)
... ok
test_as_list_and_as_dict_side_inputs (apache_beam.transforms.sideinputs_test.SideInputsTest)
... ok
test_default_value_singleton_side_input (apache_beam.transforms.sideinputs_test.SideInputsTest)
... ok
test_as_list_twice (apache_beam.transforms.sideinputs_test.SideInputsTest) ... ok
test_flattened_side_input (apache_beam.transforms.sideinputs_test.SideInputsTest) ... ok
test_iterable_side_input (apache_beam.transforms.sideinputs_test.SideInputsTest) ... ok
test_empty_singleton_side_input (apache_beam.transforms.sideinputs_test.SideInputsTest) ...
ok
test_multi_valued_singleton_side_input (apache_beam.transforms.sideinputs_test.SideInputsTest)
... ok

----------------------------------------------------------------------
XML: <https://builds.apache.org/job/beam_PostCommit_Py_VR_Dataflow/ws/src/sdks/python/nosetests.xml>
----------------------------------------------------------------------
Ran 17 tests in 1673.097s

OK

> Task :sdks:python:test-suites:dataflow:py37:validatesRunnerStreamingTests
>>> RUNNING integration tests with pipeline options: --runner=TestDataflowRunner
--project=apache-beam-testing --staging_location=gs://temp-storage-for-end-to-end-tests/staging-it
--temp_location=gs://temp-storage-for-end-to-end-tests/temp-it --output=gs://temp-storage-for-end-to-end-tests/py-it-cloud/output
--sdk_location=<https://builds.apache.org/job/beam_PostCommit_Py_VR_Dataflow/ws/src/sdks/python/test-suites/dataflow/py37/build/apache-beam.tar.gz>
--requirements_file=postcommit_requirements.txt --num_workers=1 --sleep_secs=20 --streaming
--dataflow_worker_jar=<https://builds.apache.org/job/beam_PostCommit_Py_VR_Dataflow/ws/src/runners/google-cloud-dataflow-java/worker/build/libs/beam-runners-google-cloud-dataflow-java-fn-api-worker-2.15.0-SNAPSHOT.jar>
--kms_key_name=projects/apache-beam-testing/locations/global/keyRings/beam-it/cryptoKeys/test
--dataflow_kms_key=projects/apache-beam-testing/locations/global/keyRings/beam-it/cryptoKeys/test
>>>   test options: --nocapture --processes=8 --process-timeout=4500 --attr=ValidatesRunner,!sickbay-streaming
running nosetests
running egg_info
writing apache_beam.egg-info/PKG-INFO
writing dependency_links to apache_beam.egg-info/dependency_links.txt
writing entry points to apache_beam.egg-info/entry_points.txt
writing requirements to apache_beam.egg-info/requires.txt
writing top-level names to apache_beam.egg-info/top_level.txt
reading manifest file 'apache_beam.egg-info/SOURCES.txt'
reading manifest template 'MANIFEST.in'
setup.py:177: UserWarning: Some syntactic constructs of Python 3 are not yet fully supported
by Apache Beam.
  'Some syntactic constructs of Python 3 are not yet fully supported by '
<https://builds.apache.org/job/beam_PostCommit_Py_VR_Dataflow/ws/src/build/gradleenv/-1734967052/lib/python3.7/site-packages/setuptools/dist.py>:472:
UserWarning: Normalizing '2.15.0.dev' to '2.15.0.dev0'
  normalized_version,
warning: no files found matching 'README.md'
warning: no files found matching 'NOTICE'
warning: no files found matching 'LICENSE'
writing manifest file 'apache_beam.egg-info/SOURCES.txt'
<https://builds.apache.org/job/beam_PostCommit_Py_VR_Dataflow/ws/src/sdks/python/apache_beam/__init__.py>:84:
UserWarning: Some syntactic constructs of Python 3 are not yet fully supported by Apache Beam.
  'Some syntactic constructs of Python 3 are not yet fully supported by '
<https://builds.apache.org/job/beam_PostCommit_Py_VR_Dataflow/ws/src/sdks/python/apache_beam/io/gcp/datastore/v1/datastoreio.py>:59:
UserWarning: Datastore IO will support Python 3 after replacing googledatastore by google-cloud-datastore,
see: BEAM-4543.
  warnings.warn('Datastore IO will support Python 3 after replacing '
<https://builds.apache.org/job/beam_PostCommit_Py_VR_Dataflow/ws/src/sdks/python/apache_beam/io/vcfio.py>:47:
UserWarning: VCF IO will support Python 3 after migration to Nucleus, see: BEAM-5628.
  warnings.warn("VCF IO will support Python 3 after migration to Nucleus, "

> Task :sdks:python:validatesRunnerStreamingTests
test_dofn_lifecycle (apache_beam.transforms.dofn_lifecycle_test.DoFnLifecycleTest) ... ok
test_multiple_empty_outputs (apache_beam.transforms.ptransform_test.PTransformTest) ... ok
test_as_dict_twice (apache_beam.transforms.sideinputs_test.SideInputsTest) ... ok
test_par_do_with_multiple_outputs_and_using_return (apache_beam.transforms.ptransform_test.PTransformTest)
... ok
test_undeclared_outputs (apache_beam.transforms.ptransform_test.PTransformTest) ... ok
test_par_do_with_multiple_outputs_and_using_yield (apache_beam.transforms.ptransform_test.PTransformTest)
... ok
test_as_list_and_as_dict_side_inputs (apache_beam.transforms.sideinputs_test.SideInputsTest)
... ok
test_flatten_multiple_pcollections_having_multiple_consumers (apache_beam.transforms.ptransform_test.PTransformTest)
... ok
test_as_list_twice (apache_beam.transforms.sideinputs_test.SideInputsTest) ... ok
test_as_singleton_with_different_defaults (apache_beam.transforms.sideinputs_test.SideInputsTest)
... ok
test_empty_singleton_side_input (apache_beam.transforms.sideinputs_test.SideInputsTest) ...
ok
test_iterable_side_input (apache_beam.transforms.sideinputs_test.SideInputsTest) ... ok
test_default_value_singleton_side_input (apache_beam.transforms.sideinputs_test.SideInputsTest)
... ok
test_as_singleton_without_unique_labels (apache_beam.transforms.sideinputs_test.SideInputsTest)
... ok
test_flattened_side_input (apache_beam.transforms.sideinputs_test.SideInputsTest) ... ok

----------------------------------------------------------------------
XML: <https://builds.apache.org/job/beam_PostCommit_Py_VR_Dataflow/ws/src/sdks/python/nosetests.xml>
----------------------------------------------------------------------
Ran 15 tests in 1038.092s

OK
Found: https://console.cloud.google.com/dataflow/jobsDetail/locations/us-central1/jobs/2019-07-14_23_23_47-11153928153763131353?project=apache-beam-testing.
Found: https://console.cloud.google.com/dataflow/jobsDetail/locations/us-central1/jobs/2019-07-14_23_23_46-7047032483908420331?project=apache-beam-testing.
Found: https://console.cloud.google.com/dataflow/jobsDetail/locations/us-central1/jobs/2019-07-14_23_31_20-10516001840846778357?project=apache-beam-testing.
Found: https://console.cloud.google.com/dataflow/jobsDetail/locations/us-central1/jobs/2019-07-14_23_23_47-4978155453139656106?project=apache-beam-testing.
Found: https://console.cloud.google.com/dataflow/jobsDetail/locations/us-central1/jobs/2019-07-14_23_31_22-11889051986872741836?project=apache-beam-testing.
Found: https://console.cloud.google.com/dataflow/jobsDetail/locations/us-central1/jobs/2019-07-14_23_23_47-2283444807124387987?project=apache-beam-testing.
Found: https://console.cloud.google.com/dataflow/jobsDetail/locations/us-central1/jobs/2019-07-14_23_32_17-12718056756569059827?project=apache-beam-testing.
Found: https://console.cloud.google.com/dataflow/jobsDetail/locations/us-central1/jobs/2019-07-14_23_23_46-3079144754630455531?project=apache-beam-testing.
Found: https://console.cloud.google.com/dataflow/jobsDetail/locations/us-central1/jobs/2019-07-14_23_31_31-608663736791372982?project=apache-beam-testing.
Found: https://console.cloud.google.com/dataflow/jobsDetail/locations/us-central1/jobs/2019-07-14_23_23_47-12938405019155884382?project=apache-beam-testing.
Found: https://console.cloud.google.com/dataflow/jobsDetail/locations/us-central1/jobs/2019-07-14_23_31_41-12086034244170455275?project=apache-beam-testing.
Found: https://console.cloud.google.com/dataflow/jobsDetail/locations/us-central1/jobs/2019-07-14_23_23_46-7126212196954089180?project=apache-beam-testing.
Found: https://console.cloud.google.com/dataflow/jobsDetail/locations/us-central1/jobs/2019-07-14_23_32_21-2884050031770764798?project=apache-beam-testing.
Found: https://console.cloud.google.com/dataflow/jobsDetail/locations/us-central1/jobs/2019-07-14_23_23_47-9956252071826770124?project=apache-beam-testing.
Found: https://console.cloud.google.com/dataflow/jobsDetail/locations/us-central1/jobs/2019-07-14_23_31_41-13031907249172129448?project=apache-beam-testing.

> Task :sdks:python:test-suites:dataflow:py37:validatesRunnerStreamingTests
Found: https://console.cloud.google.com/dataflow/jobsDetail/locations/us-central1/jobs/2019-07-14_23_29_14-14377263729241448137?project=apache-beam-testing.
Found: https://console.cloud.google.com/dataflow/jobsDetail/locations/us-central1/jobs/2019-07-14_23_37_09-13860764739391235158?project=apache-beam-testing.
Found: https://console.cloud.google.com/dataflow/jobsDetail/locations/us-central1/jobs/2019-07-14_23_29_15-11691510371840273651?project=apache-beam-testing.
Found: https://console.cloud.google.com/dataflow/jobsDetail/locations/us-central1/jobs/2019-07-14_23_38_26-2678918227624250068?project=apache-beam-testing.
Found: https://console.cloud.google.com/dataflow/jobsDetail/locations/us-central1/jobs/2019-07-14_23_29_15-8091025878599335463?project=apache-beam-testing.
Found: https://console.cloud.google.com/dataflow/jobsDetail/locations/us-central1/jobs/2019-07-14_23_38_00-2987711105246785406?project=apache-beam-testing.
Found: https://console.cloud.google.com/dataflow/jobsDetail/locations/us-central1/jobs/2019-07-14_23_29_15-5734485823131277399?project=apache-beam-testing.
Found: https://console.cloud.google.com/dataflow/jobsDetail/locations/us-central1/jobs/2019-07-14_23_38_26-4393472297487497831?project=apache-beam-testing.
Found: https://console.cloud.google.com/dataflow/jobsDetail/locations/us-central1/jobs/2019-07-14_23_29_15-7653892484386371080?project=apache-beam-testing.
Found: https://console.cloud.google.com/dataflow/jobsDetail/locations/us-central1/jobs/2019-07-14_23_38_06-16386583717343096085?project=apache-beam-testing.
Found: https://console.cloud.google.com/dataflow/jobsDetail/locations/us-central1/jobs/2019-07-14_23_29_16-13450421026133017057?project=apache-beam-testing.
Found: https://console.cloud.google.com/dataflow/jobsDetail/locations/us-central1/jobs/2019-07-14_23_29_15-4309734816307206289?project=apache-beam-testing.
Found: https://console.cloud.google.com/dataflow/jobsDetail/locations/us-central1/jobs/2019-07-14_23_37_35-15850423723771051373?project=apache-beam-testing.
Found: https://console.cloud.google.com/dataflow/jobsDetail/locations/us-central1/jobs/2019-07-14_23_29_15-14843813739297839242?project=apache-beam-testing.
Found: https://console.cloud.google.com/dataflow/jobsDetail/locations/us-central1/jobs/2019-07-14_23_38_31-6752551822175840181?project=apache-beam-testing.
test_dofn_lifecycle (apache_beam.transforms.dofn_lifecycle_test.DoFnLifecycleTest) ... ok
test_as_dict_twice (apache_beam.transforms.sideinputs_test.SideInputsTest) ... ok
test_multiple_empty_outputs (apache_beam.transforms.ptransform_test.PTransformTest) ... ok
test_par_do_with_multiple_outputs_and_using_yield (apache_beam.transforms.ptransform_test.PTransformTest)
... ok
test_par_do_with_multiple_outputs_and_using_return (apache_beam.transforms.ptransform_test.PTransformTest)
... ok
test_flatten_multiple_pcollections_having_multiple_consumers (apache_beam.transforms.ptransform_test.PTransformTest)
... ok
test_as_list_and_as_dict_side_inputs (apache_beam.transforms.sideinputs_test.SideInputsTest)
... ok
test_undeclared_outputs (apache_beam.transforms.ptransform_test.PTransformTest) ... ok
test_as_list_twice (apache_beam.transforms.sideinputs_test.SideInputsTest) ... ok
test_as_singleton_with_different_defaults (apache_beam.transforms.sideinputs_test.SideInputsTest)
... ok
test_as_singleton_without_unique_labels (apache_beam.transforms.sideinputs_test.SideInputsTest)
... ok
test_default_value_singleton_side_input (apache_beam.transforms.sideinputs_test.SideInputsTest)
... ok
test_empty_singleton_side_input (apache_beam.transforms.sideinputs_test.SideInputsTest) ...
ok
test_iterable_side_input (apache_beam.transforms.sideinputs_test.SideInputsTest) ... ok
test_flattened_side_input (apache_beam.transforms.sideinputs_test.SideInputsTest) ... ok

----------------------------------------------------------------------
XML: <https://builds.apache.org/job/beam_PostCommit_Py_VR_Dataflow/ws/src/sdks/python/nosetests.xml>
----------------------------------------------------------------------
Ran 15 tests in 1119.771s

OK

FAILURE: Build completed with 3 failures.

1: Task failed with an exception.
-----------
* Where:
Build file '<https://builds.apache.org/job/beam_PostCommit_Py_VR_Dataflow/ws/src/sdks/python/test-suites/dataflow/py36/build.gradle'>
line: 67

* What went wrong:
Execution failed for task ':sdks:python:test-suites:dataflow:py36:validatesRunnerBatchTests'.
> Process 'command 'sh'' finished with non-zero exit value 1

* Try:
Run with --stacktrace option to get the stack trace. Run with --info or --debug option to
get more log output. Run with --scan to get full insights.
==============================================================================

2: Task failed with an exception.
-----------
* Where:
Build file '<https://builds.apache.org/job/beam_PostCommit_Py_VR_Dataflow/ws/src/sdks/python/test-suites/dataflow/py35/build.gradle'>
line: 67

* What went wrong:
Execution failed for task ':sdks:python:test-suites:dataflow:py35:validatesRunnerBatchTests'.
> Process 'command 'sh'' finished with non-zero exit value 1

* Try:
Run with --stacktrace option to get the stack trace. Run with --info or --debug option to
get more log output. Run with --scan to get full insights.
==============================================================================

3: Task failed with an exception.
-----------
* Where:
Build file '<https://builds.apache.org/job/beam_PostCommit_Py_VR_Dataflow/ws/src/sdks/python/test-suites/dataflow/py36/build.gradle'>
line: 87

* What went wrong:
Execution failed for task ':sdks:python:test-suites:dataflow:py36:validatesRunnerStreamingTests'.
> Process 'command 'sh'' finished with non-zero exit value 1

* Try:
Run with --stacktrace option to get the stack trace. Run with --info or --debug option to
get more log output. Run with --scan to get full insights.
==============================================================================

* Get more help at https://help.gradle.org

Deprecated Gradle features were used in this build, making it incompatible with Gradle 6.0.
Use '--warning-mode all' to show the individual deprecation warnings.
See https://docs.gradle.org/5.2.1/userguide/command_line_interface.html#sec:command_line_warnings

BUILD FAILED in 47m 34s
76 actionable tasks: 59 executed, 17 from cache

Publishing build scan...
https://gradle.com/s/b2mktrmyiuvkg

Build step 'Invoke Gradle script' changed build result to FAILURE
Build step 'Invoke Gradle script' marked build as failure

---------------------------------------------------------------------
To unsubscribe, e-mail: builds-unsubscribe@beam.apache.org
For additional commands, e-mail: builds-help@beam.apache.org


Mime
View raw message