beam-builds mailing list archives

Site index · List index
Message view « Date » · « Thread »
Top « Date » · « Thread »
From Apache Jenkins Server <jenk...@builds.apache.org>
Subject Build failed in Jenkins: beam_PostCommit_Python3_Verify #1364
Date Mon, 15 Jul 2019 21:31:21 GMT
See <https://builds.apache.org/job/beam_PostCommit_Python3_Verify/1364/display/redirect?page=changes>

Changes:

[ankurgoenka] [BEAM-7546] Increasing environment cache to avoid chances of recreating

------------------------------------------
[...truncated 699.11 KB...]
    "code": 503,
    "message": "Deadline exceeded",
    "status": "UNAVAILABLE"
  }
}
>
--------------------- >> end captured logging << ---------------------
Found: https://console.cloud.google.com/dataflow/jobsDetail/locations/us-central1/jobs/2019-07-15_13_34_13-2748330969440849272?project=apache-beam-testing.
<https://builds.apache.org/job/beam_PostCommit_Python3_Verify/ws/src/sdks/python/apache_beam/io/gcp/bigquery.py>:1140:
BeamDeprecationWarning: options is deprecated since First stable release. References to <pipeline>.options
will not be supported
Found: https://console.cloud.google.com/dataflow/jobsDetail/locations/us-central1/jobs/2019-07-15_13_49_28-4087992693309800046?project=apache-beam-testing.
Found: https://console.cloud.google.com/dataflow/jobsDetail/locations/us-central1/jobs/2019-07-15_13_59_24-11174598040377849037?project=apache-beam-testing.
  method_to_use = self._compute_method(p, p.options)
Exception in thread Thread-8:
Traceback (most recent call last):
  File "/usr/lib/python3.6/threading.py", line 916, in _bootstrap_inner
    self.run()
Found: https://console.cloud.google.com/dataflow/jobsDetail/locations/us-central1/jobs/2019-07-15_14_04_38-615844699770333321?project=apache-beam-testing.
  File "/usr/lib/python3.6/threading.py", line 864, in run
    self._target(*self._args, **self._kwargs)
  File "<https://builds.apache.org/job/beam_PostCommit_Python3_Verify/ws/src/sdks/python/apache_beam/runners/dataflow/dataflow_runner.py",>
line 157, in poll_for_job_completion
    response = runner.dataflow_client.get_job(job_id)
  File "<https://builds.apache.org/job/beam_PostCommit_Python3_Verify/ws/src/sdks/python/apache_beam/utils/retry.py",>
line 197, in wrapper
    return fun(*args, **kwargs)
  File "<https://builds.apache.org/job/beam_PostCommit_Python3_Verify/ws/src/sdks/python/apache_beam/runners/dataflow/internal/apiclient.py",>
line 663, in get_job
    response = self._client.projects_locations_jobs.Get(request)
  File "<https://builds.apache.org/job/beam_PostCommit_Python3_Verify/ws/src/sdks/python/apache_beam/runners/dataflow/internal/clients/dataflow/dataflow_v1b3_client.py",>
line 689, in Get
    config, request, global_params=global_params)
  File "<https://builds.apache.org/job/beam_PostCommit_Python3_Verify/ws/src/build/gradleenv/-1734967053/lib/python3.6/site-packages/apitools/base/py/base_api.py",>
line 731, in _RunMethod
    return self.ProcessHttpResponse(method_config, http_response, request)
  File "<https://builds.apache.org/job/beam_PostCommit_Python3_Verify/ws/src/build/gradleenv/-1734967053/lib/python3.6/site-packages/apitools/base/py/base_api.py",>
line 737, in ProcessHttpResponse
    self.__ProcessHttpResponse(method_config, http_response, request))
  File "<https://builds.apache.org/job/beam_PostCommit_Python3_Verify/ws/src/build/gradleenv/-1734967053/lib/python3.6/site-packages/apitools/base/py/base_api.py",>
line 604, in __ProcessHttpResponse
    http_response, method_config=method_config, request=request)
apitools.base.py.exceptions.HttpNotFoundError: HttpError accessing <https://dataflow.googleapis.com/v1b3/projects/apache-beam-testing/locations/us-central1/jobs/2019-07-15_13_59_24-11174598040377849037?alt=json>:
response: <{'vary': 'Origin, X-Origin, Referer', 'content-type': 'application/json; charset=UTF-8',
'date': 'Mon, 15 Jul 2019 21:00:21 GMT', 'server': 'ESF', 'cache-control': 'private', 'x-xss-protection':
'0', 'x-frame-options': 'SAMEORIGIN', 'x-content-type-options': 'nosniff', 'transfer-encoding':
'chunked', 'status': '404', 'content-length': '280', '-content-encoding': 'gzip'}>, content
<{
  "error": {
    "code": 404,
    "message": "(fe25c0403e5eea40): Information about job 2019-07-15_13_59_24-11174598040377849037
could not be found in our system. Please double check the id is correct. If it is please contact
customer support.",
    "status": "NOT_FOUND"
  }
}
>

Found: https://console.cloud.google.com/dataflow/jobsDetail/locations/us-central1/jobs/2019-07-15_13_34_10-10596417930770503803?project=apache-beam-testing.
<https://builds.apache.org/job/beam_PostCommit_Python3_Verify/ws/src/sdks/python/apache_beam/runners/dataflow/dataflow_runner.py>:686:
BeamDeprecationWarning: BigQuerySink is deprecated since 2.11.0. Use WriteToBigQuery instead.
  kms_key=transform.kms_key))
Found: https://console.cloud.google.com/dataflow/jobsDetail/locations/us-central1/jobs/2019-07-15_14_00_04-7277965286047133199?project=apache-beam-testing.
<https://builds.apache.org/job/beam_PostCommit_Python3_Verify/ws/src/sdks/python/apache_beam/io/fileio_test.py>:232:
FutureWarning: MatchAll is experimental.
Found: https://console.cloud.google.com/dataflow/jobsDetail/locations/us-central1/jobs/2019-07-15_14_05_12-17751360663461478196?project=apache-beam-testing.
  | 'GetPath' >> beam.Map(lambda metadata: metadata.path))
Found: https://console.cloud.google.com/dataflow/jobsDetail/locations/us-central1/jobs/2019-07-15_14_14_42-1748767667365391987?project=apache-beam-testing.
<https://builds.apache.org/job/beam_PostCommit_Python3_Verify/ws/src/sdks/python/apache_beam/io/fileio_test.py>:243:
FutureWarning: MatchAll is experimental.
  | 'Checksums' >> beam.Map(compute_hash))
<https://builds.apache.org/job/beam_PostCommit_Python3_Verify/ws/src/sdks/python/apache_beam/io/fileio_test.py>:243:
FutureWarning: ReadMatches is experimental.
  | 'Checksums' >> beam.Map(compute_hash))
Exception in thread Thread-2:
Traceback (most recent call last):
  File "/usr/lib/python3.6/threading.py", line 916, in _bootstrap_inner
    self.run()
  File "/usr/lib/python3.6/threading.py", line 864, in run
    self._target(*self._args, **self._kwargs)
  File "<https://builds.apache.org/job/beam_PostCommit_Python3_Verify/ws/src/sdks/python/apache_beam/runners/dataflow/dataflow_runner.py",>
line 157, in poll_for_job_completion
    response = runner.dataflow_client.get_job(job_id)
  File "<https://builds.apache.org/job/beam_PostCommit_Python3_Verify/ws/src/sdks/python/apache_beam/utils/retry.py",>
line 197, in wrapper
    return fun(*args, **kwargs)
  File "<https://builds.apache.org/job/beam_PostCommit_Python3_Verify/ws/src/sdks/python/apache_beam/runners/dataflow/internal/apiclient.py",>
line 663, in get_job
    response = self._client.projects_locations_jobs.Get(request)
  File "<https://builds.apache.org/job/beam_PostCommit_Python3_Verify/ws/src/sdks/python/apache_beam/runners/dataflow/internal/clients/dataflow/dataflow_v1b3_client.py",>
line 689, in Get
    config, request, global_params=global_params)
  File "<https://builds.apache.org/job/beam_PostCommit_Python3_Verify/ws/src/build/gradleenv/-1734967053/lib/python3.6/site-packages/apitools/base/py/base_api.py",>
line 731, in _RunMethod
    return self.ProcessHttpResponse(method_config, http_response, request)
  File "<https://builds.apache.org/job/beam_PostCommit_Python3_Verify/ws/src/build/gradleenv/-1734967053/lib/python3.6/site-packages/apitools/base/py/base_api.py",>
line 737, in ProcessHttpResponse
    self.__ProcessHttpResponse(method_config, http_response, request))
  File "<https://builds.apache.org/job/beam_PostCommit_Python3_Verify/ws/src/build/gradleenv/-1734967053/lib/python3.6/site-packages/apitools/base/py/base_api.py",>
line 604, in __ProcessHttpResponse
    http_response, method_config=method_config, request=request)
apitools.base.py.exceptions.HttpNotFoundError: HttpError accessing <https://dataflow.googleapis.com/v1b3/projects/apache-beam-testing/locations/us-central1/jobs/2019-07-15_14_00_04-7277965286047133199?alt=json>:
response: <{'vary': 'Origin, X-Origin, Referer', 'content-type': 'application/json; charset=UTF-8',
'date': 'Mon, 15 Jul 2019 21:01:48 GMT', 'server': 'ESF', 'cache-control': 'private', 'x-xss-protection':
'0', 'x-frame-options': 'SAMEORIGIN', 'x-content-type-options': 'nosniff', 'transfer-encoding':
'chunked', 'status': '404', 'content-length': '279', '-content-encoding': 'gzip'}>, content
<{
  "error": {
    "code": 404,
    "message": "(2105b0c88aab7081): Information about job 2019-07-15_14_00_04-7277965286047133199
could not be found in our system. Please double check the id is correct. If it is please contact
customer support.",
    "status": "NOT_FOUND"
  }
}
>

Found: https://console.cloud.google.com/dataflow/jobsDetail/locations/us-central1/jobs/2019-07-15_13_34_09-4074325465559482877?project=apache-beam-testing.
<https://builds.apache.org/job/beam_PostCommit_Python3_Verify/ws/src/sdks/python/apache_beam/io/gcp/bigquery.py>:1140:
BeamDeprecationWarning: options is deprecated since First stable release. References to <pipeline>.options
will not be supported
Found: https://console.cloud.google.com/dataflow/jobsDetail/locations/us-central1/jobs/2019-07-15_13_48_55-15304949438228004625?project=apache-beam-testing.
  method_to_use = self._compute_method(p, p.options)
Exception in thread Thread-13:
Traceback (most recent call last):
Found: https://console.cloud.google.com/dataflow/jobsDetail/locations/us-central1/jobs/2019-07-15_13_58_17-13906717044814748560?project=apache-beam-testing.
  File "/usr/lib/python3.6/threading.py", line 916, in _bootstrap_inner
    self.run()
Found: https://console.cloud.google.com/dataflow/jobsDetail/locations/us-central1/jobs/2019-07-15_14_07_27-12126685002566637518?project=apache-beam-testing.
  File "/usr/lib/python3.6/threading.py", line 864, in run
    self._target(*self._args, **self._kwargs)
  File "<https://builds.apache.org/job/beam_PostCommit_Python3_Verify/ws/src/sdks/python/apache_beam/runners/dataflow/dataflow_runner.py",>
line 157, in poll_for_job_completion
    response = runner.dataflow_client.get_job(job_id)
  File "<https://builds.apache.org/job/beam_PostCommit_Python3_Verify/ws/src/sdks/python/apache_beam/utils/retry.py",>
line 197, in wrapper
    return fun(*args, **kwargs)
  File "<https://builds.apache.org/job/beam_PostCommit_Python3_Verify/ws/src/sdks/python/apache_beam/runners/dataflow/internal/apiclient.py",>
line 663, in get_job
    response = self._client.projects_locations_jobs.Get(request)
  File "<https://builds.apache.org/job/beam_PostCommit_Python3_Verify/ws/src/sdks/python/apache_beam/runners/dataflow/internal/clients/dataflow/dataflow_v1b3_client.py",>
line 689, in Get
    config, request, global_params=global_params)
  File "<https://builds.apache.org/job/beam_PostCommit_Python3_Verify/ws/src/build/gradleenv/-1734967053/lib/python3.6/site-packages/apitools/base/py/base_api.py",>
line 731, in _RunMethod
    return self.ProcessHttpResponse(method_config, http_response, request)
  File "<https://builds.apache.org/job/beam_PostCommit_Python3_Verify/ws/src/build/gradleenv/-1734967053/lib/python3.6/site-packages/apitools/base/py/base_api.py",>
line 737, in ProcessHttpResponse
    self.__ProcessHttpResponse(method_config, http_response, request))
  File "<https://builds.apache.org/job/beam_PostCommit_Python3_Verify/ws/src/build/gradleenv/-1734967053/lib/python3.6/site-packages/apitools/base/py/base_api.py",>
line 604, in __ProcessHttpResponse
    http_response, method_config=method_config, request=request)
apitools.base.py.exceptions.HttpNotFoundError: HttpError accessing <https://dataflow.googleapis.com/v1b3/projects/apache-beam-testing/locations/us-central1/jobs/2019-07-15_13_58_17-13906717044814748560?alt=json>:
response: <{'vary': 'Origin, X-Origin, Referer', 'content-type': 'application/json; charset=UTF-8',
'date': 'Mon, 15 Jul 2019 21:01:42 GMT', 'server': 'ESF', 'cache-control': 'private', 'x-xss-protection':
'0', 'x-frame-options': 'SAMEORIGIN', 'x-content-type-options': 'nosniff', 'transfer-encoding':
'chunked', 'status': '404', 'content-length': '280', '-content-encoding': 'gzip'}>, content
<{
  "error": {
    "code": 404,
    "message": "(678f9943c509ff31): Information about job 2019-07-15_13_58_17-13906717044814748560
could not be found in our system. Please double check the id is correct. If it is please contact
customer support.",
    "status": "NOT_FOUND"
  }
}
>

Found: https://console.cloud.google.com/dataflow/jobsDetail/locations/us-central1/jobs/2019-07-15_13_34_07-9004523324893492702?project=apache-beam-testing.
Found: https://console.cloud.google.com/dataflow/jobsDetail/locations/us-central1/jobs/2019-07-15_13_57_28-18334043715024226238?project=apache-beam-testing.
<https://builds.apache.org/job/beam_PostCommit_Python3_Verify/ws/src/sdks/python/apache_beam/runners/dataflow/dataflow_runner.py>:686:
BeamDeprecationWarning: BigQuerySink is deprecated since 2.11.0. Use WriteToBigQuery instead.
  kms_key=transform.kms_key))
Found: https://console.cloud.google.com/dataflow/jobsDetail/locations/us-central1/jobs/2019-07-15_14_07_40-14148828240002570050?project=apache-beam-testing.
Found: https://console.cloud.google.com/dataflow/jobsDetail/locations/us-central1/jobs/2019-07-15_14_17_32-841627303778574064?project=apache-beam-testing.
Found: https://console.cloud.google.com/dataflow/jobsDetail/locations/us-central1/jobs/2019-07-15_13_34_11-18441051954717508481?project=apache-beam-testing.
<https://builds.apache.org/job/beam_PostCommit_Python3_Verify/ws/src/sdks/python/apache_beam/io/gcp/bigquery.py>:1140:
BeamDeprecationWarning: options is deprecated since First stable release. References to <pipeline>.options
will not be supported
  method_to_use = self._compute_method(p, p.options)
Found: https://console.cloud.google.com/dataflow/jobsDetail/locations/us-central1/jobs/2019-07-15_13_44_02-14334618274976561980?project=apache-beam-testing.
Found: https://console.cloud.google.com/dataflow/jobsDetail/locations/us-central1/jobs/2019-07-15_13_54_54-15226142334993829296?project=apache-beam-testing.
<https://builds.apache.org/job/beam_PostCommit_Python3_Verify/ws/src/sdks/python/apache_beam/io/gcp/bigquery_file_loads.py>:557:
BeamDeprecationWarning: options is deprecated since First stable release. References to <pipeline>.options
will not be supported
Found: https://console.cloud.google.com/dataflow/jobsDetail/locations/us-central1/jobs/2019-07-15_14_03_58-10311582230082828709?project=apache-beam-testing.
  temp_location = p.options.view_as(GoogleCloudOptions).temp_location
Found: https://console.cloud.google.com/dataflow/jobsDetail/locations/us-central1/jobs/2019-07-15_13_34_06-2877512301953450693?project=apache-beam-testing.
Found: https://console.cloud.google.com/dataflow/jobsDetail/locations/us-central1/jobs/2019-07-15_13_44_48-8440473175578534966?project=apache-beam-testing.
<https://builds.apache.org/job/beam_PostCommit_Python3_Verify/ws/src/sdks/python/apache_beam/runners/dataflow/dataflow_runner.py>:686:
BeamDeprecationWarning: BigQuerySink is deprecated since 2.11.0. Use WriteToBigQuery instead.
Found: https://console.cloud.google.com/dataflow/jobsDetail/locations/us-central1/jobs/2019-07-15_13_54_50-14796381776467043442?project=apache-beam-testing.
  kms_key=transform.kms_key))
Exception in thread Thread-3:
Traceback (most recent call last):
Found: https://console.cloud.google.com/dataflow/jobsDetail/locations/us-central1/jobs/2019-07-15_14_02_47-15578659434726346930?project=apache-beam-testing.
Found: https://console.cloud.google.com/dataflow/jobsDetail/locations/us-central1/jobs/2019-07-15_14_12_10-4242382166623498383?project=apache-beam-testing.
  File "/usr/lib/python3.6/threading.py", line 916, in _bootstrap_inner
    self.run()
  File "/usr/lib/python3.6/threading.py", line 864, in run
    self._target(*self._args, **self._kwargs)
  File "<https://builds.apache.org/job/beam_PostCommit_Python3_Verify/ws/src/sdks/python/apache_beam/runners/dataflow/dataflow_runner.py",>
line 157, in poll_for_job_completion
    response = runner.dataflow_client.get_job(job_id)
  File "<https://builds.apache.org/job/beam_PostCommit_Python3_Verify/ws/src/sdks/python/apache_beam/utils/retry.py",>
line 197, in wrapper
    return fun(*args, **kwargs)
  File "<https://builds.apache.org/job/beam_PostCommit_Python3_Verify/ws/src/sdks/python/apache_beam/runners/dataflow/internal/apiclient.py",>
line 663, in get_job
    response = self._client.projects_locations_jobs.Get(request)
  File "<https://builds.apache.org/job/beam_PostCommit_Python3_Verify/ws/src/sdks/python/apache_beam/runners/dataflow/internal/clients/dataflow/dataflow_v1b3_client.py",>
line 689, in Get
    config, request, global_params=global_params)
  File "<https://builds.apache.org/job/beam_PostCommit_Python3_Verify/ws/src/build/gradleenv/-1734967053/lib/python3.6/site-packages/apitools/base/py/base_api.py",>
line 731, in _RunMethod
    return self.ProcessHttpResponse(method_config, http_response, request)
  File "<https://builds.apache.org/job/beam_PostCommit_Python3_Verify/ws/src/build/gradleenv/-1734967053/lib/python3.6/site-packages/apitools/base/py/base_api.py",>
line 737, in ProcessHttpResponse
    self.__ProcessHttpResponse(method_config, http_response, request))
  File "<https://builds.apache.org/job/beam_PostCommit_Python3_Verify/ws/src/build/gradleenv/-1734967053/lib/python3.6/site-packages/apitools/base/py/base_api.py",>
line 604, in __ProcessHttpResponse
    http_response, method_config=method_config, request=request)
apitools.base.py.exceptions.HttpNotFoundError: HttpError accessing <https://dataflow.googleapis.com/v1b3/projects/apache-beam-testing/locations/us-central1/jobs/2019-07-15_13_54_50-14796381776467043442?alt=json>:
response: <{'vary': 'Origin, X-Origin, Referer', 'content-type': 'application/json; charset=UTF-8',
'date': 'Mon, 15 Jul 2019 21:01:34 GMT', 'server': 'ESF', 'cache-control': 'private', 'x-xss-protection':
'0', 'x-frame-options': 'SAMEORIGIN', 'x-content-type-options': 'nosniff', 'transfer-encoding':
'chunked', 'status': '404', 'content-length': '280', '-content-encoding': 'gzip'}>, content
<{
  "error": {
    "code": 404,
    "message": "(86646b494fcb2bfe): Information about job 2019-07-15_13_54_50-14796381776467043442
could not be found in our system. Please double check the id is correct. If it is please contact
customer support.",
    "status": "NOT_FOUND"
  }
}
>

<https://builds.apache.org/job/beam_PostCommit_Python3_Verify/ws/src/sdks/python/apache_beam/io/gcp/big_query_query_to_table_pipeline.py>:73:
BeamDeprecationWarning: BigQuerySink is deprecated since 2.11.0. Use WriteToBigQuery instead.
  kms_key=kms_key))
Found: https://console.cloud.google.com/dataflow/jobsDetail/locations/us-central1/jobs/2019-07-15_13_34_09-15669051596316880822?project=apache-beam-testing.
<https://builds.apache.org/job/beam_PostCommit_Python3_Verify/ws/src/sdks/python/apache_beam/io/gcp/bigquery.py>:1140:
BeamDeprecationWarning: options is deprecated since First stable release. References to <pipeline>.options
will not be supported
Found: https://console.cloud.google.com/dataflow/jobsDetail/locations/us-central1/jobs/2019-07-15_13_45_26-152725580490209180?project=apache-beam-testing.
Found: https://console.cloud.google.com/dataflow/jobsDetail/locations/us-central1/jobs/2019-07-15_13_56_27-5710196702105582670?project=apache-beam-testing.
  method_to_use = self._compute_method(p, p.options)
Found: https://console.cloud.google.com/dataflow/jobsDetail/locations/us-central1/jobs/2019-07-15_14_05_15-12476039522508688686?project=apache-beam-testing.
<https://builds.apache.org/job/beam_PostCommit_Python3_Verify/ws/src/sdks/python/apache_beam/io/gcp/bigquery_file_loads.py>:557:
BeamDeprecationWarning: options is deprecated since First stable release. References to <pipeline>.options
will not be supported
  temp_location = p.options.view_as(GoogleCloudOptions).temp_location
Found: https://console.cloud.google.com/dataflow/jobsDetail/locations/us-central1/jobs/2019-07-15_13_34_09-1669758744994612634?project=apache-beam-testing.
Found: https://console.cloud.google.com/dataflow/jobsDetail/locations/us-central1/jobs/2019-07-15_13_44_21-4646476649173009222?project=apache-beam-testing.
Found: https://console.cloud.google.com/dataflow/jobsDetail/locations/us-central1/jobs/2019-07-15_13_52_16-2750821415681720474?project=apache-beam-testing.
Found: https://console.cloud.google.com/dataflow/jobsDetail/locations/us-central1/jobs/2019-07-15_14_02_17-8587066764866235873?project=apache-beam-testing.
Found: https://console.cloud.google.com/dataflow/jobsDetail/locations/us-central1/jobs/2019-07-15_14_12_42-1974006278801319050?project=apache-beam-testing.
Found: https://console.cloud.google.com/dataflow/jobsDetail/locations/us-central1/jobs/2019-07-15_14_20_53-6307722895216796096?project=apache-beam-testing.

----------------------------------------------------------------------
XML: <https://builds.apache.org/job/beam_PostCommit_Python3_Verify/ws/src/sdks/python/nosetests.xml>
----------------------------------------------------------------------
Ran 42 tests in 3445.151s

FAILED (SKIP=5, failures=3)

> Task :sdks:python:test-suites:dataflow:py36:postCommitIT FAILED

FAILURE: Build completed with 3 failures.

1: Task failed with an exception.
-----------
* Where:
Build file '<https://builds.apache.org/job/beam_PostCommit_Python3_Verify/ws/src/sdks/python/test-suites/dataflow/py35/build.gradle'>
line: 48

* What went wrong:
Execution failed for task ':sdks:python:test-suites:dataflow:py35:postCommitIT'.
> Process 'command 'sh'' finished with non-zero exit value 1

* Try:
Run with --stacktrace option to get the stack trace. Run with --info or --debug option to
get more log output. Run with --scan to get full insights.
==============================================================================

2: Task failed with an exception.
-----------
* Where:
Build file '<https://builds.apache.org/job/beam_PostCommit_Python3_Verify/ws/src/sdks/python/test-suites/dataflow/py37/build.gradle'>
line: 78

* What went wrong:
Execution failed for task ':sdks:python:test-suites:dataflow:py37:postCommitIT'.
> Process 'command 'sh'' finished with non-zero exit value 1

* Try:
Run with --stacktrace option to get the stack trace. Run with --info or --debug option to
get more log output. Run with --scan to get full insights.
==============================================================================

3: Task failed with an exception.
-----------
* Where:
Build file '<https://builds.apache.org/job/beam_PostCommit_Python3_Verify/ws/src/sdks/python/test-suites/dataflow/py36/build.gradle'>
line: 48

* What went wrong:
Execution failed for task ':sdks:python:test-suites:dataflow:py36:postCommitIT'.
> Process 'command 'sh'' finished with non-zero exit value 1

* Try:
Run with --stacktrace option to get the stack trace. Run with --info or --debug option to
get more log output. Run with --scan to get full insights.
==============================================================================

* Get more help at https://help.gradle.org

Deprecated Gradle features were used in this build, making it incompatible with Gradle 6.0.
Use '--warning-mode all' to show the individual deprecation warnings.
See https://docs.gradle.org/5.2.1/userguide/command_line_interface.html#sec:command_line_warnings

BUILD FAILED in 58m 51s
77 actionable tasks: 65 executed, 12 from cache

Publishing build scan...
https://gradle.com/s/gu3nmftaruv6a

Build step 'Invoke Gradle script' changed build result to FAILURE
Build step 'Invoke Gradle script' marked build as failure

---------------------------------------------------------------------
To unsubscribe, e-mail: builds-unsubscribe@beam.apache.org
For additional commands, e-mail: builds-help@beam.apache.org


Mime
View raw message