beam-builds mailing list archives

Site index · List index
Message view « Date » · « Thread »
Top « Date » · « Thread »
From Apache Jenkins Server <jenk...@builds.apache.org>
Subject Build failed in Jenkins: beam_PostCommit_Py_ValCont #3697
Date Tue, 02 Jul 2019 00:12:29 GMT
See <https://builds.apache.org/job/beam_PostCommit_Py_ValCont/3697/display/redirect?page=changes>

Changes:

[github] Tiny typo fix

------------------------------------------
[...truncated 207.80 KB...]
copying apache_beam/utils/retry_test.py -> apache-beam-2.15.0.dev0/apache_beam/utils
copying apache_beam/utils/timestamp.py -> apache-beam-2.15.0.dev0/apache_beam/utils
copying apache_beam/utils/timestamp_test.py -> apache-beam-2.15.0.dev0/apache_beam/utils
copying apache_beam/utils/urns.py -> apache-beam-2.15.0.dev0/apache_beam/utils
copying apache_beam/utils/windowed_value.pxd -> apache-beam-2.15.0.dev0/apache_beam/utils
copying apache_beam/utils/windowed_value.py -> apache-beam-2.15.0.dev0/apache_beam/utils
copying apache_beam/utils/windowed_value_test.py -> apache-beam-2.15.0.dev0/apache_beam/utils
Writing apache-beam-2.15.0.dev0/setup.cfg
creating dist
Creating tar archive
removing 'apache-beam-2.15.0.dev0' (and everything under it)
SDK_LOCATION=$(find dist/apache-beam-*.tar.gz)
find dist/apache-beam-*.tar.gz

# Run ValidatesRunner tests on Google Cloud Dataflow service
echo ">>> RUNNING DATAFLOW RUNNER VALIDATESCONTAINER TEST"
>>> RUNNING DATAFLOW RUNNER VALIDATESCONTAINER TEST
python setup.py nosetests \
  --attr ValidatesContainer \
  --nologcapture \
  --processes=1 \
  --process-timeout=900 \
  --test-pipeline-options=" \
    --runner=TestDataflowRunner \
    --project=$PROJECT \
    --worker_harness_container_image=$CONTAINER:$TAG \
    --staging_location=$GCS_LOCATION/staging-validatesrunner-test \
    --temp_location=$GCS_LOCATION/temp-validatesrunner-test \
    --output=$GCS_LOCATION/output \
    --sdk_location=$SDK_LOCATION \
    --num_workers=1"
<https://builds.apache.org/job/beam_PostCommit_Py_ValCont/ws/src/sdks/python/container/venv/python/local/lib/python2.7/site-packages/setuptools/dist.py>:472:
UserWarning: Normalizing '2.15.0.dev' to '2.15.0.dev0'
  normalized_version,
running nosetests
running egg_info
<https://builds.apache.org/job/beam_PostCommit_Py_ValCont/ws/src/sdks/python/gen_protos.py>:57:
UserWarning: Installing grpcio-tools is recommended for development.
  warnings.warn('Installing grpcio-tools is recommended for development.')
writing requirements to apache_beam.egg-info/requires.txt
writing apache_beam.egg-info/PKG-INFO
writing top-level names to apache_beam.egg-info/top_level.txt
writing dependency_links to apache_beam.egg-info/dependency_links.txt
writing entry points to apache_beam.egg-info/entry_points.txt
reading manifest file 'apache_beam.egg-info/SOURCES.txt'
reading manifest template 'MANIFEST.in'
warning: no files found matching 'README.md'
warning: no files found matching 'NOTICE'
warning: no files found matching 'LICENSE'
writing manifest file 'apache_beam.egg-info/SOURCES.txt'
WARNING:root:Using deprecated Datastore client.
This client will be removed in Beam 3.0 (next Beam major release).
Please migrate to apache_beam.io.gcp.datastore.v1new.datastoreio.
WARNING:root:python-snappy is not installed; some tests will be skipped.
WARNING:root:Tensorflow is not installed, so skipping some tests.
test_wordcount_fnapi_it (apache_beam.examples.wordcount_it_test.WordCountIT) ... ERROR
WARNING:root:Discarding unparseable args: ['--output=gs://temp-storage-for-end-to-end-tests/output']
WARNING:root:Discarding unparseable args: ['--output=gs://temp-storage-for-end-to-end-tests/output']
test_metrics_fnapi_it (apache_beam.runners.dataflow.dataflow_exercise_metrics_pipeline_test.ExerciseMetricsPipelineTest)
... ERROR

======================================================================
ERROR: test_wordcount_fnapi_it (apache_beam.examples.wordcount_it_test.WordCountIT)
----------------------------------------------------------------------
Traceback (most recent call last):
  File "<https://builds.apache.org/job/beam_PostCommit_Py_ValCont/ws/src/sdks/python/apache_beam/examples/wordcount_it_test.py",>
line 52, in test_wordcount_fnapi_it
    self._run_wordcount_it(wordcount.run, experiment='beam_fn_api')
  File "<https://builds.apache.org/job/beam_PostCommit_Py_ValCont/ws/src/sdks/python/apache_beam/examples/wordcount_it_test.py",>
line 84, in _run_wordcount_it
    run_wordcount(test_pipeline.get_full_options_as_args(**extra_opts))
  File "<https://builds.apache.org/job/beam_PostCommit_Py_ValCont/ws/src/sdks/python/apache_beam/examples/wordcount.py",>
line 114, in run
    result = p.run()
  File "<https://builds.apache.org/job/beam_PostCommit_Py_ValCont/ws/src/sdks/python/apache_beam/pipeline.py",>
line 406, in run
    self._options).run(False)
  File "<https://builds.apache.org/job/beam_PostCommit_Py_ValCont/ws/src/sdks/python/apache_beam/pipeline.py",>
line 419, in run
    return self.runner.run_pipeline(self, self._options)
  File "<https://builds.apache.org/job/beam_PostCommit_Py_ValCont/ws/src/sdks/python/apache_beam/runners/dataflow/test_dataflow_runner.py",>
line 64, in run_pipeline
    self.result.wait_until_finish(duration=wait_duration)
  File "<https://builds.apache.org/job/beam_PostCommit_Py_ValCont/ws/src/sdks/python/apache_beam/runners/dataflow/dataflow_runner.py",>
line 1338, in wait_until_finish
    (self.state, getattr(self._runner, 'last_error_msg', None)), self)
DataflowRuntimeException: Dataflow pipeline failed. State: FAILED, Error:
java.util.concurrent.ExecutionException: java.lang.RuntimeException: Error received from SDK
harness for instruction -348: Traceback (most recent call last):
  File "/usr/local/lib/python2.7/site-packages/apache_beam/runners/worker/sdk_worker.py",
line 157, in _execute
    response = task()
  File "/usr/local/lib/python2.7/site-packages/apache_beam/runners/worker/sdk_worker.py",
line 190, in <lambda>
    self._execute(lambda: worker.do_instruction(work), work)
  File "/usr/local/lib/python2.7/site-packages/apache_beam/runners/worker/sdk_worker.py",
line 342, in do_instruction
    request.instruction_id)
  File "/usr/local/lib/python2.7/site-packages/apache_beam/runners/worker/sdk_worker.py",
line 368, in process_bundle
    bundle_processor.process_bundle(instruction_id))
  File "/usr/local/lib/python2.7/site-packages/apache_beam/runners/worker/bundle_processor.py",
line 593, in process_bundle
    data.ptransform_id].process_encoded(data.data)
KeyError: u'\n\x04-290\x12\x04-288'

	at java.util.concurrent.CompletableFuture.reportGet(CompletableFuture.java:357)
	at java.util.concurrent.CompletableFuture.get(CompletableFuture.java:1895)
	at org.apache.beam.sdk.util.MoreFutures.get(MoreFutures.java:57)
	at org.apache.beam.runners.dataflow.worker.fn.control.RegisterAndProcessBundleOperation.finish(RegisterAndProcessBundleOperation.java:285)
	at org.apache.beam.runners.dataflow.worker.util.common.worker.MapTaskExecutor.execute(MapTaskExecutor.java:85)
	at org.apache.beam.runners.dataflow.worker.fn.control.BeamFnMapTaskExecutor.execute(BeamFnMapTaskExecutor.java:125)
	at org.apache.beam.runners.dataflow.worker.BatchDataflowWorker.executeWork(BatchDataflowWorker.java:412)
	at org.apache.beam.runners.dataflow.worker.BatchDataflowWorker.doWork(BatchDataflowWorker.java:381)
	at org.apache.beam.runners.dataflow.worker.BatchDataflowWorker.getAndPerformWork(BatchDataflowWorker.java:306)
	at org.apache.beam.runners.dataflow.worker.DataflowRunnerHarness.start(DataflowRunnerHarness.java:195)
	at org.apache.beam.runners.dataflow.worker.DataflowRunnerHarness.main(DataflowRunnerHarness.java:123)
	Suppressed: java.lang.IllegalStateException: Already closed.
		at org.apache.beam.sdk.fn.data.BeamFnDataBufferingOutboundObserver.close(BeamFnDataBufferingOutboundObserver.java:95)
		at org.apache.beam.runners.dataflow.worker.fn.data.RemoteGrpcPortWriteOperation.abort(RemoteGrpcPortWriteOperation.java:215)
		at org.apache.beam.runners.dataflow.worker.util.common.worker.MapTaskExecutor.execute(MapTaskExecutor.java:91)
		... 6 more
Caused by: java.lang.RuntimeException: Error received from SDK harness for instruction -348:
Traceback (most recent call last):
  File "/usr/local/lib/python2.7/site-packages/apache_beam/runners/worker/sdk_worker.py",
line 157, in _execute
    response = task()
  File "/usr/local/lib/python2.7/site-packages/apache_beam/runners/worker/sdk_worker.py",
line 190, in <lambda>
    self._execute(lambda: worker.do_instruction(work), work)
  File "/usr/local/lib/python2.7/site-packages/apache_beam/runners/worker/sdk_worker.py",
line 342, in do_instruction
    request.instruction_id)
  File "/usr/local/lib/python2.7/site-packages/apache_beam/runners/worker/sdk_worker.py",
line 368, in process_bundle
    bundle_processor.process_bundle(instruction_id))
  File "/usr/local/lib/python2.7/site-packages/apache_beam/runners/worker/bundle_processor.py",
line 593, in process_bundle
    data.ptransform_id].process_encoded(data.data)
KeyError: u'\n\x04-290\x12\x04-288'

	at org.apache.beam.runners.fnexecution.control.FnApiControlClient$ResponseStreamObserver.onNext(FnApiControlClient.java:157)
	at org.apache.beam.runners.fnexecution.control.FnApiControlClient$ResponseStreamObserver.onNext(FnApiControlClient.java:140)
	at org.apache.beam.vendor.grpc.v1p13p1.io.grpc.stub.ServerCalls$StreamingServerCallHandler$StreamingServerCallListener.onMessage(ServerCalls.java:248)
	at org.apache.beam.vendor.grpc.v1p13p1.io.grpc.ForwardingServerCallListener.onMessage(ForwardingServerCallListener.java:33)
	at org.apache.beam.vendor.grpc.v1p13p1.io.grpc.Contexts$ContextualizedServerCallListener.onMessage(Contexts.java:76)
	at org.apache.beam.vendor.grpc.v1p13p1.io.grpc.internal.ServerCallImpl$ServerStreamListenerImpl.messagesAvailable(ServerCallImpl.java:263)
	at org.apache.beam.vendor.grpc.v1p13p1.io.grpc.internal.ServerImpl$JumpToApplicationThreadServerStreamListener$1MessagesAvailable.runInContext(ServerImpl.java:683)
	at org.apache.beam.vendor.grpc.v1p13p1.io.grpc.internal.ContextRunnable.run(ContextRunnable.java:37)
	at org.apache.beam.vendor.grpc.v1p13p1.io.grpc.internal.SerializingExecutor.run(SerializingExecutor.java:123)
	at java.util.concurrent.ThreadPoolExecutor.runWorker(ThreadPoolExecutor.java:1142)
	at java.util.concurrent.ThreadPoolExecutor$Worker.run(ThreadPoolExecutor.java:617)
	at java.lang.Thread.run(Thread.java:745)

-------------------- >> begin captured stdout << ---------------------
Found: https://console.cloud.google.com/dataflow/jobsDetail/locations/us-central1/jobs/2019-07-01_16_58_24-13100792213788527829?project=apache-beam-testing.

--------------------- >> end captured stdout << ----------------------

======================================================================
ERROR: test_metrics_fnapi_it (apache_beam.runners.dataflow.dataflow_exercise_metrics_pipeline_test.ExerciseMetricsPipelineTest)
----------------------------------------------------------------------
Traceback (most recent call last):
  File "<https://builds.apache.org/job/beam_PostCommit_Py_ValCont/ws/src/sdks/python/apache_beam/runners/dataflow/dataflow_exercise_metrics_pipeline_test.py",>
line 60, in test_metrics_fnapi_it
    result = self.run_pipeline(experiment='beam_fn_api')
  File "<https://builds.apache.org/job/beam_PostCommit_Py_ValCont/ws/src/sdks/python/apache_beam/runners/dataflow/dataflow_exercise_metrics_pipeline_test.py",>
line 48, in run_pipeline
    return dataflow_exercise_metrics_pipeline.apply_and_run(p)
  File "<https://builds.apache.org/job/beam_PostCommit_Py_ValCont/ws/src/sdks/python/apache_beam/runners/dataflow/dataflow_exercise_metrics_pipeline.py",>
line 197, in apply_and_run
    result = pipeline.run()
  File "<https://builds.apache.org/job/beam_PostCommit_Py_ValCont/ws/src/sdks/python/apache_beam/pipeline.py",>
line 406, in run
    self._options).run(False)
  File "<https://builds.apache.org/job/beam_PostCommit_Py_ValCont/ws/src/sdks/python/apache_beam/pipeline.py",>
line 419, in run
    return self.runner.run_pipeline(self, self._options)
  File "<https://builds.apache.org/job/beam_PostCommit_Py_ValCont/ws/src/sdks/python/apache_beam/runners/dataflow/test_dataflow_runner.py",>
line 64, in run_pipeline
    self.result.wait_until_finish(duration=wait_duration)
  File "<https://builds.apache.org/job/beam_PostCommit_Py_ValCont/ws/src/sdks/python/apache_beam/runners/dataflow/dataflow_runner.py",>
line 1338, in wait_until_finish
    (self.state, getattr(self._runner, 'last_error_msg', None)), self)
DataflowRuntimeException: Dataflow pipeline failed. State: FAILED, Error:
java.util.concurrent.ExecutionException: java.lang.RuntimeException: Error received from SDK
harness for instruction -130: Traceback (most recent call last):
  File "/usr/local/lib/python2.7/site-packages/apache_beam/runners/worker/sdk_worker.py",
line 157, in _execute
    response = task()
  File "/usr/local/lib/python2.7/site-packages/apache_beam/runners/worker/sdk_worker.py",
line 190, in <lambda>
    self._execute(lambda: worker.do_instruction(work), work)
  File "/usr/local/lib/python2.7/site-packages/apache_beam/runners/worker/sdk_worker.py",
line 342, in do_instruction
    request.instruction_id)
  File "/usr/local/lib/python2.7/site-packages/apache_beam/runners/worker/sdk_worker.py",
line 368, in process_bundle
    bundle_processor.process_bundle(instruction_id))
  File "/usr/local/lib/python2.7/site-packages/apache_beam/runners/worker/bundle_processor.py",
line 593, in process_bundle
    data.ptransform_id].process_encoded(data.data)
KeyError: u'\n\x04-108\x12\x04-106'

	at java.util.concurrent.CompletableFuture.reportGet(CompletableFuture.java:357)
	at java.util.concurrent.CompletableFuture.get(CompletableFuture.java:1895)
	at org.apache.beam.sdk.util.MoreFutures.get(MoreFutures.java:57)
	at org.apache.beam.runners.dataflow.worker.fn.control.RegisterAndProcessBundleOperation.finish(RegisterAndProcessBundleOperation.java:285)
	at org.apache.beam.runners.dataflow.worker.util.common.worker.MapTaskExecutor.execute(MapTaskExecutor.java:85)
	at org.apache.beam.runners.dataflow.worker.fn.control.BeamFnMapTaskExecutor.execute(BeamFnMapTaskExecutor.java:125)
	at org.apache.beam.runners.dataflow.worker.BatchDataflowWorker.executeWork(BatchDataflowWorker.java:412)
	at org.apache.beam.runners.dataflow.worker.BatchDataflowWorker.doWork(BatchDataflowWorker.java:381)
	at org.apache.beam.runners.dataflow.worker.BatchDataflowWorker.getAndPerformWork(BatchDataflowWorker.java:306)
	at org.apache.beam.runners.dataflow.worker.DataflowRunnerHarness.start(DataflowRunnerHarness.java:195)
	at org.apache.beam.runners.dataflow.worker.DataflowRunnerHarness.main(DataflowRunnerHarness.java:123)
	Suppressed: java.lang.IllegalStateException: Already closed.
		at org.apache.beam.sdk.fn.data.BeamFnDataBufferingOutboundObserver.close(BeamFnDataBufferingOutboundObserver.java:95)
		at org.apache.beam.runners.dataflow.worker.fn.data.RemoteGrpcPortWriteOperation.abort(RemoteGrpcPortWriteOperation.java:215)
		at org.apache.beam.runners.dataflow.worker.util.common.worker.MapTaskExecutor.execute(MapTaskExecutor.java:91)
		... 6 more
Caused by: java.lang.RuntimeException: Error received from SDK harness for instruction -130:
Traceback (most recent call last):
  File "/usr/local/lib/python2.7/site-packages/apache_beam/runners/worker/sdk_worker.py",
line 157, in _execute
    response = task()
  File "/usr/local/lib/python2.7/site-packages/apache_beam/runners/worker/sdk_worker.py",
line 190, in <lambda>
    self._execute(lambda: worker.do_instruction(work), work)
  File "/usr/local/lib/python2.7/site-packages/apache_beam/runners/worker/sdk_worker.py",
line 342, in do_instruction
    request.instruction_id)
  File "/usr/local/lib/python2.7/site-packages/apache_beam/runners/worker/sdk_worker.py",
line 368, in process_bundle
    bundle_processor.process_bundle(instruction_id))
  File "/usr/local/lib/python2.7/site-packages/apache_beam/runners/worker/bundle_processor.py",
line 593, in process_bundle
    data.ptransform_id].process_encoded(data.data)
KeyError: u'\n\x04-108\x12\x04-106'

	at org.apache.beam.runners.fnexecution.control.FnApiControlClient$ResponseStreamObserver.onNext(FnApiControlClient.java:157)
	at org.apache.beam.runners.fnexecution.control.FnApiControlClient$ResponseStreamObserver.onNext(FnApiControlClient.java:140)
	at org.apache.beam.vendor.grpc.v1p13p1.io.grpc.stub.ServerCalls$StreamingServerCallHandler$StreamingServerCallListener.onMessage(ServerCalls.java:248)
	at org.apache.beam.vendor.grpc.v1p13p1.io.grpc.ForwardingServerCallListener.onMessage(ForwardingServerCallListener.java:33)
	at org.apache.beam.vendor.grpc.v1p13p1.io.grpc.Contexts$ContextualizedServerCallListener.onMessage(Contexts.java:76)
	at org.apache.beam.vendor.grpc.v1p13p1.io.grpc.internal.ServerCallImpl$ServerStreamListenerImpl.messagesAvailable(ServerCallImpl.java:263)
	at org.apache.beam.vendor.grpc.v1p13p1.io.grpc.internal.ServerImpl$JumpToApplicationThreadServerStreamListener$1MessagesAvailable.runInContext(ServerImpl.java:683)
	at org.apache.beam.vendor.grpc.v1p13p1.io.grpc.internal.ContextRunnable.run(ContextRunnable.java:37)
	at org.apache.beam.vendor.grpc.v1p13p1.io.grpc.internal.SerializingExecutor.run(SerializingExecutor.java:123)
	at java.util.concurrent.ThreadPoolExecutor.runWorker(ThreadPoolExecutor.java:1142)
	at java.util.concurrent.ThreadPoolExecutor$Worker.run(ThreadPoolExecutor.java:617)
	at java.lang.Thread.run(Thread.java:745)

-------------------- >> begin captured stdout << ---------------------
Found: https://console.cloud.google.com/dataflow/jobsDetail/locations/us-central1/jobs/2019-07-01_17_05_57-2180223769591991146?project=apache-beam-testing.

--------------------- >> end captured stdout << ----------------------

----------------------------------------------------------------------
XML: <https://builds.apache.org/job/beam_PostCommit_Py_ValCont/ws/src/sdks/python/nosetests.xml>
----------------------------------------------------------------------
Ran 2 tests in 843.787s

FAILED (errors=2)
cleanup_container
Untagged: us.gcr.io/apache-beam-testing/jenkins/python:20190701-235102
Untagged: us.gcr.io/apache-beam-testing/jenkins/python@sha256:0af072e749caf16306aeb4c1568ac6ed23c5b98468be70d2cfd67cebc201eae9
Deleted: sha256:0d45a988f071f0d8306d6195db7d9833e0090091781d1bb9c916897e6cebd6dc
Deleted: sha256:a28b649a41040a56539031b685f38405a3b7866837fea1e089143bd6442f2aa5
Deleted: sha256:bb4fa1bf81e800a093a36ccfee220aba58229404dab85dd753ae2468d82cb31b
Deleted: sha256:25724a22d666f8cc2fdc951fb1ce28e5e58743f01cb500c2bcdc8a115c4b2e49
Deleted: sha256:95d28f0b444f5a41d2986a1152211427245dfc417cc1dd8c28ed82ad27c96de9
Deleted: sha256:40fdce96099fff9de59ae5289b34fc3227f4efe52c75a64e946c74038e79eb88
Deleted: sha256:f19927d98f92ac6c06f25da9504f3251d12867c3dd99c4f57a400caaefc8a9c1
Deleted: sha256:fa2c3f3254450d2a5482f307d7ea5412e9ae542a05138fe8e1f6611248277bd2
Deleted: sha256:bf0480ad1e2ce32f8737d80c731d5dbc02938e513140694432f711cf69e3ed91
Deleted: sha256:995cbeb58dd2c89d6d31c47e1903bfaf24e49af8e2e961035d4c09bdd06f23cf
Deleted: sha256:3594402fc4e848d23a222d12a02992944b79c63170b8d7e0362fa9394ceaadf5
Deleted: sha256:77a106bafb6a9b28852301490bb2835fd7ce53a7c730d4f8f5f03556027c9485
Deleted: sha256:11fe9f27d6777d812f193244993c0a42a34963fff32ac4b8ec60c6fec1bca98f
Deleted: sha256:9767e360b60c73e18caef1caa379b8e9ee984f813093039e75c9ed5cbc0b40df
Digests:
- us.gcr.io/apache-beam-testing/jenkins/python@sha256:0af072e749caf16306aeb4c1568ac6ed23c5b98468be70d2cfd67cebc201eae9
  Associated tags:
 - 20190701-235102
Tags:
- us.gcr.io/apache-beam-testing/jenkins/python:20190701-235102
Deleted [us.gcr.io/apache-beam-testing/jenkins/python:20190701-235102].
Deleted [us.gcr.io/apache-beam-testing/jenkins/python@sha256:0af072e749caf16306aeb4c1568ac6ed23c5b98468be70d2cfd67cebc201eae9].
Removed the container
Build step 'Execute shell' marked build as failure

---------------------------------------------------------------------
To unsubscribe, e-mail: builds-unsubscribe@beam.apache.org
For additional commands, e-mail: builds-help@beam.apache.org


Mime
View raw message