beam-builds mailing list archives

Site index · List index
Message view « Date » · « Thread »
Top « Date » · « Thread »
From Apache Jenkins Server <jenk...@builds.apache.org>
Subject Build failed in Jenkins: beam_PreCommit_Java_Cron #1498
Date Tue, 02 Jul 2019 06:25:36 GMT
See <https://builds.apache.org/job/beam_PreCommit_Java_Cron/1498/display/redirect>

------------------------------------------
[...truncated 462.13 KB...]
<https://builds.apache.org/job/beam_PreCommit_Java_Cron/ws/src/sdks/java/core/src/main/java/org/apache/beam/sdk/io/TextIO.java>:807:
warning - Tag @link: can't find to(DynamicDestinations) in org.apache.beam.sdk.io.TextIO.TypedWrite
<https://builds.apache.org/job/beam_PreCommit_Java_Cron/ws/src/sdks/java/core/src/main/java/org/apache/beam/sdk/io/TextIO.java>:833:
warning - Tag @link: can't find to(FilenamePolicy) in org.apache.beam.sdk.io.TextIO.TypedWrite
<https://builds.apache.org/job/beam_PreCommit_Java_Cron/ws/src/sdks/java/core/src/main/java/org/apache/beam/sdk/io/TextIO.java>:833:
warning - Tag @link: can't find to(DynamicDestinations) in org.apache.beam.sdk.io.TextIO.TypedWrite
<https://builds.apache.org/job/beam_PreCommit_Java_Cron/ws/src/sdks/java/core/src/main/java/org/apache/beam/sdk/io/TextIO.java>:845:
warning - Tag @link: can't find to(FilenamePolicy) in org.apache.beam.sdk.io.TextIO.TypedWrite
<https://builds.apache.org/job/beam_PreCommit_Java_Cron/ws/src/sdks/java/core/src/main/java/org/apache/beam/sdk/io/TextIO.java>:845:
warning - Tag @link: can't find to(DynamicDestinations) in org.apache.beam.sdk.io.TextIO.TypedWrite
<https://builds.apache.org/job/beam_PreCommit_Java_Cron/ws/src/sdks/java/core/src/main/java/org/apache/beam/sdk/io/TextIO.java>:1106:
warning - Tag @link: can't find to(DynamicDestinations) in org.apache.beam.sdk.io.TextIO.TypedWrite
<https://builds.apache.org/job/beam_PreCommit_Java_Cron/ws/src/sdks/java/core/src/main/java/org/apache/beam/sdk/io/TextIO.java>:1093:
warning - Tag @link: can't find to(FilenamePolicy) in org.apache.beam.sdk.io.TextIO.TypedWrite
<https://builds.apache.org/job/beam_PreCommit_Java_Cron/ws/src/sdks/java/core/src/main/java/org/apache/beam/sdk/io/TextIO.java>:1119:
warning - Tag @link: can't find to(SerializableFunction, Params) in org.apache.beam.sdk.io.TextIO.TypedWrite
<https://builds.apache.org/job/beam_PreCommit_Java_Cron/ws/src/sdks/java/core/src/main/java/org/apache/beam/sdk/io/TextIO.java>:1207:
warning - Tag @link: can't find to(DynamicDestinations) in org.apache.beam.sdk.io.TextIO.Write
<https://builds.apache.org/job/beam_PreCommit_Java_Cron/ws/src/sdks/java/core/src/main/java/org/apache/beam/sdk/io/TextIO.java>:1207:
warning - Tag @link: can't find to(SerializableFunction, Params) in org.apache.beam.sdk.io.TextIO.Write
<https://builds.apache.org/job/beam_PreCommit_Java_Cron/ws/src/sdks/java/core/src/main/java/org/apache/beam/sdk/io/TextIO.java>:1175:
warning - Tag @link: can't find withWritableByteChannelFactory(WritableByteChannelFactory)
in org.apache.beam.sdk.io.TextIO.TypedWrite

> Task :sdks:java:extensions:sql:hcatalog:compileJava
> Task :sdks:java:extensions:sql:datacatalog:classes
> Task :sdks:java:extensions:protobuf:test
> Task :sdks:java:extensions:protobuf:check
> Task :sdks:java:extensions:protobuf:build
> Task :sdks:java:extensions:sql:hcatalog:classes

> Task :sdks:java:core:javadoc
<https://builds.apache.org/job/beam_PreCommit_Java_Cron/ws/src/sdks/java/core/src/main/java/org/apache/beam/sdk/options/SdkHarnessOptions.java>:112:
warning - Tag @link: can't find addOverrideForName(String, LogLevel) in org.apache.beam.sdk.options.SdkHarnessOptions.SdkHarnessLogLevelOverrides
<https://builds.apache.org/job/beam_PreCommit_Java_Cron/ws/src/sdks/java/core/src/main/java/org/apache/beam/sdk/options/SdkHarnessOptions.java>:124:
warning - Tag @link: can't find addOverrideForName(String, LogLevel) in org.apache.beam.sdk.options.SdkHarnessOptions.SdkHarnessLogLevelOverrides
<https://builds.apache.org/job/beam_PreCommit_Java_Cron/ws/src/sdks/java/core/src/main/java/org/apache/beam/sdk/state/StateSpecs.java>:73:
warning - Tag @see: can't find combining(Coder, CombineFn) in org.apache.beam.sdk.state.StateSpecs
<https://builds.apache.org/job/beam_PreCommit_Java_Cron/ws/src/sdks/java/core/src/main/java/org/apache/beam/sdk/state/StateSpecs.java>:91:
warning - Tag @see: can't find combining(Coder, CombineFnWithContext) in org.apache.beam.sdk.state.StateSpecs
<https://builds.apache.org/job/beam_PreCommit_Java_Cron/ws/src/sdks/java/core/src/main/java/org/apache/beam/sdk/state/StateSpecs.java>:102:
warning - Tag @link: can't find combining(CombineFn) in org.apache.beam.sdk.state.StateSpecs
<https://builds.apache.org/job/beam_PreCommit_Java_Cron/ws/src/sdks/java/core/src/main/java/org/apache/beam/sdk/state/StateSpecs.java>:121:
warning - Tag @link: can't find combining(CombineFnWithContext) in org.apache.beam.sdk.state.StateSpecs

> Task :sdks:java:extensions:sql:hcatalog:javadoc

> Task :sdks:java:extensions:sql:datacatalog:javadoc
javadoc: warning - Multiple sources of package comments found for package "javax.annotation"
1 warning

> Task :sdks:java:fn-execution:test
> Task :sdks:java:fn-execution:spotbugsMain
> Task :sdks:java:fn-execution:check
> Task :sdks:java:fn-execution:build
> Task :sdks:java:io:hadoop-common:test
> Task :sdks:java:io:hadoop-common:spotbugsMain
> Task :sdks:java:io:hadoop-common:check
> Task :sdks:java:io:hadoop-common:build
> Task :sdks:java:io:common:test
> Task :sdks:java:io:common:check
> Task :sdks:java:io:common:build

> Task :sdks:java:core:javadoc
47 warnings

> Task :runners:direct-java:jar
> Task :runners:direct-java:packageTests
> Task :runners:direct-java:assemble
> Task :runners:direct-java:analyzeClassesDependencies SKIPPED
> Task :runners:direct-java:analyzeTestClassesDependencies SKIPPED
> Task :runners:direct-java:analyzeDependencies SKIPPED
> Task :runners:direct-java:checkstyleMain
> Task :runners:direct-java:checkstyleTest
> Task :sdks:java:extensions:kryo:test
> Task :sdks:java:extensions:kryo:check
> Task :sdks:java:extensions:kryo:build
> Task :runners:direct-java:javadoc
> Task :sdks:java:extensions:sql:jdbc:shadowJarTest
> Task :sdks:java:extensions:jackson:test
> Task :sdks:java:core:spotbugsMain
> Task :sdks:java:core:test
> Task :sdks:java:io:hadoop-format:test
> Task :sdks:java:extensions:euphoria:test
> Task :sdks:java:extensions:join-library:test
> Task :sdks:java:extensions:jackson:check
> Task :sdks:java:extensions:jackson:build
> Task :sdks:java:extensions:jackson:buildDependents
> Task :sdks:java:extensions:join-library:check
> Task :sdks:java:extensions:join-library:build
> Task :sdks:java:extensions:sketching:test
> Task :runners:direct-java:spotbugsMain
> Task :sdks:java:extensions:sketching:check
> Task :sdks:java:extensions:sketching:build
> Task :sdks:java:extensions:sketching:buildDependents
> Task :runners:direct-java:test
> Task :sdks:java:io:amazon-web-services2:test
> Task :sdks:java:io:amazon-web-services2:check
> Task :sdks:java:io:amazon-web-services2:build
> Task :sdks:java:io:amazon-web-services2:buildDependents
> Task :sdks:java:extensions:sorter:test

> Task :sdks:java:core:spotbugsMain
The following classes needed for analysis were missing:
  com.google.auto.value.AutoValue$Builder
  com.google.auto.value.AutoValue

> Task :sdks:java:extensions:euphoria:check
> Task :sdks:java:extensions:euphoria:build
> Task :sdks:java:extensions:euphoria:buildDependents
> Task :sdks:java:extensions:kryo:buildDependents
> Task :runners:direct-java:validateShadedJarDoesntLeakNonProjectClasses
> Task :runners:direct-java:check
> Task :runners:direct-java:build
> Task :sdks:java:io:amazon-web-services:test
> Task :runners:flink:1.8:check
> Task :runners:flink:1.8:build
> Task :runners:flink:1.8:buildDependents
> Task :sdks:java:io:amqp:test
> Task :sdks:java:io:amqp:check
> Task :sdks:java:io:amqp:build
> Task :sdks:java:io:amqp:buildDependents
> Task :sdks:java:extensions:sorter:check
> Task :sdks:java:extensions:sorter:build
> Task :sdks:java:extensions:sorter:buildDependents
> Task :sdks:java:io:cassandra:test
> Task :sdks:java:io:clickhouse:test
> Task :sdks:java:io:hadoop-file-system:test
> Task :sdks:java:io:hbase:test
> Task :sdks:java:io:hcatalog:test
> Task :sdks:java:io:jdbc:test
> Task :sdks:java:io:jms:test
> Task :sdks:java:io:jms:check
> Task :sdks:java:io:jms:build
> Task :sdks:java:io:jms:buildDependents
> Task :sdks:java:io:kafka:test
> Task :sdks:java:io:hadoop-format:check
> Task :sdks:java:io:hadoop-format:build
> Task :sdks:java:io:hadoop-format:buildDependents
> Task :examples:java:buildDependents
> Task :sdks:java:io:amazon-web-services:check
> Task :sdks:java:io:amazon-web-services:build
> Task :sdks:java:io:amazon-web-services:buildDependents
> Task :sdks:java:io:jdbc:check
> Task :sdks:java:io:jdbc:build
> Task :sdks:java:io:jdbc:buildDependents
> Task :sdks:java:io:hadoop-file-system:check
> Task :sdks:java:io:hadoop-file-system:build
> Task :sdks:java:io:hadoop-file-system:buildDependents
> Task :sdks:java:io:kinesis:test
> Task :sdks:java:io:kudu:test
> Task :sdks:java:io:kudu:check
> Task :sdks:java:io:kudu:build
> Task :sdks:java:io:kudu:buildDependents
> Task :sdks:java:io:mongodb:test
> Task :sdks:java:io:kafka:check
> Task :sdks:java:io:kafka:build
> Task :sdks:java:io:mqtt:test
> Task :sdks:java:io:mqtt:check
> Task :sdks:java:io:mqtt:build
> Task :sdks:java:io:mqtt:buildDependents
> Task :sdks:java:io:parquet:test
> Task :sdks:java:io:rabbitmq:test
> Task :sdks:java:io:parquet:check
> Task :sdks:java:io:parquet:build
> Task :sdks:java:io:parquet:buildDependents
> Task :sdks:java:io:mongodb:check
> Task :sdks:java:io:mongodb:build
> Task :sdks:java:io:mongodb:buildDependents
> Task :sdks:java:io:redis:test
> Task :sdks:java:io:redis:check
> Task :sdks:java:io:redis:build
> Task :sdks:java:io:redis:buildDependents
> Task :sdks:java:io:solr:test
> Task :sdks:java:io:synthetic:test
> Task :sdks:java:io:tika:test
> Task :sdks:java:io:synthetic:check
> Task :sdks:java:io:synthetic:build
> Task :sdks:java:io:synthetic:buildDependents
> Task :sdks:java:io:rabbitmq:check
> Task :sdks:java:io:rabbitmq:build
> Task :sdks:java:io:rabbitmq:buildDependents
> Task :sdks:java:io:tika:check
> Task :sdks:java:io:tika:build
> Task :sdks:java:io:tika:buildDependents
> Task :sdks:java:io:xml:test
> Task :sdks:java:io:xml:check
> Task :sdks:java:io:xml:build
> Task :sdks:java:io:xml:buildDependents
> Task :sdks:java:io:elasticsearch-tests:elasticsearch-tests-common:test NO-SOURCE
> Task :sdks:java:io:elasticsearch-tests:elasticsearch-tests-common:check
> Task :sdks:java:io:elasticsearch-tests:elasticsearch-tests-common:build
> Task :sdks:java:core:validateShadedJarDoesntLeakNonProjectClasses
> Task :sdks:java:core:check
> Task :sdks:java:core:build
> Task :sdks:java:core:buildNeeded
> Task :sdks:java:javadoc:allJavadoc
> Task :sdks:java:extensions:sql:jdbc:preCommit
> Task :sdks:java:io:elasticsearch-tests:elasticsearch-tests-2:test
> Task :sdks:java:io:elasticsearch-tests:elasticsearch-tests-5:test
> Task :sdks:java:io:elasticsearch-tests:elasticsearch-tests-6:test
> Task :sdks:java:io:solr:check
> Task :sdks:java:io:solr:build
> Task :sdks:java:io:solr:buildDependents
> Task :sdks:java:io:hcatalog:check
> Task :sdks:java:io:hcatalog:build
> Task :sdks:java:io:hcatalog:buildDependents
> Task :sdks:java:io:kinesis:check
> Task :sdks:java:io:kinesis:build
> Task :sdks:java:io:kinesis:buildDependents
> Task :sdks:java:io:clickhouse:check
> Task :sdks:java:io:clickhouse:build
> Task :sdks:java:io:clickhouse:buildDependents
> Task :sdks:java:io:elasticsearch-tests:elasticsearch-tests-2:check
> Task :sdks:java:io:elasticsearch-tests:elasticsearch-tests-2:build
> Task :sdks:java:io:elasticsearch-tests:elasticsearch-tests-2:buildDependents
> Task :sdks:java:io:cassandra:check
> Task :sdks:java:io:cassandra:build
> Task :sdks:java:io:cassandra:buildDependents
> Task :sdks:java:io:elasticsearch-tests:elasticsearch-tests-5:check
> Task :sdks:java:io:elasticsearch-tests:elasticsearch-tests-5:build
> Task :sdks:java:io:elasticsearch-tests:elasticsearch-tests-5:buildDependents
> Task :sdks:java:io:elasticsearch-tests:elasticsearch-tests-6:check
> Task :sdks:java:io:elasticsearch-tests:elasticsearch-tests-6:build
> Task :sdks:java:io:elasticsearch-tests:elasticsearch-tests-6:buildDependents
> Task :sdks:java:io:elasticsearch-tests:elasticsearch-tests-common:buildDependents
> Task :sdks:java:io:elasticsearch:buildDependents
> Task :sdks:java:io:hbase:check
> Task :sdks:java:io:hbase:build
> Task :sdks:java:io:hbase:buildDependents
> Task :sdks:java:io:common:buildDependents
> Task :sdks:java:io:hadoop-common:buildDependents
> Task :sdks:java:testing:nexmark:check
> Task :sdks:java:testing:nexmark:build
> Task :sdks:java:testing:nexmark:buildDependents
> Task :sdks:java:extensions:sql:buildDependents
> Task :sdks:java:io:google-cloud-platform:buildDependents
> Task :sdks:java:extensions:join-library:buildDependents
> Task :sdks:java:extensions:protobuf:buildDependents
> Task :sdks:java:testing:test-utils:buildDependents
> Task :sdks:java:io:kafka:buildDependents
> Task :runners:direct-java:buildDependents
> Task :runners:local-java:buildDependents

FAILURE: Build failed with an exception.

* What went wrong:
Execution failed for task ':runners:samza:test'.
> There were failing tests. See the report at: file://<https://builds.apache.org/job/beam_PreCommit_Java_Cron/ws/src/runners/samza/build/reports/tests/test/index.html>

* Try:
Run with --stacktrace option to get the stack trace. Run with --info or --debug option to
get more log output. Run with --scan to get full insights.

* Get more help at https://help.gradle.org

Deprecated Gradle features were used in this build, making it incompatible with Gradle 6.0.
Use '--warning-mode all' to show the individual deprecation warnings.
See https://docs.gradle.org/5.2.1/userguide/command_line_interface.html#sec:command_line_warnings

BUILD FAILED in 20m 25s
789 actionable tasks: 740 executed, 49 from cache

Publishing build scan...
https://gradle.com/s/q6u5kus4ufuga

Build step 'Invoke Gradle script' changed build result to FAILURE
Build step 'Invoke Gradle script' marked build as failure

---------------------------------------------------------------------
To unsubscribe, e-mail: builds-unsubscribe@beam.apache.org
For additional commands, e-mail: builds-help@beam.apache.org


Mime
View raw message