beam-builds mailing list archives

Site index · List index
Message view « Date » · « Thread »
Top « Date » · « Thread »
From Apache Jenkins Server <jenk...@builds.apache.org>
Subject Build failed in Jenkins: beam_PostCommit_Py_ValCont #3699
Date Tue, 02 Jul 2019 06:21:43 GMT
See <https://builds.apache.org/job/beam_PostCommit_Py_ValCont/3699/display/redirect>

------------------------------------------
[...truncated 208.35 KB...]
copying apache_beam/utils/retry_test.py -> apache-beam-2.15.0.dev0/apache_beam/utils
copying apache_beam/utils/timestamp.py -> apache-beam-2.15.0.dev0/apache_beam/utils
copying apache_beam/utils/timestamp_test.py -> apache-beam-2.15.0.dev0/apache_beam/utils
copying apache_beam/utils/urns.py -> apache-beam-2.15.0.dev0/apache_beam/utils
copying apache_beam/utils/windowed_value.pxd -> apache-beam-2.15.0.dev0/apache_beam/utils
copying apache_beam/utils/windowed_value.py -> apache-beam-2.15.0.dev0/apache_beam/utils
copying apache_beam/utils/windowed_value_test.py -> apache-beam-2.15.0.dev0/apache_beam/utils
Writing apache-beam-2.15.0.dev0/setup.cfg
creating dist
Creating tar archive
removing 'apache-beam-2.15.0.dev0' (and everything under it)
SDK_LOCATION=$(find dist/apache-beam-*.tar.gz)
find dist/apache-beam-*.tar.gz

# Run ValidatesRunner tests on Google Cloud Dataflow service
echo ">>> RUNNING DATAFLOW RUNNER VALIDATESCONTAINER TEST"
>>> RUNNING DATAFLOW RUNNER VALIDATESCONTAINER TEST
python setup.py nosetests \
  --attr ValidatesContainer \
  --nologcapture \
  --processes=1 \
  --process-timeout=900 \
  --test-pipeline-options=" \
    --runner=TestDataflowRunner \
    --project=$PROJECT \
    --worker_harness_container_image=$CONTAINER:$TAG \
    --staging_location=$GCS_LOCATION/staging-validatesrunner-test \
    --temp_location=$GCS_LOCATION/temp-validatesrunner-test \
    --output=$GCS_LOCATION/output \
    --sdk_location=$SDK_LOCATION \
    --num_workers=1"
<https://builds.apache.org/job/beam_PostCommit_Py_ValCont/ws/src/sdks/python/container/venv/python/local/lib/python2.7/site-packages/setuptools/dist.py>:472:
UserWarning: Normalizing '2.15.0.dev' to '2.15.0.dev0'
  normalized_version,
running nosetests
running egg_info
<https://builds.apache.org/job/beam_PostCommit_Py_ValCont/ws/src/sdks/python/gen_protos.py>:57:
UserWarning: Installing grpcio-tools is recommended for development.
  warnings.warn('Installing grpcio-tools is recommended for development.')
writing requirements to apache_beam.egg-info/requires.txt
writing apache_beam.egg-info/PKG-INFO
writing top-level names to apache_beam.egg-info/top_level.txt
writing dependency_links to apache_beam.egg-info/dependency_links.txt
writing entry points to apache_beam.egg-info/entry_points.txt
reading manifest file 'apache_beam.egg-info/SOURCES.txt'
reading manifest template 'MANIFEST.in'
warning: no files found matching 'README.md'
warning: no files found matching 'NOTICE'
warning: no files found matching 'LICENSE'
writing manifest file 'apache_beam.egg-info/SOURCES.txt'
WARNING:root:Using deprecated Datastore client.
This client will be removed in Beam 3.0 (next Beam major release).
Please migrate to apache_beam.io.gcp.datastore.v1new.datastoreio.
WARNING:root:python-snappy is not installed; some tests will be skipped.
WARNING:root:Tensorflow is not installed, so skipping some tests.
test_wordcount_fnapi_it (apache_beam.examples.wordcount_it_test.WordCountIT) ... ERROR
WARNING:root:Discarding unparseable args: ['--output=gs://temp-storage-for-end-to-end-tests/output']
WARNING:root:Discarding unparseable args: ['--output=gs://temp-storage-for-end-to-end-tests/output']
test_metrics_fnapi_it (apache_beam.runners.dataflow.dataflow_exercise_metrics_pipeline_test.ExerciseMetricsPipelineTest)
... ERROR

======================================================================
ERROR: test_wordcount_fnapi_it (apache_beam.examples.wordcount_it_test.WordCountIT)
----------------------------------------------------------------------
Traceback (most recent call last):
  File "<https://builds.apache.org/job/beam_PostCommit_Py_ValCont/ws/src/sdks/python/apache_beam/examples/wordcount_it_test.py",>
line 52, in test_wordcount_fnapi_it
    self._run_wordcount_it(wordcount.run, experiment='beam_fn_api')
  File "<https://builds.apache.org/job/beam_PostCommit_Py_ValCont/ws/src/sdks/python/apache_beam/examples/wordcount_it_test.py",>
line 84, in _run_wordcount_it
    run_wordcount(test_pipeline.get_full_options_as_args(**extra_opts))
  File "<https://builds.apache.org/job/beam_PostCommit_Py_ValCont/ws/src/sdks/python/apache_beam/examples/wordcount.py",>
line 114, in run
    result = p.run()
  File "<https://builds.apache.org/job/beam_PostCommit_Py_ValCont/ws/src/sdks/python/apache_beam/pipeline.py",>
line 406, in run
    self._options).run(False)
  File "<https://builds.apache.org/job/beam_PostCommit_Py_ValCont/ws/src/sdks/python/apache_beam/pipeline.py",>
line 419, in run
    return self.runner.run_pipeline(self, self._options)
  File "<https://builds.apache.org/job/beam_PostCommit_Py_ValCont/ws/src/sdks/python/apache_beam/runners/dataflow/test_dataflow_runner.py",>
line 64, in run_pipeline
    self.result.wait_until_finish(duration=wait_duration)
  File "<https://builds.apache.org/job/beam_PostCommit_Py_ValCont/ws/src/sdks/python/apache_beam/runners/dataflow/dataflow_runner.py",>
line 1338, in wait_until_finish
    (self.state, getattr(self._runner, 'last_error_msg', None)), self)
DataflowRuntimeException: Dataflow pipeline failed. State: FAILED, Error:
java.util.concurrent.ExecutionException: java.lang.RuntimeException: Error received from SDK
harness for instruction -411: Traceback (most recent call last):
  File "/usr/local/lib/python2.7/site-packages/apache_beam/runners/worker/sdk_worker.py",
line 157, in _execute
    response = task()
  File "/usr/local/lib/python2.7/site-packages/apache_beam/runners/worker/sdk_worker.py",
line 190, in <lambda>
    self._execute(lambda: worker.do_instruction(work), work)
  File "/usr/local/lib/python2.7/site-packages/apache_beam/runners/worker/sdk_worker.py",
line 342, in do_instruction
    request.instruction_id)
  File "/usr/local/lib/python2.7/site-packages/apache_beam/runners/worker/sdk_worker.py",
line 368, in process_bundle
    bundle_processor.process_bundle(instruction_id))
  File "/usr/local/lib/python2.7/site-packages/apache_beam/runners/worker/bundle_processor.py",
line 593, in process_bundle
    data.ptransform_id].process_encoded(data.data)
KeyError: u'\n\x04-353\x12\x04-351'

	at java.util.concurrent.CompletableFuture.reportGet(CompletableFuture.java:357)
	at java.util.concurrent.CompletableFuture.get(CompletableFuture.java:1895)
	at org.apache.beam.sdk.util.MoreFutures.get(MoreFutures.java:57)
	at org.apache.beam.runners.dataflow.worker.fn.control.RegisterAndProcessBundleOperation.finish(RegisterAndProcessBundleOperation.java:285)
	at org.apache.beam.runners.dataflow.worker.util.common.worker.MapTaskExecutor.execute(MapTaskExecutor.java:85)
	at org.apache.beam.runners.dataflow.worker.fn.control.BeamFnMapTaskExecutor.execute(BeamFnMapTaskExecutor.java:125)
	at org.apache.beam.runners.dataflow.worker.BatchDataflowWorker.executeWork(BatchDataflowWorker.java:412)
	at org.apache.beam.runners.dataflow.worker.BatchDataflowWorker.doWork(BatchDataflowWorker.java:381)
	at org.apache.beam.runners.dataflow.worker.BatchDataflowWorker.getAndPerformWork(BatchDataflowWorker.java:306)
	at org.apache.beam.runners.dataflow.worker.DataflowRunnerHarness.start(DataflowRunnerHarness.java:195)
	at org.apache.beam.runners.dataflow.worker.DataflowRunnerHarness.main(DataflowRunnerHarness.java:123)
	Suppressed: java.lang.IllegalStateException: Already closed.
		at org.apache.beam.sdk.fn.data.BeamFnDataBufferingOutboundObserver.close(BeamFnDataBufferingOutboundObserver.java:95)
		at org.apache.beam.runners.dataflow.worker.fn.data.RemoteGrpcPortWriteOperation.abort(RemoteGrpcPortWriteOperation.java:215)
		at org.apache.beam.runners.dataflow.worker.util.common.worker.MapTaskExecutor.execute(MapTaskExecutor.java:91)
		... 6 more
Caused by: java.lang.RuntimeException: Error received from SDK harness for instruction -411:
Traceback (most recent call last):
  File "/usr/local/lib/python2.7/site-packages/apache_beam/runners/worker/sdk_worker.py",
line 157, in _execute
    response = task()
  File "/usr/local/lib/python2.7/site-packages/apache_beam/runners/worker/sdk_worker.py",
line 190, in <lambda>
    self._execute(lambda: worker.do_instruction(work), work)
  File "/usr/local/lib/python2.7/site-packages/apache_beam/runners/worker/sdk_worker.py",
line 342, in do_instruction
    request.instruction_id)
  File "/usr/local/lib/python2.7/site-packages/apache_beam/runners/worker/sdk_worker.py",
line 368, in process_bundle
    bundle_processor.process_bundle(instruction_id))
  File "/usr/local/lib/python2.7/site-packages/apache_beam/runners/worker/bundle_processor.py",
line 593, in process_bundle
    data.ptransform_id].process_encoded(data.data)
KeyError: u'\n\x04-353\x12\x04-351'

	at org.apache.beam.runners.fnexecution.control.FnApiControlClient$ResponseStreamObserver.onNext(FnApiControlClient.java:157)
	at org.apache.beam.runners.fnexecution.control.FnApiControlClient$ResponseStreamObserver.onNext(FnApiControlClient.java:140)
	at org.apache.beam.vendor.grpc.v1p13p1.io.grpc.stub.ServerCalls$StreamingServerCallHandler$StreamingServerCallListener.onMessage(ServerCalls.java:248)
	at org.apache.beam.vendor.grpc.v1p13p1.io.grpc.ForwardingServerCallListener.onMessage(ForwardingServerCallListener.java:33)
	at org.apache.beam.vendor.grpc.v1p13p1.io.grpc.Contexts$ContextualizedServerCallListener.onMessage(Contexts.java:76)
	at org.apache.beam.vendor.grpc.v1p13p1.io.grpc.internal.ServerCallImpl$ServerStreamListenerImpl.messagesAvailable(ServerCallImpl.java:263)
	at org.apache.beam.vendor.grpc.v1p13p1.io.grpc.internal.ServerImpl$JumpToApplicationThreadServerStreamListener$1MessagesAvailable.runInContext(ServerImpl.java:683)
	at org.apache.beam.vendor.grpc.v1p13p1.io.grpc.internal.ContextRunnable.run(ContextRunnable.java:37)
	at org.apache.beam.vendor.grpc.v1p13p1.io.grpc.internal.SerializingExecutor.run(SerializingExecutor.java:123)
	at java.util.concurrent.ThreadPoolExecutor.runWorker(ThreadPoolExecutor.java:1142)
	at java.util.concurrent.ThreadPoolExecutor$Worker.run(ThreadPoolExecutor.java:617)
	at java.lang.Thread.run(Thread.java:745)

-------------------- >> begin captured stdout << ---------------------
Found: https://console.cloud.google.com/dataflow/jobsDetail/locations/us-central1/jobs/2019-07-01_23_09_00-6522216733531613032?project=apache-beam-testing.

--------------------- >> end captured stdout << ----------------------

======================================================================
ERROR: test_metrics_fnapi_it (apache_beam.runners.dataflow.dataflow_exercise_metrics_pipeline_test.ExerciseMetricsPipelineTest)
----------------------------------------------------------------------
Traceback (most recent call last):
  File "<https://builds.apache.org/job/beam_PostCommit_Py_ValCont/ws/src/sdks/python/apache_beam/runners/dataflow/dataflow_exercise_metrics_pipeline_test.py",>
line 60, in test_metrics_fnapi_it
    result = self.run_pipeline(experiment='beam_fn_api')
  File "<https://builds.apache.org/job/beam_PostCommit_Py_ValCont/ws/src/sdks/python/apache_beam/runners/dataflow/dataflow_exercise_metrics_pipeline_test.py",>
line 48, in run_pipeline
    return dataflow_exercise_metrics_pipeline.apply_and_run(p)
  File "<https://builds.apache.org/job/beam_PostCommit_Py_ValCont/ws/src/sdks/python/apache_beam/runners/dataflow/dataflow_exercise_metrics_pipeline.py",>
line 197, in apply_and_run
    result = pipeline.run()
  File "<https://builds.apache.org/job/beam_PostCommit_Py_ValCont/ws/src/sdks/python/apache_beam/pipeline.py",>
line 406, in run
    self._options).run(False)
  File "<https://builds.apache.org/job/beam_PostCommit_Py_ValCont/ws/src/sdks/python/apache_beam/pipeline.py",>
line 419, in run
    return self.runner.run_pipeline(self, self._options)
  File "<https://builds.apache.org/job/beam_PostCommit_Py_ValCont/ws/src/sdks/python/apache_beam/runners/dataflow/test_dataflow_runner.py",>
line 64, in run_pipeline
    self.result.wait_until_finish(duration=wait_duration)
  File "<https://builds.apache.org/job/beam_PostCommit_Py_ValCont/ws/src/sdks/python/apache_beam/runners/dataflow/dataflow_runner.py",>
line 1338, in wait_until_finish
    (self.state, getattr(self._runner, 'last_error_msg', None)), self)
DataflowRuntimeException: Dataflow pipeline failed. State: FAILED, Error:
java.util.concurrent.ExecutionException: java.lang.RuntimeException: Error received from SDK
harness for instruction -129: Traceback (most recent call last):
  File "/usr/local/lib/python2.7/site-packages/apache_beam/runners/worker/sdk_worker.py",
line 157, in _execute
    response = task()
  File "/usr/local/lib/python2.7/site-packages/apache_beam/runners/worker/sdk_worker.py",
line 190, in <lambda>
    self._execute(lambda: worker.do_instruction(work), work)
  File "/usr/local/lib/python2.7/site-packages/apache_beam/runners/worker/sdk_worker.py",
line 342, in do_instruction
    request.instruction_id)
  File "/usr/local/lib/python2.7/site-packages/apache_beam/runners/worker/sdk_worker.py",
line 368, in process_bundle
    bundle_processor.process_bundle(instruction_id))
  File "/usr/local/lib/python2.7/site-packages/apache_beam/runners/worker/bundle_processor.py",
line 593, in process_bundle
    data.ptransform_id].process_encoded(data.data)
KeyError: u'\n\x04-107\x12\x04-105'

	at java.util.concurrent.CompletableFuture.reportGet(CompletableFuture.java:357)
	at java.util.concurrent.CompletableFuture.get(CompletableFuture.java:1895)
	at org.apache.beam.sdk.util.MoreFutures.get(MoreFutures.java:57)
	at org.apache.beam.runners.dataflow.worker.fn.control.RegisterAndProcessBundleOperation.finish(RegisterAndProcessBundleOperation.java:285)
	at org.apache.beam.runners.dataflow.worker.util.common.worker.MapTaskExecutor.execute(MapTaskExecutor.java:85)
	at org.apache.beam.runners.dataflow.worker.fn.control.BeamFnMapTaskExecutor.execute(BeamFnMapTaskExecutor.java:125)
	at org.apache.beam.runners.dataflow.worker.BatchDataflowWorker.executeWork(BatchDataflowWorker.java:412)
	at org.apache.beam.runners.dataflow.worker.BatchDataflowWorker.doWork(BatchDataflowWorker.java:381)
	at org.apache.beam.runners.dataflow.worker.BatchDataflowWorker.getAndPerformWork(BatchDataflowWorker.java:306)
	at org.apache.beam.runners.dataflow.worker.DataflowRunnerHarness.start(DataflowRunnerHarness.java:195)
	at org.apache.beam.runners.dataflow.worker.DataflowRunnerHarness.main(DataflowRunnerHarness.java:123)
	Suppressed: java.lang.IllegalStateException: Already closed.
		at org.apache.beam.sdk.fn.data.BeamFnDataBufferingOutboundObserver.close(BeamFnDataBufferingOutboundObserver.java:95)
		at org.apache.beam.runners.dataflow.worker.fn.data.RemoteGrpcPortWriteOperation.abort(RemoteGrpcPortWriteOperation.java:215)
		at org.apache.beam.runners.dataflow.worker.util.common.worker.MapTaskExecutor.execute(MapTaskExecutor.java:91)
		... 6 more
Caused by: java.lang.RuntimeException: Error received from SDK harness for instruction -129:
Traceback (most recent call last):
  File "/usr/local/lib/python2.7/site-packages/apache_beam/runners/worker/sdk_worker.py",
line 157, in _execute
    response = task()
  File "/usr/local/lib/python2.7/site-packages/apache_beam/runners/worker/sdk_worker.py",
line 190, in <lambda>
    self._execute(lambda: worker.do_instruction(work), work)
  File "/usr/local/lib/python2.7/site-packages/apache_beam/runners/worker/sdk_worker.py",
line 342, in do_instruction
    request.instruction_id)
  File "/usr/local/lib/python2.7/site-packages/apache_beam/runners/worker/sdk_worker.py",
line 368, in process_bundle
    bundle_processor.process_bundle(instruction_id))
  File "/usr/local/lib/python2.7/site-packages/apache_beam/runners/worker/bundle_processor.py",
line 593, in process_bundle
    data.ptransform_id].process_encoded(data.data)
KeyError: u'\n\x04-107\x12\x04-105'

	at org.apache.beam.runners.fnexecution.control.FnApiControlClient$ResponseStreamObserver.onNext(FnApiControlClient.java:157)
	at org.apache.beam.runners.fnexecution.control.FnApiControlClient$ResponseStreamObserver.onNext(FnApiControlClient.java:140)
	at org.apache.beam.vendor.grpc.v1p13p1.io.grpc.stub.ServerCalls$StreamingServerCallHandler$StreamingServerCallListener.onMessage(ServerCalls.java:248)
	at org.apache.beam.vendor.grpc.v1p13p1.io.grpc.ForwardingServerCallListener.onMessage(ForwardingServerCallListener.java:33)
	at org.apache.beam.vendor.grpc.v1p13p1.io.grpc.Contexts$ContextualizedServerCallListener.onMessage(Contexts.java:76)
	at org.apache.beam.vendor.grpc.v1p13p1.io.grpc.internal.ServerCallImpl$ServerStreamListenerImpl.messagesAvailable(ServerCallImpl.java:263)
	at org.apache.beam.vendor.grpc.v1p13p1.io.grpc.internal.ServerImpl$JumpToApplicationThreadServerStreamListener$1MessagesAvailable.runInContext(ServerImpl.java:683)
	at org.apache.beam.vendor.grpc.v1p13p1.io.grpc.internal.ContextRunnable.run(ContextRunnable.java:37)
	at org.apache.beam.vendor.grpc.v1p13p1.io.grpc.internal.SerializingExecutor.run(SerializingExecutor.java:123)
	at java.util.concurrent.ThreadPoolExecutor.runWorker(ThreadPoolExecutor.java:1142)
	at java.util.concurrent.ThreadPoolExecutor$Worker.run(ThreadPoolExecutor.java:617)
	at java.lang.Thread.run(Thread.java:745)

-------------------- >> begin captured stdout << ---------------------
Found: https://console.cloud.google.com/dataflow/jobsDetail/locations/us-central1/jobs/2019-07-01_23_15_38-16798764953135447462?project=apache-beam-testing.

--------------------- >> end captured stdout << ----------------------

----------------------------------------------------------------------
XML: <https://builds.apache.org/job/beam_PostCommit_Py_ValCont/ws/src/sdks/python/nosetests.xml>
----------------------------------------------------------------------
Ran 2 tests in 759.003s

FAILED (errors=2)
cleanup_container
Untagged: us.gcr.io/apache-beam-testing/jenkins/python:20190702-060023
Untagged: us.gcr.io/apache-beam-testing/jenkins/python@sha256:be6df43081201e155e10922e14996eaa9d3a8c331c164197bdc41113290c3af4
Deleted: sha256:65d8980123311d1140b92c1a0d0e5691b86fd2fe67f687d3faa442726172e9b2
Deleted: sha256:c696ac47d42e502727f269c1dea8c5bb9893bc59bb58539b00424c75a0866658
Deleted: sha256:7594ff2a57755dfdce8289122874f0183e49fcce938d4e49ea2127b16c0ea782
Deleted: sha256:6eead157217d01d39eb6cdfbdbf7c99385939922d8fca429c4e5e9c0071ab5e7
Deleted: sha256:3717d2f0c8798abf6c081065d528986fbbcb2059aa66601f1375bc113b5c9a4b
Deleted: sha256:6ab4191601820c7da6214672e3abe90712503bc860b7b3a7c1742714d55905ea
Deleted: sha256:77950f714de0b2b2995a4ce0bee10628974cf7bba6f160c34a8c7342dcabc604
Deleted: sha256:f52f90b09c499c82fcaffdd94fbdaea1c87ad1fc0d713f6ebd4d353396b87dff
Deleted: sha256:1f9dadf182b3b8be7a080acba2f90ba998abe040d068def2bf7e4fe1d5d388a4
Deleted: sha256:a91c1868fa4433ced86f7cccb095747db3a80c8d6e2e9f88a8a16476cfcb53fc
Deleted: sha256:e5186993fa8f85e4866f1df7abd7316fe19f30c8fb86d056714b72d59ecee34b
Deleted: sha256:7b65b8fdff3b7f4cbbacecde46e3bdb26adea247a44df313239fbdff8f16b06a
Deleted: sha256:e0c191248619fadb30ddbd39f579084f1cdcd72cbea8ed805a95a4ccdabe2928
Deleted: sha256:4bdc5b374f203bc6ab48a9c0afb3c99dd800a0f238167cae01daa0fe5472d85f
Digests:
- us.gcr.io/apache-beam-testing/jenkins/python@sha256:be6df43081201e155e10922e14996eaa9d3a8c331c164197bdc41113290c3af4
  Associated tags:
 - 20190702-060023
Tags:
- us.gcr.io/apache-beam-testing/jenkins/python:20190702-060023
Deleted [us.gcr.io/apache-beam-testing/jenkins/python:20190702-060023].
Deleted [us.gcr.io/apache-beam-testing/jenkins/python@sha256:be6df43081201e155e10922e14996eaa9d3a8c331c164197bdc41113290c3af4].
Removed the container
Build step 'Execute shell' marked build as failure

---------------------------------------------------------------------
To unsubscribe, e-mail: builds-unsubscribe@beam.apache.org
For additional commands, e-mail: builds-help@beam.apache.org


Mime
View raw message