beam-builds mailing list archives

Site index · List index
Message view « Date » · « Thread »
Top « Date » · « Thread »
From Apache Jenkins Server <jenk...@builds.apache.org>
Subject Build failed in Jenkins: beam_PostCommit_Py_ValCont #3690
Date Mon, 01 Jul 2019 00:22:37 GMT
See <https://builds.apache.org/job/beam_PostCommit_Py_ValCont/3690/display/redirect>

------------------------------------------
[...truncated 208.20 KB...]
copying apache_beam/utils/retry_test.py -> apache-beam-2.15.0.dev0/apache_beam/utils
copying apache_beam/utils/timestamp.py -> apache-beam-2.15.0.dev0/apache_beam/utils
copying apache_beam/utils/timestamp_test.py -> apache-beam-2.15.0.dev0/apache_beam/utils
copying apache_beam/utils/urns.py -> apache-beam-2.15.0.dev0/apache_beam/utils
copying apache_beam/utils/windowed_value.pxd -> apache-beam-2.15.0.dev0/apache_beam/utils
copying apache_beam/utils/windowed_value.py -> apache-beam-2.15.0.dev0/apache_beam/utils
copying apache_beam/utils/windowed_value_test.py -> apache-beam-2.15.0.dev0/apache_beam/utils
Writing apache-beam-2.15.0.dev0/setup.cfg
creating dist
Creating tar archive
removing 'apache-beam-2.15.0.dev0' (and everything under it)
SDK_LOCATION=$(find dist/apache-beam-*.tar.gz)
find dist/apache-beam-*.tar.gz

# Run ValidatesRunner tests on Google Cloud Dataflow service
echo ">>> RUNNING DATAFLOW RUNNER VALIDATESCONTAINER TEST"
>>> RUNNING DATAFLOW RUNNER VALIDATESCONTAINER TEST
python setup.py nosetests \
  --attr ValidatesContainer \
  --nologcapture \
  --processes=1 \
  --process-timeout=900 \
  --test-pipeline-options=" \
    --runner=TestDataflowRunner \
    --project=$PROJECT \
    --worker_harness_container_image=$CONTAINER:$TAG \
    --staging_location=$GCS_LOCATION/staging-validatesrunner-test \
    --temp_location=$GCS_LOCATION/temp-validatesrunner-test \
    --output=$GCS_LOCATION/output \
    --sdk_location=$SDK_LOCATION \
    --num_workers=1"
<https://builds.apache.org/job/beam_PostCommit_Py_ValCont/ws/src/sdks/python/container/venv/python/local/lib/python2.7/site-packages/setuptools/dist.py>:472:
UserWarning: Normalizing '2.15.0.dev' to '2.15.0.dev0'
  normalized_version,
running nosetests
running egg_info
<https://builds.apache.org/job/beam_PostCommit_Py_ValCont/ws/src/sdks/python/gen_protos.py>:57:
UserWarning: Installing grpcio-tools is recommended for development.
  warnings.warn('Installing grpcio-tools is recommended for development.')
writing requirements to apache_beam.egg-info/requires.txt
writing apache_beam.egg-info/PKG-INFO
writing top-level names to apache_beam.egg-info/top_level.txt
writing dependency_links to apache_beam.egg-info/dependency_links.txt
writing entry points to apache_beam.egg-info/entry_points.txt
reading manifest file 'apache_beam.egg-info/SOURCES.txt'
reading manifest template 'MANIFEST.in'
warning: no files found matching 'README.md'
warning: no files found matching 'NOTICE'
warning: no files found matching 'LICENSE'
writing manifest file 'apache_beam.egg-info/SOURCES.txt'
WARNING:root:Using deprecated Datastore client.
This client will be removed in Beam 3.0 (next Beam major release).
Please migrate to apache_beam.io.gcp.datastore.v1new.datastoreio.
WARNING:root:python-snappy is not installed; some tests will be skipped.
WARNING:root:Tensorflow is not installed, so skipping some tests.
test_wordcount_fnapi_it (apache_beam.examples.wordcount_it_test.WordCountIT) ... ERROR
WARNING:root:Discarding unparseable args: ['--output=gs://temp-storage-for-end-to-end-tests/output']
WARNING:root:Discarding unparseable args: ['--output=gs://temp-storage-for-end-to-end-tests/output']
test_metrics_fnapi_it (apache_beam.runners.dataflow.dataflow_exercise_metrics_pipeline_test.ExerciseMetricsPipelineTest)
... ERROR

======================================================================
ERROR: test_wordcount_fnapi_it (apache_beam.examples.wordcount_it_test.WordCountIT)
----------------------------------------------------------------------
Traceback (most recent call last):
  File "<https://builds.apache.org/job/beam_PostCommit_Py_ValCont/ws/src/sdks/python/apache_beam/examples/wordcount_it_test.py",>
line 52, in test_wordcount_fnapi_it
    self._run_wordcount_it(wordcount.run, experiment='beam_fn_api')
  File "<https://builds.apache.org/job/beam_PostCommit_Py_ValCont/ws/src/sdks/python/apache_beam/examples/wordcount_it_test.py",>
line 84, in _run_wordcount_it
    run_wordcount(test_pipeline.get_full_options_as_args(**extra_opts))
  File "<https://builds.apache.org/job/beam_PostCommit_Py_ValCont/ws/src/sdks/python/apache_beam/examples/wordcount.py",>
line 114, in run
    result = p.run()
  File "<https://builds.apache.org/job/beam_PostCommit_Py_ValCont/ws/src/sdks/python/apache_beam/pipeline.py",>
line 406, in run
    self._options).run(False)
  File "<https://builds.apache.org/job/beam_PostCommit_Py_ValCont/ws/src/sdks/python/apache_beam/pipeline.py",>
line 419, in run
    return self.runner.run_pipeline(self, self._options)
  File "<https://builds.apache.org/job/beam_PostCommit_Py_ValCont/ws/src/sdks/python/apache_beam/runners/dataflow/test_dataflow_runner.py",>
line 64, in run_pipeline
    self.result.wait_until_finish(duration=wait_duration)
  File "<https://builds.apache.org/job/beam_PostCommit_Py_ValCont/ws/src/sdks/python/apache_beam/runners/dataflow/dataflow_runner.py",>
line 1338, in wait_until_finish
    (self.state, getattr(self._runner, 'last_error_msg', None)), self)
DataflowRuntimeException: Dataflow pipeline failed. State: FAILED, Error:
java.util.concurrent.ExecutionException: java.lang.RuntimeException: Error received from SDK
harness for instruction -287: Traceback (most recent call last):
  File "/usr/local/lib/python2.7/site-packages/apache_beam/runners/worker/sdk_worker.py",
line 157, in _execute
    response = task()
  File "/usr/local/lib/python2.7/site-packages/apache_beam/runners/worker/sdk_worker.py",
line 190, in <lambda>
    self._execute(lambda: worker.do_instruction(work), work)
  File "/usr/local/lib/python2.7/site-packages/apache_beam/runners/worker/sdk_worker.py",
line 342, in do_instruction
    request.instruction_id)
  File "/usr/local/lib/python2.7/site-packages/apache_beam/runners/worker/sdk_worker.py",
line 368, in process_bundle
    bundle_processor.process_bundle(instruction_id))
  File "/usr/local/lib/python2.7/site-packages/apache_beam/runners/worker/bundle_processor.py",
line 593, in process_bundle
    data.ptransform_id].process_encoded(data.data)
KeyError: u'\n\x04-265\x12\x04-263'

	at java.util.concurrent.CompletableFuture.reportGet(CompletableFuture.java:357)
	at java.util.concurrent.CompletableFuture.get(CompletableFuture.java:1895)
	at org.apache.beam.sdk.util.MoreFutures.get(MoreFutures.java:57)
	at org.apache.beam.runners.dataflow.worker.fn.control.RegisterAndProcessBundleOperation.finish(RegisterAndProcessBundleOperation.java:285)
	at org.apache.beam.runners.dataflow.worker.util.common.worker.MapTaskExecutor.execute(MapTaskExecutor.java:85)
	at org.apache.beam.runners.dataflow.worker.fn.control.BeamFnMapTaskExecutor.execute(BeamFnMapTaskExecutor.java:125)
	at org.apache.beam.runners.dataflow.worker.BatchDataflowWorker.executeWork(BatchDataflowWorker.java:412)
	at org.apache.beam.runners.dataflow.worker.BatchDataflowWorker.doWork(BatchDataflowWorker.java:381)
	at org.apache.beam.runners.dataflow.worker.BatchDataflowWorker.getAndPerformWork(BatchDataflowWorker.java:306)
	at org.apache.beam.runners.dataflow.worker.DataflowRunnerHarness.start(DataflowRunnerHarness.java:195)
	at org.apache.beam.runners.dataflow.worker.DataflowRunnerHarness.main(DataflowRunnerHarness.java:123)
	Suppressed: java.lang.IllegalStateException: Already closed.
		at org.apache.beam.sdk.fn.data.BeamFnDataBufferingOutboundObserver.close(BeamFnDataBufferingOutboundObserver.java:95)
		at org.apache.beam.runners.dataflow.worker.fn.data.RemoteGrpcPortWriteOperation.abort(RemoteGrpcPortWriteOperation.java:215)
		at org.apache.beam.runners.dataflow.worker.util.common.worker.MapTaskExecutor.execute(MapTaskExecutor.java:91)
		... 6 more
Caused by: java.lang.RuntimeException: Error received from SDK harness for instruction -287:
Traceback (most recent call last):
  File "/usr/local/lib/python2.7/site-packages/apache_beam/runners/worker/sdk_worker.py",
line 157, in _execute
    response = task()
  File "/usr/local/lib/python2.7/site-packages/apache_beam/runners/worker/sdk_worker.py",
line 190, in <lambda>
    self._execute(lambda: worker.do_instruction(work), work)
  File "/usr/local/lib/python2.7/site-packages/apache_beam/runners/worker/sdk_worker.py",
line 342, in do_instruction
    request.instruction_id)
  File "/usr/local/lib/python2.7/site-packages/apache_beam/runners/worker/sdk_worker.py",
line 368, in process_bundle
    bundle_processor.process_bundle(instruction_id))
  File "/usr/local/lib/python2.7/site-packages/apache_beam/runners/worker/bundle_processor.py",
line 593, in process_bundle
    data.ptransform_id].process_encoded(data.data)
KeyError: u'\n\x04-265\x12\x04-263'

	at org.apache.beam.runners.fnexecution.control.FnApiControlClient$ResponseStreamObserver.onNext(FnApiControlClient.java:157)
	at org.apache.beam.runners.fnexecution.control.FnApiControlClient$ResponseStreamObserver.onNext(FnApiControlClient.java:140)
	at org.apache.beam.vendor.grpc.v1p13p1.io.grpc.stub.ServerCalls$StreamingServerCallHandler$StreamingServerCallListener.onMessage(ServerCalls.java:248)
	at org.apache.beam.vendor.grpc.v1p13p1.io.grpc.ForwardingServerCallListener.onMessage(ForwardingServerCallListener.java:33)
	at org.apache.beam.vendor.grpc.v1p13p1.io.grpc.Contexts$ContextualizedServerCallListener.onMessage(Contexts.java:76)
	at org.apache.beam.vendor.grpc.v1p13p1.io.grpc.internal.ServerCallImpl$ServerStreamListenerImpl.messagesAvailable(ServerCallImpl.java:263)
	at org.apache.beam.vendor.grpc.v1p13p1.io.grpc.internal.ServerImpl$JumpToApplicationThreadServerStreamListener$1MessagesAvailable.runInContext(ServerImpl.java:683)
	at org.apache.beam.vendor.grpc.v1p13p1.io.grpc.internal.ContextRunnable.run(ContextRunnable.java:37)
	at org.apache.beam.vendor.grpc.v1p13p1.io.grpc.internal.SerializingExecutor.run(SerializingExecutor.java:123)
	at java.util.concurrent.ThreadPoolExecutor.runWorker(ThreadPoolExecutor.java:1142)
	at java.util.concurrent.ThreadPoolExecutor$Worker.run(ThreadPoolExecutor.java:617)
	at java.lang.Thread.run(Thread.java:745)

-------------------- >> begin captured stdout << ---------------------
Found: https://console.cloud.google.com/dataflow/jobsDetail/locations/us-central1/jobs/2019-06-30_17_08_40-5841956548398661571?project=apache-beam-testing.

--------------------- >> end captured stdout << ----------------------

======================================================================
ERROR: test_metrics_fnapi_it (apache_beam.runners.dataflow.dataflow_exercise_metrics_pipeline_test.ExerciseMetricsPipelineTest)
----------------------------------------------------------------------
Traceback (most recent call last):
  File "<https://builds.apache.org/job/beam_PostCommit_Py_ValCont/ws/src/sdks/python/apache_beam/runners/dataflow/dataflow_exercise_metrics_pipeline_test.py",>
line 60, in test_metrics_fnapi_it
    result = self.run_pipeline(experiment='beam_fn_api')
  File "<https://builds.apache.org/job/beam_PostCommit_Py_ValCont/ws/src/sdks/python/apache_beam/runners/dataflow/dataflow_exercise_metrics_pipeline_test.py",>
line 48, in run_pipeline
    return dataflow_exercise_metrics_pipeline.apply_and_run(p)
  File "<https://builds.apache.org/job/beam_PostCommit_Py_ValCont/ws/src/sdks/python/apache_beam/runners/dataflow/dataflow_exercise_metrics_pipeline.py",>
line 197, in apply_and_run
    result = pipeline.run()
  File "<https://builds.apache.org/job/beam_PostCommit_Py_ValCont/ws/src/sdks/python/apache_beam/pipeline.py",>
line 406, in run
    self._options).run(False)
  File "<https://builds.apache.org/job/beam_PostCommit_Py_ValCont/ws/src/sdks/python/apache_beam/pipeline.py",>
line 419, in run
    return self.runner.run_pipeline(self, self._options)
  File "<https://builds.apache.org/job/beam_PostCommit_Py_ValCont/ws/src/sdks/python/apache_beam/runners/dataflow/test_dataflow_runner.py",>
line 64, in run_pipeline
    self.result.wait_until_finish(duration=wait_duration)
  File "<https://builds.apache.org/job/beam_PostCommit_Py_ValCont/ws/src/sdks/python/apache_beam/runners/dataflow/dataflow_runner.py",>
line 1338, in wait_until_finish
    (self.state, getattr(self._runner, 'last_error_msg', None)), self)
DataflowRuntimeException: Dataflow pipeline failed. State: FAILED, Error:
java.util.concurrent.ExecutionException: java.lang.RuntimeException: Error received from SDK
harness for instruction -129: Traceback (most recent call last):
  File "/usr/local/lib/python2.7/site-packages/apache_beam/runners/worker/sdk_worker.py",
line 157, in _execute
    response = task()
  File "/usr/local/lib/python2.7/site-packages/apache_beam/runners/worker/sdk_worker.py",
line 190, in <lambda>
    self._execute(lambda: worker.do_instruction(work), work)
  File "/usr/local/lib/python2.7/site-packages/apache_beam/runners/worker/sdk_worker.py",
line 342, in do_instruction
    request.instruction_id)
  File "/usr/local/lib/python2.7/site-packages/apache_beam/runners/worker/sdk_worker.py",
line 368, in process_bundle
    bundle_processor.process_bundle(instruction_id))
  File "/usr/local/lib/python2.7/site-packages/apache_beam/runners/worker/bundle_processor.py",
line 593, in process_bundle
    data.ptransform_id].process_encoded(data.data)
KeyError: u'\n\x04-107\x12\x04-105'

	at java.util.concurrent.CompletableFuture.reportGet(CompletableFuture.java:357)
	at java.util.concurrent.CompletableFuture.get(CompletableFuture.java:1895)
	at org.apache.beam.sdk.util.MoreFutures.get(MoreFutures.java:57)
	at org.apache.beam.runners.dataflow.worker.fn.control.RegisterAndProcessBundleOperation.finish(RegisterAndProcessBundleOperation.java:285)
	at org.apache.beam.runners.dataflow.worker.util.common.worker.MapTaskExecutor.execute(MapTaskExecutor.java:85)
	at org.apache.beam.runners.dataflow.worker.fn.control.BeamFnMapTaskExecutor.execute(BeamFnMapTaskExecutor.java:125)
	at org.apache.beam.runners.dataflow.worker.BatchDataflowWorker.executeWork(BatchDataflowWorker.java:412)
	at org.apache.beam.runners.dataflow.worker.BatchDataflowWorker.doWork(BatchDataflowWorker.java:381)
	at org.apache.beam.runners.dataflow.worker.BatchDataflowWorker.getAndPerformWork(BatchDataflowWorker.java:306)
	at org.apache.beam.runners.dataflow.worker.DataflowRunnerHarness.start(DataflowRunnerHarness.java:195)
	at org.apache.beam.runners.dataflow.worker.DataflowRunnerHarness.main(DataflowRunnerHarness.java:123)
	Suppressed: java.lang.IllegalStateException: Already closed.
		at org.apache.beam.sdk.fn.data.BeamFnDataBufferingOutboundObserver.close(BeamFnDataBufferingOutboundObserver.java:95)
		at org.apache.beam.runners.dataflow.worker.fn.data.RemoteGrpcPortWriteOperation.abort(RemoteGrpcPortWriteOperation.java:215)
		at org.apache.beam.runners.dataflow.worker.util.common.worker.MapTaskExecutor.execute(MapTaskExecutor.java:91)
		... 6 more
Caused by: java.lang.RuntimeException: Error received from SDK harness for instruction -129:
Traceback (most recent call last):
  File "/usr/local/lib/python2.7/site-packages/apache_beam/runners/worker/sdk_worker.py",
line 157, in _execute
    response = task()
  File "/usr/local/lib/python2.7/site-packages/apache_beam/runners/worker/sdk_worker.py",
line 190, in <lambda>
    self._execute(lambda: worker.do_instruction(work), work)
  File "/usr/local/lib/python2.7/site-packages/apache_beam/runners/worker/sdk_worker.py",
line 342, in do_instruction
    request.instruction_id)
  File "/usr/local/lib/python2.7/site-packages/apache_beam/runners/worker/sdk_worker.py",
line 368, in process_bundle
    bundle_processor.process_bundle(instruction_id))
  File "/usr/local/lib/python2.7/site-packages/apache_beam/runners/worker/bundle_processor.py",
line 593, in process_bundle
    data.ptransform_id].process_encoded(data.data)
KeyError: u'\n\x04-107\x12\x04-105'

	at org.apache.beam.runners.fnexecution.control.FnApiControlClient$ResponseStreamObserver.onNext(FnApiControlClient.java:157)
	at org.apache.beam.runners.fnexecution.control.FnApiControlClient$ResponseStreamObserver.onNext(FnApiControlClient.java:140)
	at org.apache.beam.vendor.grpc.v1p13p1.io.grpc.stub.ServerCalls$StreamingServerCallHandler$StreamingServerCallListener.onMessage(ServerCalls.java:248)
	at org.apache.beam.vendor.grpc.v1p13p1.io.grpc.ForwardingServerCallListener.onMessage(ForwardingServerCallListener.java:33)
	at org.apache.beam.vendor.grpc.v1p13p1.io.grpc.Contexts$ContextualizedServerCallListener.onMessage(Contexts.java:76)
	at org.apache.beam.vendor.grpc.v1p13p1.io.grpc.internal.ServerCallImpl$ServerStreamListenerImpl.messagesAvailable(ServerCallImpl.java:263)
	at org.apache.beam.vendor.grpc.v1p13p1.io.grpc.internal.ServerImpl$JumpToApplicationThreadServerStreamListener$1MessagesAvailable.runInContext(ServerImpl.java:683)
	at org.apache.beam.vendor.grpc.v1p13p1.io.grpc.internal.ContextRunnable.run(ContextRunnable.java:37)
	at org.apache.beam.vendor.grpc.v1p13p1.io.grpc.internal.SerializingExecutor.run(SerializingExecutor.java:123)
	at java.util.concurrent.ThreadPoolExecutor.runWorker(ThreadPoolExecutor.java:1142)
	at java.util.concurrent.ThreadPoolExecutor$Worker.run(ThreadPoolExecutor.java:617)
	at java.lang.Thread.run(Thread.java:745)

-------------------- >> begin captured stdout << ---------------------
Found: https://console.cloud.google.com/dataflow/jobsDetail/locations/us-central1/jobs/2019-06-30_17_15_18-9595244814895190416?project=apache-beam-testing.

--------------------- >> end captured stdout << ----------------------

----------------------------------------------------------------------
XML: <https://builds.apache.org/job/beam_PostCommit_Py_ValCont/ws/src/sdks/python/nosetests.xml>
----------------------------------------------------------------------
Ran 2 tests in 834.855s

FAILED (errors=2)
cleanup_container
Untagged: us.gcr.io/apache-beam-testing/jenkins/python:20190701-000011
Untagged: us.gcr.io/apache-beam-testing/jenkins/python@sha256:49b2308e16160caffc3a28844c416bcf4c15956f7d62fe6e2ab51ee01d96a099
Deleted: sha256:8d280d7b7add44d2ef30497b36cf2fa2fff994dfafbe5e8ec8219a107b9367fa
Deleted: sha256:cb725cf14df23395fbe76ca5c2b11f36aace779bee2a0175aeefaa055039331b
Deleted: sha256:42452f4a77b4f5cf1e99ebc515d59dd0894cd0701de4fd462c47de1db79938c7
Deleted: sha256:7bafa6927e6e1c0f19d1a76230c63357f4b8c02bfea9b2c21337416bb9f736de
Deleted: sha256:a2568e9505cd398d11fd2eefb0dc8e47376b198115d636f2dbf6027ba5dcd4d3
Deleted: sha256:eb65768305fc58bcff9ad53a6268dce30ddc3ee7556c485ee9f5542ca8d91fb5
Deleted: sha256:d73d873432e63818b7a5d73caa6ad20402b2a39c89ad02edcf5771b06a0c7244
Deleted: sha256:584d02c9b4159e7cb33c6af2c4235622a1027fecf8656f2d0a4009218886d54b
Deleted: sha256:ebe490b933ee76d0b730a58a8a8f6b079440c56648c2ed6058b02378f025fd7f
Deleted: sha256:deb85116ef90b17cbae518ede474e398aea13eaea1c55bac732534bb0b500561
Deleted: sha256:28eecb78824dec7e485c349d23ac82381cb16372d2a71802e7817d9bd2e32621
Deleted: sha256:ddd0019b44082950ab776340e30cbdedbe0c7ba60bd6e9666ebb338260ca49e2
Deleted: sha256:3ed29f0290107e00643f393121816f99cb78591ad6dd1811b0b0119614fa83f4
Deleted: sha256:857cf3e906bf9cdf5dc9860d861e9aad6fc9fa31b4ad80279326f1dd45697b54
Digests:
- us.gcr.io/apache-beam-testing/jenkins/python@sha256:49b2308e16160caffc3a28844c416bcf4c15956f7d62fe6e2ab51ee01d96a099
  Associated tags:
 - 20190701-000011
Tags:
- us.gcr.io/apache-beam-testing/jenkins/python:20190701-000011
Deleted [us.gcr.io/apache-beam-testing/jenkins/python:20190701-000011].
Deleted [us.gcr.io/apache-beam-testing/jenkins/python@sha256:49b2308e16160caffc3a28844c416bcf4c15956f7d62fe6e2ab51ee01d96a099].
Removed the container
Build step 'Execute shell' marked build as failure

---------------------------------------------------------------------
To unsubscribe, e-mail: builds-unsubscribe@beam.apache.org
For additional commands, e-mail: builds-help@beam.apache.org


Mime
View raw message