beam-builds mailing list archives

Site index · List index
Message view « Date » · « Thread »
Top « Date » · « Thread »
From Apache Jenkins Server <jenk...@builds.apache.org>
Subject Build failed in Jenkins: beam_PerformanceTests_WordCountIT_Py36 #192
Date Mon, 08 Jul 2019 18:57:28 GMT
See <https://builds.apache.org/job/beam_PerformanceTests_WordCountIT_Py36/192/display/redirect>

------------------------------------------
[...truncated 40.98 KB...]
Collecting grpcio-tools==1.3.5
  Using cached https://files.pythonhosted.org/packages/7b/67/a76eb2d67ff21352a728d80fd09e012f1074707578a17676553db810c26c/grpcio_tools-1.3.5-cp36-cp36m-manylinux1_x86_64.whl
Collecting toml>=0.9.4 (from tox==3.11.1)
  Using cached https://files.pythonhosted.org/packages/a2/12/ced7105d2de62fa7c8fb5fce92cc4ce66b57c95fb875e9318dba7f8c5db0/toml-0.10.0-py2.py3-none-any.whl
Collecting virtualenv>=14.0.0 (from tox==3.11.1)
  Using cached https://files.pythonhosted.org/packages/c4/9a/a3f62ac5122a65dec34ad4b5ed8d802633dae4bc06a0fc62e55fe3e96fe1/virtualenv-16.6.1-py2.py3-none-any.whl
Collecting py<2,>=1.4.17 (from tox==3.11.1)
  Using cached https://files.pythonhosted.org/packages/76/bc/394ad449851729244a97857ee14d7cba61ddb268dce3db538ba2f2ba1f0f/py-1.8.0-py2.py3-none-any.whl
Collecting filelock<4,>=3.0.0 (from tox==3.11.1)
  Using cached https://files.pythonhosted.org/packages/93/83/71a2ee6158bb9f39a90c0dea1637f81d5eef866e188e1971a1b1ab01a35a/filelock-3.0.12-py3-none-any.whl
Collecting pluggy<1,>=0.3.0 (from tox==3.11.1)
  Using cached https://files.pythonhosted.org/packages/06/ee/de89e0582276e3551df3110088bf20844de2b0e7df2748406876cc78e021/pluggy-0.12.0-py2.py3-none-any.whl
Collecting six<2,>=1.0.0 (from tox==3.11.1)
  Using cached https://files.pythonhosted.org/packages/73/fb/00a976f728d0d1fecfe898238ce23f502a721c0ac0ecfedb80e0d88c64e9/six-1.12.0-py2.py3-none-any.whl
Requirement already satisfied, skipping upgrade: setuptools>=30.0.0 in <https://builds.apache.org/job/beam_PerformanceTests_WordCountIT_Py36/ws/src/build/gradleenv/-1734967053/lib/python3.6/site-packages>
(from tox==3.11.1) (41.0.1)
Collecting protobuf>=3.2.0 (from grpcio-tools==1.3.5)
  Using cached https://files.pythonhosted.org/packages/d2/fb/29de8d08967f0cce1bb10b39846d836b0f3bf6776ddc36aed7c73498ca7e/protobuf-3.8.0-cp36-cp36m-manylinux1_x86_64.whl
Collecting grpcio>=1.3.5 (from grpcio-tools==1.3.5)
  Using cached https://files.pythonhosted.org/packages/f2/5d/b434403adb2db8853a97828d3d19f2032e79d630e0d11a8e95d243103a11/grpcio-1.22.0-cp36-cp36m-manylinux1_x86_64.whl
Collecting importlib-metadata>=0.12 (from pluggy<1,>=0.3.0->tox==3.11.1)
  Using cached https://files.pythonhosted.org/packages/bd/23/dce4879ec58acf3959580bfe769926ed8198727250c5e395e6785c764a02/importlib_metadata-0.18-py2.py3-none-any.whl
Collecting zipp>=0.5 (from importlib-metadata>=0.12->pluggy<1,>=0.3.0->tox==3.11.1)
  Using cached https://files.pythonhosted.org/packages/da/bd/1a5fdf15aa44231fd09f63ecf175b60f057ae37ec65b343bb009364923f3/zipp-0.5.2-py2.py3-none-any.whl
Installing collected packages: toml, virtualenv, py, filelock, zipp, importlib-metadata, pluggy,
six, tox, protobuf, grpcio, grpcio-tools
Successfully installed filelock-3.0.12 grpcio-1.22.0 grpcio-tools-1.3.5 importlib-metadata-0.18
pluggy-0.12.0 protobuf-3.8.0 py-1.8.0 six-1.12.0 toml-0.10.0 tox-3.11.1 virtualenv-16.6.1
zipp-0.5.2
:sdks:python:test-suites:dataflow:py36:setupVirtualenv (Thread[Execution worker for ':' Thread
3,5,main]) completed. Took 13.131 secs.
:sdks:python:test-suites:dataflow:py36:sdist (Thread[Execution worker for ':' Thread 3,5,main])
started.

> Task :sdks:python:test-suites:dataflow:py36:sdist
Build cache key for task ':sdks:python:test-suites:dataflow:py36:sdist' is 11215b16930deee3d713241fed0285e5
Caching disabled for task ':sdks:python:test-suites:dataflow:py36:sdist': Caching has not
been enabled for the task
Task ':sdks:python:test-suites:dataflow:py36:sdist' is not up-to-date because:
  No history is available.
Custom actions are attached to task ':sdks:python:test-suites:dataflow:py36:sdist'.
Starting process 'command 'sh''. Working directory: <https://builds.apache.org/job/beam_PerformanceTests_WordCountIT_Py36/ws/src/sdks/python/test-suites/dataflow/py36>
Command: sh -c . <https://builds.apache.org/job/beam_PerformanceTests_WordCountIT_Py36/ws/src/build/gradleenv/-1734967053/bin/activate>
&& cd <https://builds.apache.org/job/beam_PerformanceTests_WordCountIT_Py36/ws/src/sdks/python/test-suites/dataflow/py36/build/srcs/sdks/python>
&& python setup.py -q sdist --formats zip,gztar --dist-dir <https://builds.apache.org/job/beam_PerformanceTests_WordCountIT_Py36/ws/src/sdks/python/test-suites/dataflow/py36/build>
Successfully started process 'command 'sh''
Collecting future==0.16.0
Installing collected packages: future
Successfully installed future-0.16.0
:sdks:python:test-suites:dataflow:py36:sdist (Thread[Execution worker for ':' Thread 3,5,main])
completed. Took 6.457 secs.
:sdks:python:test-suites:dataflow:py36:installGcpTest (Thread[Execution worker for ':' Thread
3,5,main]) started.

> Task :sdks:python:test-suites:dataflow:py36:installGcpTest
Caching disabled for task ':sdks:python:test-suites:dataflow:py36:installGcpTest': Caching
has not been enabled for the task
Task ':sdks:python:test-suites:dataflow:py36:installGcpTest' is not up-to-date because:
  Task has not declared any outputs despite executing actions.
Custom actions are attached to task ':sdks:python:test-suites:dataflow:py36:installGcpTest'.
Starting process 'command 'sh''. Working directory: <https://builds.apache.org/job/beam_PerformanceTests_WordCountIT_Py36/ws/src/sdks/python/test-suites/dataflow/py36>
Command: sh -c . <https://builds.apache.org/job/beam_PerformanceTests_WordCountIT_Py36/ws/src/build/gradleenv/-1734967053/bin/activate>
&& pip install --retries 10 -e <https://builds.apache.org/job/beam_PerformanceTests_WordCountIT_Py36/ws/src/sdks/python/[gcp,test]>
Successfully started process 'command 'sh''
Obtaining file://<https://builds.apache.org/job/beam_PerformanceTests_WordCountIT_Py36/ws/src/sdks/python>
Collecting crcmod<2.0,>=1.7 (from apache-beam==2.15.0.dev0)
Collecting dill<0.2.10,>=0.2.9 (from apache-beam==2.15.0.dev0)
Collecting fastavro<0.22,>=0.21.4 (from apache-beam==2.15.0.dev0)
  Using cached https://files.pythonhosted.org/packages/e1/28/0206330c0002b1e28e21473117d0dc813defbd5891562d27af5c68c93899/fastavro-0.21.24-cp36-cp36m-manylinux1_x86_64.whl
Requirement already satisfied: future<1.0.0,>=0.16.0 in <https://builds.apache.org/job/beam_PerformanceTests_WordCountIT_Py36/ws/src/build/gradleenv/-1734967053/lib/python3.6/site-packages>
(from apache-beam==2.15.0.dev0) (0.16.0)
Requirement already satisfied: grpcio<2,>=1.8 in <https://builds.apache.org/job/beam_PerformanceTests_WordCountIT_Py36/ws/src/build/gradleenv/-1734967053/lib/python3.6/site-packages>
(from apache-beam==2.15.0.dev0) (1.22.0)
Collecting hdfs<3.0.0,>=2.1.0 (from apache-beam==2.15.0.dev0)
Collecting httplib2<=0.12.0,>=0.8 (from apache-beam==2.15.0.dev0)
Collecting mock<3.0.0,>=1.0.1 (from apache-beam==2.15.0.dev0)
  Using cached https://files.pythonhosted.org/packages/e6/35/f187bdf23be87092bd0f1200d43d23076cee4d0dec109f195173fd3ebc79/mock-2.0.0-py2.py3-none-any.whl
Collecting pymongo<4.0.0,>=3.8.0 (from apache-beam==2.15.0.dev0)
  Using cached https://files.pythonhosted.org/packages/fb/4a/586826433281ca285f0201235fccf63cc29a30fa78bcd72b6a34e365972d/pymongo-3.8.0-cp36-cp36m-manylinux1_x86_64.whl
Collecting oauth2client<4,>=2.0.1 (from apache-beam==2.15.0.dev0)
Requirement already satisfied: protobuf<4,>=3.5.0.post1 in <https://builds.apache.org/job/beam_PerformanceTests_WordCountIT_Py36/ws/src/build/gradleenv/-1734967053/lib/python3.6/site-packages>
(from apache-beam==2.15.0.dev0) (3.8.0)
Collecting pydot<1.3,>=1.2.0 (from apache-beam==2.15.0.dev0)
Collecting pytz>=2018.3 (from apache-beam==2.15.0.dev0)
  Using cached https://files.pythonhosted.org/packages/3d/73/fe30c2daaaa0713420d0382b16fbb761409f532c56bdcc514bf7b6262bb6/pytz-2019.1-py2.py3-none-any.whl
Collecting pyyaml<4.0.0,>=3.12 (from apache-beam==2.15.0.dev0)
Collecting avro-python3<2.0.0,>=1.8.1 (from apache-beam==2.15.0.dev0)
Collecting pyarrow<0.14.0,>=0.11.1 (from apache-beam==2.15.0.dev0)
  Using cached https://files.pythonhosted.org/packages/ad/25/094b122d828d24b58202712a74e661e36cd551ca62d331e388ff68bae91d/pyarrow-0.13.0-cp36-cp36m-manylinux1_x86_64.whl
Collecting cachetools<4,>=3.1.0 (from apache-beam==2.15.0.dev0)
  Using cached https://files.pythonhosted.org/packages/2f/a6/30b0a0bef12283e83e58c1d6e7b5aabc7acfc4110df81a4471655d33e704/cachetools-3.1.1-py2.py3-none-any.whl
Collecting google-apitools<0.5.29,>=0.5.28 (from apache-beam==2.15.0.dev0)
Collecting google-cloud-datastore<1.8.0,>=1.7.1 (from apache-beam==2.15.0.dev0)
  Using cached https://files.pythonhosted.org/packages/d0/aa/29cbcf8cf7d08ce2d55b9dce858f7c632b434cb6451bed17cb4275804217/google_cloud_datastore-1.7.4-py2.py3-none-any.whl
Collecting google-cloud-pubsub<0.40.0,>=0.39.0 (from apache-beam==2.15.0.dev0)
  Using cached https://files.pythonhosted.org/packages/c0/9a/4455b1c1450e9b912855b58ca6eee7a27ff1e9b52e4d98c243d93256f469/google_cloud_pubsub-0.39.1-py2.py3-none-any.whl
Collecting google-cloud-bigquery<1.7.0,>=1.6.0 (from apache-beam==2.15.0.dev0)
  Using cached https://files.pythonhosted.org/packages/b7/1b/2b95f2fefddbbece38110712c225bfb5649206f4056445653bd5ca4dc86d/google_cloud_bigquery-1.6.1-py2.py3-none-any.whl
Collecting google-cloud-core<0.30.0,>=0.28.1 (from apache-beam==2.15.0.dev0)
  Using cached https://files.pythonhosted.org/packages/0c/f2/3c225e7a69cb27d283b68bff867722bd066bc1858611180197f711815ea5/google_cloud_core-0.29.1-py2.py3-none-any.whl
Collecting google-cloud-bigtable<0.33.0,>=0.31.1 (from apache-beam==2.15.0.dev0)
  Using cached https://files.pythonhosted.org/packages/08/77/b468e209dbb0a6f614e6781f06a4894299a4c6167c2c525cc086caa7c075/google_cloud_bigtable-0.32.2-py2.py3-none-any.whl
Collecting nose>=1.3.7 (from apache-beam==2.15.0.dev0)
  Using cached https://files.pythonhosted.org/packages/15/d8/dd071918c040f50fa1cf80da16423af51ff8ce4a0f2399b7bf8de45ac3d9/nose-1.3.7-py3-none-any.whl
Collecting numpy<2,>=1.14.3 (from apache-beam==2.15.0.dev0)
  Using cached https://files.pythonhosted.org/packages/87/2d/e4656149cbadd3a8a0369fcd1a9c7d61cc7b87b3903b85389c70c989a696/numpy-1.16.4-cp36-cp36m-manylinux1_x86_64.whl
Collecting pandas<0.24,>=0.23.4 (from apache-beam==2.15.0.dev0)
  Using cached https://files.pythonhosted.org/packages/e1/d8/feeb346d41f181e83fba45224ab14a8d8af019b48af742e047f3845d8cff/pandas-0.23.4-cp36-cp36m-manylinux1_x86_64.whl
Collecting parameterized<0.7.0,>=0.6.0 (from apache-beam==2.15.0.dev0)
  Using cached https://files.pythonhosted.org/packages/3a/49/75f6dadb09e2f8ace3cdffe0c99a04f1b98dff41fbf9e768665d8b469e29/parameterized-0.6.3-py2.py3-none-any.whl
Collecting pyhamcrest<2.0,>=1.9 (from apache-beam==2.15.0.dev0)
  Using cached https://files.pythonhosted.org/packages/9a/d5/d37fd731b7d0e91afcc84577edeccf4638b4f9b82f5ffe2f8b62e2ddc609/PyHamcrest-1.9.0-py2.py3-none-any.whl
Collecting tenacity<6.0,>=5.0.2 (from apache-beam==2.15.0.dev0)
  Using cached https://files.pythonhosted.org/packages/6a/93/dfcf5b1b46ab29196274b78dcba69fab5e54b6dc303a7eed90a79194d277/tenacity-5.0.4-py2.py3-none-any.whl
Requirement already satisfied: six>=1.5.2 in <https://builds.apache.org/job/beam_PerformanceTests_WordCountIT_Py36/ws/src/build/gradleenv/-1734967053/lib/python3.6/site-packages>
(from grpcio<2,>=1.8->apache-beam==2.15.0.dev0) (1.12.0)
Collecting requests>=2.7.0 (from hdfs<3.0.0,>=2.1.0->apache-beam==2.15.0.dev0)
  Using cached https://files.pythonhosted.org/packages/51/bd/23c926cd341ea6b7dd0b2a00aba99ae0f828be89d72b2190f27c11d4b7fb/requests-2.22.0-py2.py3-none-any.whl
Collecting docopt (from hdfs<3.0.0,>=2.1.0->apache-beam==2.15.0.dev0)
Collecting pbr>=0.11 (from mock<3.0.0,>=1.0.1->apache-beam==2.15.0.dev0)
  Using cached https://files.pythonhosted.org/packages/f1/f3/9c1fa6496f0adf575441eda21baa6d936395df6c8473c8465d2c525585f6/pbr-5.4.0-py2.py3-none-any.whl
Collecting pyasn1>=0.1.7 (from oauth2client<4,>=2.0.1->apache-beam==2.15.0.dev0)
  Using cached https://files.pythonhosted.org/packages/7b/7c/c9386b82a25115cccf1903441bba3cbadcfae7b678a20167347fa8ded34c/pyasn1-0.4.5-py2.py3-none-any.whl
Collecting rsa>=3.1.4 (from oauth2client<4,>=2.0.1->apache-beam==2.15.0.dev0)
  Using cached https://files.pythonhosted.org/packages/02/e5/38518af393f7c214357079ce67a317307936896e961e35450b70fad2a9cf/rsa-4.0-py2.py3-none-any.whl
Collecting pyasn1-modules>=0.0.5 (from oauth2client<4,>=2.0.1->apache-beam==2.15.0.dev0)
  Using cached https://files.pythonhosted.org/packages/91/f0/b03e00ce9fddf4827c42df1c3ce10c74eadebfb706231e8d6d1c356a4062/pyasn1_modules-0.2.5-py2.py3-none-any.whl
Requirement already satisfied: setuptools in <https://builds.apache.org/job/beam_PerformanceTests_WordCountIT_Py36/ws/src/build/gradleenv/-1734967053/lib/python3.6/site-packages>
(from protobuf<4,>=3.5.0.post1->apache-beam==2.15.0.dev0) (41.0.1)
Collecting pyparsing>=2.1.4 (from pydot<1.3,>=1.2.0->apache-beam==2.15.0.dev0)
  Using cached https://files.pythonhosted.org/packages/dd/d9/3ec19e966301a6e25769976999bd7bbe552016f0d32b577dc9d63d2e0c49/pyparsing-2.4.0-py2.py3-none-any.whl
Collecting fasteners>=0.14 (from google-apitools<0.5.29,>=0.5.28->apache-beam==2.15.0.dev0)
  Using cached https://files.pythonhosted.org/packages/18/bd/55eb2d6397b9c0e263af9d091ebdb756b15756029b3cededf6461481bc63/fasteners-0.15-py2.py3-none-any.whl
Collecting google-api-core[grpc]<2.0.0dev,>=1.6.0 (from google-cloud-datastore<1.8.0,>=1.7.1->apache-beam==2.15.0.dev0)
  Using cached https://files.pythonhosted.org/packages/a2/78/bbd685dda48a291b4cc81568ed3e1a89af7a61958dc88a3d52a819b1919d/google_api_core-1.13.0-py2.py3-none-any.whl
Collecting grpc-google-iam-v1<0.12dev,>=0.11.4 (from google-cloud-pubsub<0.40.0,>=0.39.0->apache-beam==2.15.0.dev0)
Collecting google-resumable-media>=0.2.1 (from google-cloud-bigquery<1.7.0,>=1.6.0->apache-beam==2.15.0.dev0)
  Using cached https://files.pythonhosted.org/packages/e2/5d/4bc5c28c252a62efe69ed1a1561da92bd5af8eca0cdcdf8e60354fae9b29/google_resumable_media-0.3.2-py2.py3-none-any.whl
Collecting python-dateutil>=2.5.0 (from pandas<0.24,>=0.23.4->apache-beam==2.15.0.dev0)
  Using cached https://files.pythonhosted.org/packages/41/17/c62faccbfbd163c7f57f3844689e3a78bae1f403648a6afb1d0866d87fbb/python_dateutil-2.8.0-py2.py3-none-any.whl
Collecting chardet<3.1.0,>=3.0.2 (from requests>=2.7.0->hdfs<3.0.0,>=2.1.0->apache-beam==2.15.0.dev0)
  Using cached https://files.pythonhosted.org/packages/bc/a9/01ffebfb562e4274b6487b4bb1ddec7ca55ec7510b22e4c51f14098443b8/chardet-3.0.4-py2.py3-none-any.whl
Collecting certifi>=2017.4.17 (from requests>=2.7.0->hdfs<3.0.0,>=2.1.0->apache-beam==2.15.0.dev0)
  Using cached https://files.pythonhosted.org/packages/69/1b/b853c7a9d4f6a6d00749e94eb6f3a041e342a885b87340b79c1ef73e3a78/certifi-2019.6.16-py2.py3-none-any.whl
Collecting urllib3!=1.25.0,!=1.25.1,<1.26,>=1.21.1 (from requests>=2.7.0->hdfs<3.0.0,>=2.1.0->apache-beam==2.15.0.dev0)
  Using cached https://files.pythonhosted.org/packages/e6/60/247f23a7121ae632d62811ba7f273d0e58972d75e58a94d329d51550a47d/urllib3-1.25.3-py2.py3-none-any.whl
Collecting idna<2.9,>=2.5 (from requests>=2.7.0->hdfs<3.0.0,>=2.1.0->apache-beam==2.15.0.dev0)
  Using cached https://files.pythonhosted.org/packages/14/2c/cd551d81dbe15200be1cf41cd03869a46fe7226e7450af7a6545bfc474c9/idna-2.8-py2.py3-none-any.whl
Collecting monotonic>=0.1 (from fasteners>=0.14->google-apitools<0.5.29,>=0.5.28->apache-beam==2.15.0.dev0)
  Using cached https://files.pythonhosted.org/packages/ac/aa/063eca6a416f397bd99552c534c6d11d57f58f2e94c14780f3bbf818c4cf/monotonic-1.5-py2.py3-none-any.whl
Collecting googleapis-common-protos!=1.5.4,<2.0dev,>=1.5.3 (from google-api-core[grpc]<2.0.0dev,>=1.6.0->google-cloud-datastore<1.8.0,>=1.7.1->apache-beam==2.15.0.dev0)
Collecting google-auth<2.0dev,>=0.4.0 (from google-api-core[grpc]<2.0.0dev,>=1.6.0->google-cloud-datastore<1.8.0,>=1.7.1->apache-beam==2.15.0.dev0)
  Using cached https://files.pythonhosted.org/packages/c5/9b/ed0516cc1f7609fb0217e3057ff4f0f9f3e3ce79a369c6af4a6c5ca25664/google_auth-1.6.3-py2.py3-none-any.whl
Installing collected packages: crcmod, dill, fastavro, chardet, certifi, urllib3, idna, requests,
docopt, hdfs, httplib2, pbr, mock, pymongo, pyasn1, rsa, pyasn1-modules, oauth2client, pyparsing,
pydot, pytz, pyyaml, avro-python3, numpy, pyarrow, cachetools, monotonic, fasteners, google-apitools,
googleapis-common-protos, google-auth, google-api-core, google-cloud-core, google-cloud-datastore,
grpc-google-iam-v1, google-cloud-pubsub, google-resumable-media, google-cloud-bigquery, google-cloud-bigtable,
nose, python-dateutil, pandas, parameterized, pyhamcrest, tenacity, apache-beam
  Running setup.py develop for apache-beam
Successfully installed apache-beam avro-python3-1.9.0 cachetools-3.1.1 certifi-2019.6.16 chardet-3.0.4
crcmod-1.7 dill-0.2.9 docopt-0.6.2 fastavro-0.21.24 fasteners-0.15 google-api-core-1.13.0
google-apitools-0.5.28 google-auth-1.6.3 google-cloud-bigquery-1.6.1 google-cloud-bigtable-0.32.2
google-cloud-core-0.29.1 google-cloud-datastore-1.7.4 google-cloud-pubsub-0.39.1 google-resumable-media-0.3.2
googleapis-common-protos-1.6.0 grpc-google-iam-v1-0.11.4 hdfs-2.5.8 httplib2-0.12.0 idna-2.8
mock-2.0.0 monotonic-1.5 nose-1.3.7 numpy-1.16.4 oauth2client-3.0.0 pandas-0.23.4 parameterized-0.6.3
pbr-5.4.0 pyarrow-0.13.0 pyasn1-0.4.5 pyasn1-modules-0.2.5 pydot-1.2.4 pyhamcrest-1.9.0 pymongo-3.8.0
pyparsing-2.4.0 python-dateutil-2.8.0 pytz-2019.1 pyyaml-3.13 requests-2.22.0 rsa-4.0 tenacity-5.0.4
urllib3-1.25.3
:sdks:python:test-suites:dataflow:py36:installGcpTest (Thread[Execution worker for ':' Thread
3,5,main]) completed. Took 20.695 secs.
:sdks:python:test-suites:dataflow:py36:integrationTest (Thread[Execution worker for ':' Thread
3,5,main]) started.

> Task :sdks:python:test-suites:dataflow:py36:integrationTest
Caching disabled for task ':sdks:python:test-suites:dataflow:py36:integrationTest': Caching
has not been enabled for the task
Task ':sdks:python:test-suites:dataflow:py36:integrationTest' is not up-to-date because:
  Task has not declared any outputs despite executing actions.
Custom actions are attached to task ':sdks:python:test-suites:dataflow:py36:integrationTest'.
Starting process 'command 'sh''. Working directory: <https://builds.apache.org/job/beam_PerformanceTests_WordCountIT_Py36/ws/src/sdks/python/test-suites/dataflow/py36>
Command: sh -c . <https://builds.apache.org/job/beam_PerformanceTests_WordCountIT_Py36/ws/src/build/gradleenv/-1734967053/bin/activate>
&& <https://builds.apache.org/job/beam_PerformanceTests_WordCountIT_Py36/ws/src/sdks/python/scripts/run_integration_test.sh>
--test_opts "--tests=apache_beam.examples.wordcount_it_test:WordCountIT.test_wordcount_it
--attr=IT --nocapture" --pipeline_opts "--project=apache-beam-testing --staging_location=gs://temp-storage-for-end-to-end-tests/staging-it
--temp_location=gs://temp-storage-for-end-to-end-tests/temp-it --input=gs://apache-beam-samples/input_small_files/ascii_sort_1MB_input.0000*
--output=gs://temp-storage-for-end-to-end-tests/py-it-cloud/output --expect_checksum=ea0ca2e5ee4ea5f218790f28d0b9fe7d09d8d710
--num_workers=10 --autoscaling_algorithm=NONE --runner=TestDataflowRunner --sdk_location=test-suites/dataflow/py36/build/apache-beam.tar.gz"
Successfully started process 'command 'sh''
>>> RUNNING integration tests with pipeline options: --project=apache-beam-testing
--staging_location=gs://temp-storage-for-end-to-end-tests/staging-it --temp_location=gs://temp-storage-for-end-to-end-tests/temp-it
--input=gs://apache-beam-samples/input_small_files/ascii_sort_1MB_input.0000* --output=gs://temp-storage-for-end-to-end-tests/py-it-cloud/output
--expect_checksum=ea0ca2e5ee4ea5f218790f28d0b9fe7d09d8d710 --num_workers=10 --autoscaling_algorithm=NONE
--runner=TestDataflowRunner --sdk_location=test-suites/dataflow/py36/build/apache-beam.tar.gz
>>>   test options: --tests=apache_beam.examples.wordcount_it_test:WordCountIT.test_wordcount_it
--attr=IT --nocapture
running nosetests
running egg_info
writing apache_beam.egg-info/PKG-INFO
writing dependency_links to apache_beam.egg-info/dependency_links.txt
writing entry points to apache_beam.egg-info/entry_points.txt
writing requirements to apache_beam.egg-info/requires.txt
writing top-level names to apache_beam.egg-info/top_level.txt
reading manifest file 'apache_beam.egg-info/SOURCES.txt'
reading manifest template 'MANIFEST.in'
writing manifest file 'apache_beam.egg-info/SOURCES.txt'

STDERR: beam_fn_api.proto: warning: Import google/protobuf/descriptor.proto but not used.
beam_fn_api.proto: warning: Import google/protobuf/wrappers.proto but not used.
RefactoringTool: Skipping optional fixer: idioms
RefactoringTool: Skipping optional fixer: ws_comma
RefactoringTool: No changes to <https://builds.apache.org/job/beam_PerformanceTests_WordCountIT_Py36/ws/src/sdks/python/test-suites/dataflow/py36/build/srcs/sdks/python/apache_beam/portability/api/beam_artifact_api_pb2.py>
RefactoringTool: Refactored <https://builds.apache.org/job/beam_PerformanceTests_WordCountIT_Py36/ws/src/sdks/python/test-suites/dataflow/py36/build/srcs/sdks/python/apache_beam/portability/api/beam_artifact_api_pb2_grpc.py>
RefactoringTool: Refactored <https://builds.apache.org/job/beam_PerformanceTests_WordCountIT_Py36/ws/src/sdks/python/test-suites/dataflow/py36/build/srcs/sdks/python/apache_beam/portability/api/beam_expansion_api_pb2.py>
RefactoringTool: Refactored <https://builds.apache.org/job/beam_PerformanceTests_WordCountIT_Py36/ws/src/sdks/python/test-suites/dataflow/py36/build/srcs/sdks/python/apache_beam/portability/api/beam_expansion_api_pb2_grpc.py>
RefactoringTool: Refactored <https://builds.apache.org/job/beam_PerformanceTests_WordCountIT_Py36/ws/src/sdks/python/test-suites/dataflow/py36/build/srcs/sdks/python/apache_beam/portability/api/beam_fn_api_pb2.py>
RefactoringTool: Refactored <https://builds.apache.org/job/beam_PerformanceTests_WordCountIT_Py36/ws/src/sdks/python/test-suites/dataflow/py36/build/srcs/sdks/python/apache_beam/portability/api/beam_fn_api_pb2_grpc.py>
RefactoringTool: Refactored <https://builds.apache.org/job/beam_PerformanceTests_WordCountIT_Py36/ws/src/sdks/python/test-suites/dataflow/py36/build/srcs/sdks/python/apache_beam/portability/api/beam_job_api_pb2.py>
RefactoringTool: Refactored <https://builds.apache.org/job/beam_PerformanceTests_WordCountIT_Py36/ws/src/sdks/python/test-suites/dataflow/py36/build/srcs/sdks/python/apache_beam/portability/api/beam_job_api_pb2_grpc.py>
RefactoringTool: No changes to <https://builds.apache.org/job/beam_PerformanceTests_WordCountIT_Py36/ws/src/sdks/python/test-suites/dataflow/py36/build/srcs/sdks/python/apache_beam/portability/api/beam_provision_api_pb2.py>
RefactoringTool: Refactored <https://builds.apache.org/job/beam_PerformanceTests_WordCountIT_Py36/ws/src/sdks/python/test-suites/dataflow/py36/build/srcs/sdks/python/apache_beam/portability/api/beam_provision_api_pb2_grpc.py>
RefactoringTool: Refactored <https://builds.apache.org/job/beam_PerformanceTests_WordCountIT_Py36/ws/src/sdks/python/test-suites/dataflow/py36/build/srcs/sdks/python/apache_beam/portability/api/beam_runner_api_pb2.py>
RefactoringTool: No changes to <https://builds.apache.org/job/beam_PerformanceTests_WordCountIT_Py36/ws/src/sdks/python/test-suites/dataflow/py36/build/srcs/sdks/python/apache_beam/portability/api/endpoints_pb2.py>
RefactoringTool: Refactored <https://builds.apache.org/job/beam_PerformanceTests_WordCountIT_Py36/ws/src/sdks/python/test-suites/dataflow/py36/build/srcs/sdks/python/apache_beam/portability/api/external_transforms_pb2.py>
RefactoringTool: Refactored <https://builds.apache.org/job/beam_PerformanceTests_WordCountIT_Py36/ws/src/sdks/python/test-suites/dataflow/py36/build/srcs/sdks/python/apache_beam/portability/api/metrics_pb2.py>
RefactoringTool: Refactored <https://builds.apache.org/job/beam_PerformanceTests_WordCountIT_Py36/ws/src/sdks/python/test-suites/dataflow/py36/build/srcs/sdks/python/apache_beam/portability/api/standard_window_fns_pb2.py>
RefactoringTool: Files that were modified:
RefactoringTool: <https://builds.apache.org/job/beam_PerformanceTests_WordCountIT_Py36/ws/src/sdks/python/test-suites/dataflow/py36/build/srcs/sdks/python/apache_beam/portability/api/beam_artifact_api_pb2.py>
RefactoringTool: <https://builds.apache.org/job/beam_PerformanceTests_WordCountIT_Py36/ws/src/sdks/python/test-suites/dataflow/py36/build/srcs/sdks/python/apache_beam/portability/api/beam_artifact_api_pb2_grpc.py>
RefactoringTool: <https://builds.apache.org/job/beam_PerformanceTests_WordCountIT_Py36/ws/src/sdks/python/test-suites/dataflow/py36/build/srcs/sdks/python/apache_beam/portability/api/beam_expansion_api_pb2.py>
RefactoringTool: <https://builds.apache.org/job/beam_PerformanceTests_WordCountIT_Py36/ws/src/sdks/python/test-suites/dataflow/py36/build/srcs/sdks/python/apache_beam/portability/api/beam_expansion_api_pb2_grpc.py>
RefactoringTool: <https://builds.apache.org/job/beam_PerformanceTests_WordCountIT_Py36/ws/src/sdks/python/test-suites/dataflow/py36/build/srcs/sdks/python/apache_beam/portability/api/beam_fn_api_pb2.py>
RefactoringTool: <https://builds.apache.org/job/beam_PerformanceTests_WordCountIT_Py36/ws/src/sdks/python/test-suites/dataflow/py36/build/srcs/sdks/python/apache_beam/portability/api/beam_fn_api_pb2_grpc.py>
RefactoringTool: <https://builds.apache.org/job/beam_PerformanceTests_WordCountIT_Py36/ws/src/sdks/python/test-suites/dataflow/py36/build/srcs/sdks/python/apache_beam/portability/api/beam_job_api_pb2.py>
RefactoringTool: <https://builds.apache.org/job/beam_PerformanceTests_WordCountIT_Py36/ws/src/sdks/python/test-suites/dataflow/py36/build/srcs/sdks/python/apache_beam/portability/api/beam_job_api_pb2_grpc.py>
RefactoringTool: <https://builds.apache.org/job/beam_PerformanceTests_WordCountIT_Py36/ws/src/sdks/python/test-suites/dataflow/py36/build/srcs/sdks/python/apache_beam/portability/api/beam_provision_api_pb2.py>
RefactoringTool: <https://builds.apache.org/job/beam_PerformanceTests_WordCountIT_Py36/ws/src/sdks/python/test-suites/dataflow/py36/build/srcs/sdks/python/apache_beam/portability/api/beam_provision_api_pb2_grpc.py>
RefactoringTool: <https://builds.apache.org/job/beam_PerformanceTests_WordCountIT_Py36/ws/src/sdks/python/test-suites/dataflow/py36/build/srcs/sdks/python/apache_beam/portability/api/beam_runner_api_pb2.py>
RefactoringTool: <https://builds.apache.org/job/beam_PerformanceTests_WordCountIT_Py36/ws/src/sdks/python/test-suites/dataflow/py36/build/srcs/sdks/python/apache_beam/portability/api/endpoints_pb2.py>
RefactoringTool: <https://builds.apache.org/job/beam_PerformanceTests_WordCountIT_Py36/ws/src/sdks/python/test-suites/dataflow/py36/build/srcs/sdks/python/apache_beam/portability/api/external_transforms_pb2.py>
RefactoringTool: <https://builds.apache.org/job/beam_PerformanceTests_WordCountIT_Py36/ws/src/sdks/python/test-suites/dataflow/py36/build/srcs/sdks/python/apache_beam/portability/api/metrics_pb2.py>
RefactoringTool: <https://builds.apache.org/job/beam_PerformanceTests_WordCountIT_Py36/ws/src/sdks/python/test-suites/dataflow/py36/build/srcs/sdks/python/apache_beam/portability/api/standard_window_fns_pb2.py>
setup.py:177: UserWarning: Some syntactic constructs of Python 3 are not yet fully supported
by Apache Beam.
  'Some syntactic constructs of Python 3 are not yet fully supported by '
<https://builds.apache.org/job/beam_PerformanceTests_WordCountIT_Py36/ws/src/build/gradleenv/-1734967053/lib/python3.6/site-packages/setuptools/dist.py>:472:
UserWarning: Normalizing '2.15.0.dev' to '2.15.0.dev0'
  normalized_version,
warning: no files found matching 'README.md'
warning: no files found matching 'NOTICE'
warning: no files found matching 'LICENSE'
warning: cmd: standard file not found: should have one of README, README.rst, README.txt,
README.md

setup.py:177: UserWarning: Some syntactic constructs of Python 3 are not yet fully supported
by Apache Beam.
  'Some syntactic constructs of Python 3 are not yet fully supported by '
<https://builds.apache.org/job/beam_PerformanceTests_WordCountIT_Py36/ws/src/build/gradleenv/-1734967053/lib/python3.6/site-packages/setuptools/dist.py>:472:
UserWarning: Normalizing '2.15.0.dev' to '2.15.0.dev0'
  normalized_version,
warning: no files found matching 'README.md'
warning: no files found matching 'NOTICE'
warning: no files found matching 'LICENSE'
<https://builds.apache.org/job/beam_PerformanceTests_WordCountIT_Py36/ws/src/sdks/python/apache_beam/__init__.py>:84:
UserWarning: Some syntactic constructs of Python 3 are not yet fully supported by Apache Beam.
  'Some syntactic constructs of Python 3 are not yet fully supported by '
test_wordcount_it (apache_beam.examples.wordcount_it_test.WordCountIT) ... 
2019-07-08 18:57:26,770 7faae494 MainThread beam_integration_benchmark(1/1) ERROR    Error
during benchmark beam_integration_benchmark
Traceback (most recent call last):
  File "<https://builds.apache.org/job/beam_PerformanceTests_WordCountIT_Py36/ws/PerfKitBenchmarker/perfkitbenchmarker/pkb.py",>
line 760, in RunBenchmark
    DoRunPhase(spec, collector, detailed_timer)
  File "<https://builds.apache.org/job/beam_PerformanceTests_WordCountIT_Py36/ws/PerfKitBenchmarker/perfkitbenchmarker/pkb.py",>
line 609, in DoRunPhase
    samples = spec.BenchmarkRun(spec)
  File "<https://builds.apache.org/job/beam_PerformanceTests_WordCountIT_Py36/ws/PerfKitBenchmarker/perfkitbenchmarker/linux_benchmarks/beam_integration_benchmark.py",>
line 160, in Run
    job_type=job_type)
  File "<https://builds.apache.org/job/beam_PerformanceTests_WordCountIT_Py36/ws/PerfKitBenchmarker/perfkitbenchmarker/providers/gcp/gcp_dpb_dataflow.py",>
line 90, in SubmitJob
    assert retcode == 0, "Integration Test Failed."
AssertionError: Integration Test Failed.
2019-07-08 18:57:26,772 7faae494 MainThread beam_integration_benchmark(1/1) INFO     Cleaning
up benchmark beam_integration_benchmark
2019-07-08 18:57:26,774 7faae494 MainThread beam_integration_benchmark(1/1) ERROR    Exception
running benchmark
Traceback (most recent call last):
  File "<https://builds.apache.org/job/beam_PerformanceTests_WordCountIT_Py36/ws/PerfKitBenchmarker/perfkitbenchmarker/pkb.py",>
line 903, in RunBenchmarkTask
    RunBenchmark(spec, collector)
  File "<https://builds.apache.org/job/beam_PerformanceTests_WordCountIT_Py36/ws/PerfKitBenchmarker/perfkitbenchmarker/pkb.py",>
line 760, in RunBenchmark
    DoRunPhase(spec, collector, detailed_timer)
  File "<https://builds.apache.org/job/beam_PerformanceTests_WordCountIT_Py36/ws/PerfKitBenchmarker/perfkitbenchmarker/pkb.py",>
line 609, in DoRunPhase
    samples = spec.BenchmarkRun(spec)
  File "<https://builds.apache.org/job/beam_PerformanceTests_WordCountIT_Py36/ws/PerfKitBenchmarker/perfkitbenchmarker/linux_benchmarks/beam_integration_benchmark.py",>
line 160, in Run
    job_type=job_type)
  File "<https://builds.apache.org/job/beam_PerformanceTests_WordCountIT_Py36/ws/PerfKitBenchmarker/perfkitbenchmarker/providers/gcp/gcp_dpb_dataflow.py",>
line 90, in SubmitJob
    assert retcode == 0, "Integration Test Failed."
AssertionError: Integration Test Failed.
2019-07-08 18:57:26,774 7faae494 MainThread beam_integration_benchmark(1/1) ERROR    Benchmark
1/1 beam_integration_benchmark (UID: beam_integration_benchmark0) failed. Execution will continue.
2019-07-08 18:57:26,774 7faae494 MainThread beam_integration_benchmark(1/1) INFO     Benchmark
run statuses:
---------------------------------------------------------------------------------
Name                        UID                          Status  Failed Substatus
---------------------------------------------------------------------------------
beam_integration_benchmark  beam_integration_benchmark0  FAILED                  
---------------------------------------------------------------------------------
Success rate: 0.00% (0/1)
2019-07-08 18:57:26,775 7faae494 MainThread beam_integration_benchmark(1/1) INFO     Complete
logs can be found at: <https://builds.apache.org/job/beam_PerformanceTests_WordCountIT_Py36/ws/runs/7faae494/pkb.log>
2019-07-08 18:57:26,775 7faae494 MainThread beam_integration_benchmark(1/1) INFO     Completion
statuses can be found at: <https://builds.apache.org/job/beam_PerformanceTests_WordCountIT_Py36/ws/runs/7faae494/completion_statuses.json>
Build step 'Execute shell' marked build as failure

---------------------------------------------------------------------
To unsubscribe, e-mail: builds-unsubscribe@beam.apache.org
For additional commands, e-mail: builds-help@beam.apache.org


Mime
View raw message