beam-builds mailing list archives

Site index · List index
Message view « Date » · « Thread »
Top « Date » · « Thread »
From Apache Jenkins Server <jenk...@builds.apache.org>
Subject Build failed in Jenkins: beam_PostCommit_Java_ValidatesRunner_PortabilityApi_Dataflow #1693
Date Mon, 15 Jul 2019 09:15:34 GMT
See <https://builds.apache.org/job/beam_PostCommit_Java_ValidatesRunner_PortabilityApi_Dataflow/1693/display/redirect>

------------------------------------------
[...truncated 53.73 KB...]
f7d12d471667: Preparing
f350d0146bb3: Preparing
e38df31d449c: Preparing
af5ae4841776: Preparing
b17cc31e431b: Preparing
12cb127eee44: Preparing
604829a174eb: Preparing
fbb641a8b943: Preparing
b17cc31e431b: Waiting
af5ae4841776: Waiting
12cb127eee44: Waiting
f7d12d471667: Waiting
f350d0146bb3: Waiting
fbb641a8b943: Waiting
a3112a1fd9f7: Waiting
e38df31d449c: Waiting
604829a174eb: Waiting
7d53dbdeb706: Layer already exists
f7d12d471667: Layer already exists
f350d0146bb3: Layer already exists
e38df31d449c: Layer already exists
af5ae4841776: Layer already exists
b17cc31e431b: Layer already exists
fd5ca30d50f4: Layer already exists
12cb127eee44: Layer already exists
604829a174eb: Layer already exists
fbb641a8b943: Layer already exists
0cc3ed2e458c: Layer already exists
d69b7475c0e9: Layer already exists
6e41f3d0b592: Layer already exists
a3112a1fd9f7: Layer already exists
20190610221846: digest: sha256:ad3718eb058f5be4fe295884a56bfaf031730cb928dac7c6526be63a5f46d68a
size: 3262
b9feb2610646: Preparing
aa9b4603fe79: Preparing
211686a16759: Preparing
f6a585633f92: Preparing
559ba80d9f0c: Preparing
3eb476227b73: Preparing
f7d12d471667: Preparing
f350d0146bb3: Preparing
e38df31d449c: Preparing
af5ae4841776: Preparing
b17cc31e431b: Preparing
12cb127eee44: Preparing
604829a174eb: Preparing
fbb641a8b943: Preparing
f350d0146bb3: Waiting
e38df31d449c: Waiting
af5ae4841776: Waiting
b17cc31e431b: Waiting
12cb127eee44: Waiting
604829a174eb: Waiting
3eb476227b73: Waiting
fbb641a8b943: Waiting
f7d12d471667: Waiting
f6a585633f92: Layer already exists
b9feb2610646: Layer already exists
f7d12d471667: Layer already exists
f350d0146bb3: Layer already exists
e38df31d449c: Layer already exists
af5ae4841776: Layer already exists
12cb127eee44: Layer already exists
604829a174eb: Layer already exists
b17cc31e431b: Layer already exists
fbb641a8b943: Layer already exists
559ba80d9f0c: Layer already exists
211686a16759: Layer already exists
aa9b4603fe79: Layer already exists
3eb476227b73: Layer already exists
20190615060024: digest: sha256:925656e674eae20e743378a2ae2660fc1531d30b597e9c5af9696ded7f2f6a0f
size: 3262
9edd8f6cb16a: Preparing
f4f4bfff0c03: Preparing
20f809ab1ef3: Preparing
8c992cc400ea: Preparing
e1016a11481b: Preparing
ee82cc5a3d24: Preparing
f7d12d471667: Preparing
f350d0146bb3: Preparing
e38df31d449c: Preparing
af5ae4841776: Preparing
b17cc31e431b: Preparing
12cb127eee44: Preparing
604829a174eb: Preparing
fbb641a8b943: Preparing
af5ae4841776: Waiting
b17cc31e431b: Waiting
12cb127eee44: Waiting
604829a174eb: Waiting
f350d0146bb3: Waiting
ee82cc5a3d24: Waiting
f7d12d471667: Waiting
e38df31d449c: Waiting
fbb641a8b943: Waiting
e1016a11481b: Layer already exists
9edd8f6cb16a: Layer already exists
f7d12d471667: Layer already exists
e38df31d449c: Layer already exists
af5ae4841776: Layer already exists
f350d0146bb3: Layer already exists
b17cc31e431b: Layer already exists
12cb127eee44: Layer already exists
604829a174eb: Layer already exists
fbb641a8b943: Layer already exists
20f809ab1ef3: Layer already exists
f4f4bfff0c03: Layer already exists
8c992cc400ea: Layer already exists
ee82cc5a3d24: Layer already exists
20190623000021: digest: sha256:3a063671186383a6b438cc3ef14ef8b63d96f164d08a936c4e40aa4a3c3a382d
size: 3262
2d2b3dff1322: Preparing
81d160bd35a0: Preparing
9533ec74f759: Preparing
b680ed802694: Preparing
5caee7d90642: Preparing
fed6c9b05964: Preparing
f7d12d471667: Preparing
f350d0146bb3: Preparing
e38df31d449c: Preparing
af5ae4841776: Preparing
b17cc31e431b: Preparing
12cb127eee44: Preparing
604829a174eb: Preparing
fbb641a8b943: Preparing
fed6c9b05964: Waiting
f7d12d471667: Waiting
f350d0146bb3: Waiting
af5ae4841776: Waiting
b17cc31e431b: Waiting
12cb127eee44: Waiting
604829a174eb: Waiting
fbb641a8b943: Waiting
e38df31d449c: Waiting
2d2b3dff1322: Layer already exists
9533ec74f759: Layer already exists
f350d0146bb3: Layer already exists
f7d12d471667: Layer already exists
af5ae4841776: Layer already exists
e38df31d449c: Layer already exists
b17cc31e431b: Layer already exists
12cb127eee44: Layer already exists
604829a174eb: Layer already exists
fbb641a8b943: Layer already exists
81d160bd35a0: Layer already exists
5caee7d90642: Layer already exists
b680ed802694: Layer already exists
fed6c9b05964: Layer already exists
20190701000024: digest: sha256:2150ab65fdaab71f014a1194514352ac94d2688bd6ac9683eca81e04edc974b9
size: 3262
1029a1f2b755: Preparing
040eea61719a: Preparing
ba407459ea81: Preparing
f08f906e7776: Preparing
a50d6873ac83: Preparing
bf7c12038ff2: Preparing
f7d12d471667: Preparing
f350d0146bb3: Preparing
e38df31d449c: Preparing
af5ae4841776: Preparing
b17cc31e431b: Preparing
12cb127eee44: Preparing
604829a174eb: Preparing
fbb641a8b943: Preparing
f7d12d471667: Waiting
f350d0146bb3: Waiting
e38df31d449c: Waiting
604829a174eb: Waiting
af5ae4841776: Waiting
fbb641a8b943: Waiting
b17cc31e431b: Waiting
bf7c12038ff2: Waiting
12cb127eee44: Waiting
a50d6873ac83: Pushed
040eea61719a: Pushed
f7d12d471667: Layer already exists
e38df31d449c: Layer already exists
f350d0146bb3: Layer already exists
af5ae4841776: Layer already exists
b17cc31e431b: Layer already exists
12cb127eee44: Layer already exists
fbb641a8b943: Layer already exists
604829a174eb: Layer already exists
ba407459ea81: Pushed
bf7c12038ff2: Pushed
1029a1f2b755: Pushed
f08f906e7776: Pushed
20190715064026: digest: sha256:1546c91cb6bfc1894a7856b017e75a7d71deb2daed6dc2a6d9e4fa638ad84996
size: 3262

> Task :runners:google-cloud-dataflow-java:validatesRunnerFnApiWorkerTest

org.apache.beam.sdk.transforms.ViewTest > testIterableSideInputIsImmutable FAILED
    java.lang.RuntimeException at ViewTest.java:505

org.apache.beam.sdk.transforms.ViewTest > testEmptyListSideInput FAILED
    java.lang.RuntimeException at ViewTest.java:319

org.apache.beam.sdk.transforms.ViewTest > testWindowedSideInputFixedToFixed FAILED
    java.lang.RuntimeException at ViewTest.java:1375

156 tests completed, 3 failed, 2 skipped

> Task :runners:google-cloud-dataflow-java:validatesRunnerFnApiWorkerTest FAILED

> Task :runners:google-cloud-dataflow-java:cleanUpDockerImages
Untagged: us.gcr.io/apache-beam-testing/java-postcommit-it/java:20190715064026
Untagged: us.gcr.io/apache-beam-testing/java-postcommit-it/java@sha256:1546c91cb6bfc1894a7856b017e75a7d71deb2daed6dc2a6d9e4fa638ad84996
Deleted: sha256:442cb12a4668dfad35cda0a776a376addddc68b8bd7b0a68b4bc8faa0c7561e7
Deleted: sha256:45933bc6d87b645a01e5404fc696bb20b6d1177001d756a21f7627adc5581c91
Deleted: sha256:5b5e66f0b4ff77271c4fb69addaba7794c89ae196d02a230763f3a35808e5253
Deleted: sha256:e950f90b979ce0d2e0b918d3dd2d18cd310b4d3d4746ae5aeab200d2eeba71a1
Deleted: sha256:3cc768e26b81bb62a78da4aa02ddd21572c94bf2b4114414611ddaf003a78dc7
Deleted: sha256:23f37fbcfb5a79ba26bac5157029b4e911c6d892db418b1f43d8829883fb56ad
Deleted: sha256:854453e74cebdf220d2bb7ef5d910c493922c39b55076d5ec8de52a7d2e20ca3
Deleted: sha256:967c0d6d2403e946055ccd9b7cf3b28df87d9476e04e21039af2fdaac5c5c295
Deleted: sha256:18d894cf08e5e56b04671432868d858fd3ee36c38b103cc5ff170eb093fa406e
Deleted: sha256:a8ebe2546aad9eed84b3731fe85978beb84ff3b9b54ee558acd58478f737d32a
Deleted: sha256:c7d1904793d281443a02554a659777a082b8cda784bec0d438d5844c391e46ba
Deleted: sha256:2c3284fe4bcbccd90aec860f2ad420ba4dceff5d7995673aaa1404e80e13ac4c
Deleted: sha256:819de945fa60322e4061d3501b5808af4a08cf00f634587b2c33e568f9ea7c91
Deleted: sha256:6647c898a675734a0addc6576c43951c00ffb14547f131da6e8463ab280c56a5
Digests:
- us.gcr.io/apache-beam-testing/java-postcommit-it/java@sha256:1546c91cb6bfc1894a7856b017e75a7d71deb2daed6dc2a6d9e4fa638ad84996
  Associated tags:
 - 20190715064026
Tags:
- us.gcr.io/apache-beam-testing/java-postcommit-it/java:20190715064026
Deleted [us.gcr.io/apache-beam-testing/java-postcommit-it/java:20190715064026].
Deleted [us.gcr.io/apache-beam-testing/java-postcommit-it/java@sha256:1546c91cb6bfc1894a7856b017e75a7d71deb2daed6dc2a6d9e4fa638ad84996].

FAILURE: Build failed with an exception.

* What went wrong:
Execution failed for task ':runners:google-cloud-dataflow-java:validatesRunnerFnApiWorkerTest'.
> There were failing tests. See the report at: file://<https://builds.apache.org/job/beam_PostCommit_Java_ValidatesRunner_PortabilityApi_Dataflow/ws/src/runners/google-cloud-dataflow-java/build/reports/tests/validatesRunnerFnApiWorkerTest/index.html>

* Try:
Run with --stacktrace option to get the stack trace. Run with --info or --debug option to
get more log output. Run with --scan to get full insights.

* Get more help at https://help.gradle.org

Deprecated Gradle features were used in this build, making it incompatible with Gradle 6.0.
Use '--warning-mode all' to show the individual deprecation warnings.
See https://docs.gradle.org/5.2.1/userguide/command_line_interface.html#sec:command_line_warnings

BUILD FAILED in 2h 35m 18s
79 actionable tasks: 59 executed, 19 from cache, 1 up-to-date

Publishing build scan...
https://gradle.com/s/j5j3ofbpgxj24

Build step 'Invoke Gradle script' changed build result to FAILURE
Build step 'Invoke Gradle script' marked build as failure

---------------------------------------------------------------------
To unsubscribe, e-mail: builds-unsubscribe@beam.apache.org
For additional commands, e-mail: builds-help@beam.apache.org


Mime
View raw message