beam-builds mailing list archives

Site index · List index
Message view « Date » · « Thread »
Top « Date » · « Thread »
From Apache Jenkins Server <jenk...@builds.apache.org>
Subject Build failed in Jenkins: beam_PerformanceTests_ParquetIOIT #1640
Date Mon, 01 Jul 2019 00:31:48 GMT
See <https://builds.apache.org/job/beam_PerformanceTests_ParquetIOIT/1640/display/redirect>

------------------------------------------
[...truncated 338.42 KB...]
    Jul 01, 2019 12:26:06 AM org.apache.beam.runners.dataflow.util.MonitoringUtil$LoggingHandler
process
    INFO: 2019-07-01T00:26:06.123Z: Autoscaling: Raised the number of workers to 1 based on
the rate of progress in the currently running step(s).
    Jul 01, 2019 12:26:12 AM org.apache.beam.runners.dataflow.util.MonitoringUtil$LoggingHandler
process
    INFO: 2019-07-01T00:26:11.856Z: Workers have started successfully.
    Jul 01, 2019 12:28:14 AM org.apache.beam.runners.dataflow.util.MonitoringUtil$LoggingHandler
process
    INFO: 2019-07-01T00:28:13.717Z: Autoscaling: Resizing worker pool from 1 to 2.
    Jul 01, 2019 12:29:09 AM org.apache.beam.runners.dataflow.util.MonitoringUtil$LoggingHandler
process
    INFO: 2019-07-01T00:29:07.950Z: Autoscaling: Raised the number of workers to 2 based on
the rate of progress in the currently running step(s).
    Jul 01, 2019 12:29:12 AM org.apache.beam.runners.dataflow.util.MonitoringUtil$LoggingHandler
process
    INFO: 2019-07-01T00:29:12.056Z: Finished operation PAssert$0/GroupGlobally/Create.Values/Read(CreateSource)+PAssert$0/GroupGlobally/WindowIntoDummy/Window.Assign+PAssert$0/GroupGlobally/GroupDummyAndContents/Reify+PAssert$0/GroupGlobally/GroupDummyAndContents/Write
    Jul 01, 2019 12:31:03 AM org.apache.beam.runners.dataflow.util.MonitoringUtil$LoggingHandler
process
    INFO: 2019-07-01T00:31:01.398Z: Finished operation Generate sequence/Read(BoundedCountingSource)+Produce
text lines+Produce Avro records+Gather write start times+Write Parquet files/WriteFiles/WriteUnshardedBundlesToTempFiles/WriteUnshardedBundles+Write
Parquet files/WriteFiles/GatherTempFileResults/Add void key/AddKeys/Map+Write Parquet files/WriteFiles/GatherTempFileResults/Reshuffle/Window.Into()/Window.Assign+Write
Parquet files/WriteFiles/GatherTempFileResults/Reshuffle/GroupByKey/Reify+Write Parquet files/WriteFiles/GatherTempFileResults/Reshuffle/GroupByKey/Write+Write
Parquet files/WriteFiles/WriteUnshardedBundlesToTempFiles/GroupUnwritten/Reify+Write Parquet
files/WriteFiles/WriteUnshardedBundlesToTempFiles/GroupUnwritten/Write
    Jul 01, 2019 12:31:03 AM org.apache.beam.runners.dataflow.util.MonitoringUtil$LoggingHandler
process
    INFO: 2019-07-01T00:31:01.571Z: Executing operation Write Parquet files/WriteFiles/WriteUnshardedBundlesToTempFiles/GroupUnwritten/Close
    Jul 01, 2019 12:31:03 AM org.apache.beam.runners.dataflow.util.MonitoringUtil$LoggingHandler
process
    INFO: 2019-07-01T00:31:01.620Z: Finished operation Write Parquet files/WriteFiles/WriteUnshardedBundlesToTempFiles/GroupUnwritten/Close
    Jul 01, 2019 12:31:03 AM org.apache.beam.runners.dataflow.util.MonitoringUtil$LoggingHandler
process
    INFO: 2019-07-01T00:31:01.709Z: Executing operation Write Parquet files/WriteFiles/WriteUnshardedBundlesToTempFiles/GroupUnwritten/Read+Write
Parquet files/WriteFiles/WriteUnshardedBundlesToTempFiles/GroupUnwritten/GroupByWindow+Write
Parquet files/WriteFiles/WriteUnshardedBundlesToTempFiles/WriteUnwritten+Write Parquet files/WriteFiles/WriteUnshardedBundlesToTempFiles/DropShardNum+Write
Parquet files/WriteFiles/GatherTempFileResults/Add void key/AddKeys/Map+Write Parquet files/WriteFiles/GatherTempFileResults/Reshuffle/Window.Into()/Window.Assign+Write
Parquet files/WriteFiles/GatherTempFileResults/Reshuffle/GroupByKey/Reify+Write Parquet files/WriteFiles/GatherTempFileResults/Reshuffle/GroupByKey/Write
    Jul 01, 2019 12:31:03 AM org.apache.beam.runners.dataflow.util.MonitoringUtil$LoggingHandler
process
    INFO: 2019-07-01T00:31:02.084Z: Finished operation Write Parquet files/WriteFiles/WriteUnshardedBundlesToTempFiles/GroupUnwritten/Read+Write
Parquet files/WriteFiles/WriteUnshardedBundlesToTempFiles/GroupUnwritten/GroupByWindow+Write
Parquet files/WriteFiles/WriteUnshardedBundlesToTempFiles/WriteUnwritten+Write Parquet files/WriteFiles/WriteUnshardedBundlesToTempFiles/DropShardNum+Write
Parquet files/WriteFiles/GatherTempFileResults/Add void key/AddKeys/Map+Write Parquet files/WriteFiles/GatherTempFileResults/Reshuffle/Window.Into()/Window.Assign+Write
Parquet files/WriteFiles/GatherTempFileResults/Reshuffle/GroupByKey/Reify+Write Parquet files/WriteFiles/GatherTempFileResults/Reshuffle/GroupByKey/Write
    Jul 01, 2019 12:31:03 AM org.apache.beam.runners.dataflow.util.MonitoringUtil$LoggingHandler
process
    INFO: 2019-07-01T00:31:02.196Z: Executing operation Write Parquet files/WriteFiles/GatherTempFileResults/Reshuffle/GroupByKey/Close
    Jul 01, 2019 12:31:03 AM org.apache.beam.runners.dataflow.util.MonitoringUtil$LoggingHandler
process
    INFO: 2019-07-01T00:31:02.243Z: Finished operation Write Parquet files/WriteFiles/GatherTempFileResults/Reshuffle/GroupByKey/Close
    Jul 01, 2019 12:31:03 AM org.apache.beam.runners.dataflow.util.MonitoringUtil$LoggingHandler
process
    INFO: 2019-07-01T00:31:02.335Z: Executing operation Write Parquet files/WriteFiles/GatherTempFileResults/Reshuffle/GroupByKey/Read+Write
Parquet files/WriteFiles/GatherTempFileResults/Reshuffle/GroupByKey/GroupByWindow+Write Parquet
files/WriteFiles/GatherTempFileResults/Reshuffle/ExpandIterable+Write Parquet files/WriteFiles/GatherTempFileResults/Drop
key/Values/Map+Write Parquet files/WriteFiles/GatherTempFileResults/Gather bundles+Write Parquet
files/WriteFiles/GatherTempFileResults/Reshuffle.ViaRandomKey/Pair with random key+Write Parquet
files/WriteFiles/GatherTempFileResults/Reshuffle.ViaRandomKey/Reshuffle/Window.Into()/Window.Assign+Write
Parquet files/WriteFiles/GatherTempFileResults/Reshuffle.ViaRandomKey/Reshuffle/GroupByKey/Reify+Write
Parquet files/WriteFiles/GatherTempFileResults/Reshuffle.ViaRandomKey/Reshuffle/GroupByKey/Write
    Jul 01, 2019 12:31:05 AM org.apache.beam.runners.dataflow.util.MonitoringUtil$LoggingHandler
process
    INFO: 2019-07-01T00:31:04.584Z: Finished operation Write Parquet files/WriteFiles/GatherTempFileResults/Reshuffle/GroupByKey/Read+Write
Parquet files/WriteFiles/GatherTempFileResults/Reshuffle/GroupByKey/GroupByWindow+Write Parquet
files/WriteFiles/GatherTempFileResults/Reshuffle/ExpandIterable+Write Parquet files/WriteFiles/GatherTempFileResults/Drop
key/Values/Map+Write Parquet files/WriteFiles/GatherTempFileResults/Gather bundles+Write Parquet
files/WriteFiles/GatherTempFileResults/Reshuffle.ViaRandomKey/Pair with random key+Write Parquet
files/WriteFiles/GatherTempFileResults/Reshuffle.ViaRandomKey/Reshuffle/Window.Into()/Window.Assign+Write
Parquet files/WriteFiles/GatherTempFileResults/Reshuffle.ViaRandomKey/Reshuffle/GroupByKey/Reify+Write
Parquet files/WriteFiles/GatherTempFileResults/Reshuffle.ViaRandomKey/Reshuffle/GroupByKey/Write
    Jul 01, 2019 12:31:05 AM org.apache.beam.runners.dataflow.util.MonitoringUtil$LoggingHandler
process
    INFO: 2019-07-01T00:31:04.671Z: Executing operation Write Parquet files/WriteFiles/GatherTempFileResults/Reshuffle.ViaRandomKey/Reshuffle/GroupByKey/Close
    Jul 01, 2019 12:31:05 AM org.apache.beam.runners.dataflow.util.MonitoringUtil$LoggingHandler
process
    INFO: 2019-07-01T00:31:04.718Z: Finished operation Write Parquet files/WriteFiles/GatherTempFileResults/Reshuffle.ViaRandomKey/Reshuffle/GroupByKey/Close
    Jul 01, 2019 12:31:05 AM org.apache.beam.runners.dataflow.util.MonitoringUtil$LoggingHandler
process
    INFO: 2019-07-01T00:31:04.813Z: Executing operation Write Parquet files/WriteFiles/GatherTempFileResults/Reshuffle.ViaRandomKey/Reshuffle/GroupByKey/Read+Write
Parquet files/WriteFiles/GatherTempFileResults/Reshuffle.ViaRandomKey/Reshuffle/GroupByKey/GroupByWindow+Write
Parquet files/WriteFiles/GatherTempFileResults/Reshuffle.ViaRandomKey/Reshuffle/ExpandIterable+Write
Parquet files/WriteFiles/GatherTempFileResults/Reshuffle.ViaRandomKey/Values/Values/Map+Write
Parquet files/WriteFiles/FinalizeTempFileBundles/Finalize+Write Parquet files/WriteFiles/FinalizeTempFileBundles/Reshuffle.ViaRandomKey/Pair
with random key+Write Parquet files/WriteFiles/FinalizeTempFileBundles/Reshuffle.ViaRandomKey/Reshuffle/Window.Into()/Window.Assign+Write
Parquet files/WriteFiles/FinalizeTempFileBundles/Reshuffle.ViaRandomKey/Reshuffle/GroupByKey/Reify+Write
Parquet files/WriteFiles/FinalizeTempFileBundles/Reshuffle.ViaRandomKey/Reshuffle/GroupByKey/Write
    Jul 01, 2019 12:31:07 AM org.apache.beam.runners.dataflow.util.MonitoringUtil$LoggingHandler
process
    INFO: 2019-07-01T00:31:07.172Z: Finished operation Write Parquet files/WriteFiles/GatherTempFileResults/Reshuffle.ViaRandomKey/Reshuffle/GroupByKey/Read+Write
Parquet files/WriteFiles/GatherTempFileResults/Reshuffle.ViaRandomKey/Reshuffle/GroupByKey/GroupByWindow+Write
Parquet files/WriteFiles/GatherTempFileResults/Reshuffle.ViaRandomKey/Reshuffle/ExpandIterable+Write
Parquet files/WriteFiles/GatherTempFileResults/Reshuffle.ViaRandomKey/Values/Values/Map+Write
Parquet files/WriteFiles/FinalizeTempFileBundles/Finalize+Write Parquet files/WriteFiles/FinalizeTempFileBundles/Reshuffle.ViaRandomKey/Pair
with random key+Write Parquet files/WriteFiles/FinalizeTempFileBundles/Reshuffle.ViaRandomKey/Reshuffle/Window.Into()/Window.Assign+Write
Parquet files/WriteFiles/FinalizeTempFileBundles/Reshuffle.ViaRandomKey/Reshuffle/GroupByKey/Reify+Write
Parquet files/WriteFiles/FinalizeTempFileBundles/Reshuffle.ViaRandomKey/Reshuffle/GroupByKey/Write
    Jul 01, 2019 12:31:07 AM org.apache.beam.runners.dataflow.util.MonitoringUtil$LoggingHandler
process
    INFO: 2019-07-01T00:31:07.275Z: Executing operation Write Parquet files/WriteFiles/FinalizeTempFileBundles/Reshuffle.ViaRandomKey/Reshuffle/GroupByKey/Close
    Jul 01, 2019 12:31:07 AM org.apache.beam.runners.dataflow.util.MonitoringUtil$LoggingHandler
process
    INFO: 2019-07-01T00:31:07.326Z: Finished operation Write Parquet files/WriteFiles/FinalizeTempFileBundles/Reshuffle.ViaRandomKey/Reshuffle/GroupByKey/Close
    Jul 01, 2019 12:31:07 AM org.apache.beam.runners.dataflow.util.MonitoringUtil$LoggingHandler
process
    INFO: 2019-07-01T00:31:07.429Z: Executing operation Write Parquet files/WriteFiles/FinalizeTempFileBundles/Reshuffle.ViaRandomKey/Reshuffle/GroupByKey/Read+Write
Parquet files/WriteFiles/FinalizeTempFileBundles/Reshuffle.ViaRandomKey/Reshuffle/GroupByKey/GroupByWindow+Write
Parquet files/WriteFiles/FinalizeTempFileBundles/Reshuffle.ViaRandomKey/Reshuffle/ExpandIterable+Write
Parquet files/WriteFiles/FinalizeTempFileBundles/Reshuffle.ViaRandomKey/Values/Values/Map+Gather
write end times+Get file names/Values/Map+Find files/Match filepatterns+Find files/Reshuffle.ViaRandomKey/Pair
with random key+Find files/Reshuffle.ViaRandomKey/Reshuffle/Window.Into()/Window.Assign+Find
files/Reshuffle.ViaRandomKey/Reshuffle/GroupByKey/Reify+Find files/Reshuffle.ViaRandomKey/Reshuffle/GroupByKey/Write
    Jul 01, 2019 12:31:11 AM org.apache.beam.runners.dataflow.util.MonitoringUtil$LoggingHandler
process
    INFO: 2019-07-01T00:31:10.042Z: Finished operation Write Parquet files/WriteFiles/FinalizeTempFileBundles/Reshuffle.ViaRandomKey/Reshuffle/GroupByKey/Read+Write
Parquet files/WriteFiles/FinalizeTempFileBundles/Reshuffle.ViaRandomKey/Reshuffle/GroupByKey/GroupByWindow+Write
Parquet files/WriteFiles/FinalizeTempFileBundles/Reshuffle.ViaRandomKey/Reshuffle/ExpandIterable+Write
Parquet files/WriteFiles/FinalizeTempFileBundles/Reshuffle.ViaRandomKey/Values/Values/Map+Gather
write end times+Get file names/Values/Map+Find files/Match filepatterns+Find files/Reshuffle.ViaRandomKey/Pair
with random key+Find files/Reshuffle.ViaRandomKey/Reshuffle/Window.Into()/Window.Assign+Find
files/Reshuffle.ViaRandomKey/Reshuffle/GroupByKey/Reify+Find files/Reshuffle.ViaRandomKey/Reshuffle/GroupByKey/Write
    Jul 01, 2019 12:31:11 AM org.apache.beam.runners.dataflow.util.MonitoringUtil$LoggingHandler
process
    INFO: 2019-07-01T00:31:10.190Z: Executing operation Find files/Reshuffle.ViaRandomKey/Reshuffle/GroupByKey/Close
    Jul 01, 2019 12:31:11 AM org.apache.beam.runners.dataflow.util.MonitoringUtil$LoggingHandler
process
    INFO: 2019-07-01T00:31:10.243Z: Finished operation Find files/Reshuffle.ViaRandomKey/Reshuffle/GroupByKey/Close
    Jul 01, 2019 12:31:11 AM org.apache.beam.runners.dataflow.util.MonitoringUtil$LoggingHandler
process
    INFO: 2019-07-01T00:31:10.313Z: Executing operation Find files/Reshuffle.ViaRandomKey/Reshuffle/GroupByKey/Read+Find
files/Reshuffle.ViaRandomKey/Reshuffle/GroupByKey/GroupByWindow+Find files/Reshuffle.ViaRandomKey/Reshuffle/ExpandIterable+Find
files/Reshuffle.ViaRandomKey/Values/Values/Map+Read matched files/ParDo(ToReadableFile)+Gather
read start time+Read parquet files/ParDo(Read)+Gather read end time+Map records to strings/Map+Calculate
hashcode/WithKeys/AddKeys/Map+Calculate hashcode/Combine.perKey(Hashing)/GroupByKey+Calculate
hashcode/Combine.perKey(Hashing)/Combine.GroupedValues/Partial+Calculate hashcode/Combine.perKey(Hashing)/GroupByKey/Reify+Calculate
hashcode/Combine.perKey(Hashing)/GroupByKey/Write

org.apache.beam.sdk.io.parquet.ParquetIOIT > writeThenReadAll SKIPPED

> Task :sdks:java:io:file-based-io-tests:integrationTest FAILED
:sdks:java:io:file-based-io-tests:integrationTest (Thread[Execution worker for ':' Thread
4,5,main]) completed. Took 7 mins 31.971 secs.

Deprecated Gradle features were used in this build, making it incompatible with Gradle 6.0.
Use '--warning-mode all' to show the individual deprecation warnings.
See https://docs.gradle.org/5.2.1/userguide/command_line_interface.html#sec:command_line_warnings
86 actionable tasks: 55 executed, 31 from cache

Publishing build scan...

STDERR: 
FAILURE: Build failed with an exception.

* What went wrong:
Execution failed for task ':sdks:java:io:file-based-io-tests:integrationTest'.
> Process 'Gradle Test Executor 1' finished with non-zero exit value 143
  This problem might be caused by incorrect test process configuration.
  Please refer to the test execution section in the User Manual at https://docs.gradle.org/5.2.1/userguide/java_testing.html#sec:test_execution

* Try:
Run with --debug option to get more log output. Run with --scan to get full insights.

* Exception is:
org.gradle.api.tasks.TaskExecutionException: Execution failed for task ':sdks:java:io:file-based-io-tests:integrationTest'.
	at org.gradle.api.internal.tasks.execution.ExecuteActionsTaskExecuter$2.accept(ExecuteActionsTaskExecuter.java:121)
	at org.gradle.api.internal.tasks.execution.ExecuteActionsTaskExecuter$2.accept(ExecuteActionsTaskExecuter.java:117)
	at org.gradle.internal.Try$Failure.ifSuccessfulOrElse(Try.java:184)
	at org.gradle.api.internal.tasks.execution.ExecuteActionsTaskExecuter.execute(ExecuteActionsTaskExecuter.java:110)
	at org.gradle.api.internal.tasks.execution.ResolveIncrementalChangesTaskExecuter.execute(ResolveIncrementalChangesTaskExecuter.java:84)
	at org.gradle.api.internal.tasks.execution.ResolveTaskOutputCachingStateExecuter.execute(ResolveTaskOutputCachingStateExecuter.java:91)
	at org.gradle.api.internal.tasks.execution.FinishSnapshotTaskInputsBuildOperationTaskExecuter.execute(FinishSnapshotTaskInputsBuildOperationTaskExecuter.java:51)
	at org.gradle.api.internal.tasks.execution.ResolveBuildCacheKeyExecuter.execute(ResolveBuildCacheKeyExecuter.java:102)
	at org.gradle.api.internal.tasks.execution.ResolveBeforeExecutionStateTaskExecuter.execute(ResolveBeforeExecutionStateTaskExecuter.java:74)
	at org.gradle.api.internal.tasks.execution.ValidatingTaskExecuter.execute(ValidatingTaskExecuter.java:58)
	at org.gradle.api.internal.tasks.execution.SkipEmptySourceFilesTaskExecuter.execute(SkipEmptySourceFilesTaskExecuter.java:109)
	at org.gradle.api.internal.tasks.execution.ResolveBeforeExecutionOutputsTaskExecuter.execute(ResolveBeforeExecutionOutputsTaskExecuter.java:67)
	at org.gradle.api.internal.tasks.execution.StartSnapshotTaskInputsBuildOperationTaskExecuter.execute(StartSnapshotTaskInputsBuildOperationTaskExecuter.java:52)
	at org.gradle.api.internal.tasks.execution.ResolveAfterPreviousExecutionStateTaskExecuter.execute(ResolveAfterPreviousExecutionStateTaskExecuter.java:46)
	at org.gradle.api.internal.tasks.execution.CleanupStaleOutputsExecuter.execute(CleanupStaleOutputsExecuter.java:93)
	at org.gradle.api.internal.tasks.execution.FinalizePropertiesTaskExecuter.execute(FinalizePropertiesTaskExecuter.java:45)
	at org.gradle.api.internal.tasks.execution.ResolveTaskExecutionModeExecuter.execute(ResolveTaskExecutionModeExecuter.java:94)
	at org.gradle.api.internal.tasks.execution.SkipTaskWithNoActionsExecuter.execute(SkipTaskWithNoActionsExecuter.java:57)
	at org.gradle.api.internal.tasks.execution.SkipOnlyIfTaskExecuter.execute(SkipOnlyIfTaskExecuter.java:56)
	at org.gradle.api.internal.tasks.execution.CatchExceptionTaskExecuter.execute(CatchExceptionTaskExecuter.java:36)
	at org.gradle.api.internal.tasks.execution.EventFiringTaskExecuter$1.executeTask(EventFiringTaskExecuter.java:63)
	at org.gradle.api.internal.tasks.execution.EventFiringTaskExecuter$1.call(EventFiringTaskExecuter.java:49)
	at org.gradle.api.internal.tasks.execution.EventFiringTaskExecuter$1.call(EventFiringTaskExecuter.java:46)
	at org.gradle.internal.operations.DefaultBuildOperationExecutor$CallableBuildOperationWorker.execute(DefaultBuildOperationExecutor.java:416)
	at org.gradle.internal.operations.DefaultBuildOperationExecutor$CallableBuildOperationWorker.execute(DefaultBuildOperationExecutor.java:406)
	at org.gradle.internal.operations.DefaultBuildOperationExecutor$1.execute(DefaultBuildOperationExecutor.java:165)
	at org.gradle.internal.operations.DefaultBuildOperationExecutor.execute(DefaultBuildOperationExecutor.java:250)
	at org.gradle.internal.operations.DefaultBuildOperationExecutor.execute(DefaultBuildOperationExecutor.java:158)
	at org.gradle.internal.operations.DefaultBuildOperationExecutor.call(DefaultBuildOperationExecutor.java:102)
	at org.gradle.internal.operations.DelegatingBuildOperationExecutor.call(DelegatingBuildOperationExecutor.java:36)
	at org.gradle.api.internal.tasks.execution.EventFiringTaskExecuter.execute(EventFiringTaskExecuter.java:46)
	at org.gradle.execution.plan.LocalTaskNodeExecutor.execute(LocalTaskNodeExecutor.java:43)
	at org.gradle.execution.taskgraph.DefaultTaskExecutionGraph$InvokeNodeExecutorsAction.execute(DefaultTaskExecutionGraph.java:355)
	at org.gradle.execution.taskgraph.DefaultTaskExecutionGraph$InvokeNodeExecutorsAction.execute(DefaultTaskExecutionGraph.java:343)
	at org.gradle.execution.taskgraph.DefaultTaskExecutionGraph$BuildOperationAwareExecutionAction.execute(DefaultTaskExecutionGraph.java:336)
	at org.gradle.execution.taskgraph.DefaultTaskExecutionGraph$BuildOperationAwareExecutionAction.execute(DefaultTaskExecutionGraph.java:322)
	at org.gradle.execution.plan.DefaultPlanExecutor$ExecutorWorker$1.execute(DefaultPlanExecutor.java:134)
	at org.gradle.execution.plan.DefaultPlanExecutor$ExecutorWorker$1.execute(DefaultPlanExecutor.java:129)
	at org.gradle.execution.plan.DefaultPlanExecutor$ExecutorWorker.execute(DefaultPlanExecutor.java:202)
	at org.gradle.execution.plan.DefaultPlanExecutor$ExecutorWorker.executeNextNode(DefaultPlanExecutor.java:193)
	at org.gradle.execution.plan.DefaultPlanExecutor$ExecutorWorker.run(DefaultPlanExecutor.java:129)
	at org.gradle.internal.concurrent.ExecutorPolicy$CatchAndRecordFailures.onExecute(ExecutorPolicy.java:63)
	at org.gradle.internal.concurrent.ManagedExecutorImpl$1.run(ManagedExecutorImpl.java:46)
	at org.gradle.internal.concurrent.ThreadFactoryImpl$ManagedThreadRunnable.run(ThreadFactoryImpl.java:55)
Caused by: org.gradle.process.internal.ExecException: Process 'Gradle Test Executor 1' finished
with non-zero exit value 143
This problem might be caused by incorrect test process configuration.
Please refer to the test execution section in the User Manual at https://docs.gradle.org/5.2.1/userguide/java_testing.html#sec:test_execution
	at org.gradle.api.internal.tasks.testing.worker.ForkingTestClassProcessor.stop(ForkingTestClassProcessor.java:163)
	at org.gradle.api.internal.tasks.testing.processors.RestartEveryNTestClassProcessor.endBatch(RestartEveryNTestClassProcessor.java:77)
	at org.gradle.api.internal.tasks.testing.processors.RestartEveryNTestClassProcessor.stop(RestartEveryNTestClassProcessor.java:62)
	at org.gradle.internal.dispatch.ReflectionDispatch.dispatch(ReflectionDispatch.java:35)
	at org.gradle.internal.dispatch.ReflectionDispatch.dispatch(ReflectionDispatch.java:24)
	at org.gradle.internal.dispatch.FailureHandlingDispatch.dispatch(FailureHandlingDispatch.java:29)
	at org.gradle.internal.dispatch.AsyncDispatch.dispatchMessages(AsyncDispatch.java:87)
	at org.gradle.internal.dispatch.AsyncDispatch.access$000(AsyncDispatch.java:36)
	at org.gradle.internal.dispatch.AsyncDispatch$1.run(AsyncDispatch.java:71)
	at org.gradle.internal.concurrent.InterruptibleRunnable.run(InterruptibleRunnable.java:42)
	at org.gradle.internal.operations.CurrentBuildOperationPreservingRunnable.run(CurrentBuildOperationPreservingRunnable.java:42)
	... 3 more


* Get more help at https://help.gradle.org

BUILD FAILED in 8m 3s
The message received from the daemon indicates that the daemon has disappeared.
Build request sent: Build{id=5815e436-1fcf-458c-b574-0562f1ae3c1e, currentDir=<https://builds.apache.org/job/beam_PerformanceTests_ParquetIOIT/ws/src}>
Attempting to read last messages from the daemon log...
Daemon pid: 8025
  log file: /home/jenkins/.gradle/daemon/5.2.1/daemon-8025.out.log
----- Last  20 lines from daemon log file - daemon-8025.out.log -----
	at org.gradle.internal.dispatch.FailureHandlingDispatch.dispatch(FailureHandlingDispatch.java:29)
	at org.gradle.internal.dispatch.AsyncDispatch.dispatchMessages(AsyncDispatch.java:87)
	at org.gradle.internal.dispatch.AsyncDispatch.access$000(AsyncDispatch.java:36)
	at org.gradle.internal.dispatch.AsyncDispatch$1.run(AsyncDispatch.java:71)
	at org.gradle.internal.concurrent.InterruptibleRunnable.run(InterruptibleRunnable.java:42)
	at org.gradle.internal.operations.CurrentBuildOperationPreservingRunnable.run(CurrentBuildOperationPreservingRunnable.java:42)
	... 3 more


* Get more help at https://help.gradle.org

Deprecated Gradle features were used in this build, making it incompatible with Gradle 6.0.
Use '--warning-mode all' to show the individual deprecation warnings.
See https://docs.gradle.org/5.2.1/userguide/command_line_interface.html#sec:command_line_warnings

BUILD FAILED in 8m 3s
86 actionable tasks: 55 executed, 31 from cache

Publishing build scan...
Daemon vm is shutting down... The daemon has exited normally or was terminated in response
to a user interrupt.
----- End of the daemon log -----


FAILURE: Build failed with an exception.

* What went wrong:
Gradle build daemon disappeared unexpectedly (it may have been killed or may have crashed)

* Try:
Run with --debug option to get more log output. Run with --scan to get full insights.

* Exception is:
org.gradle.launcher.daemon.client.DaemonDisappearedException: Gradle build daemon disappeared
unexpectedly (it may have been killed or may have crashed)
	at org.gradle.launcher.daemon.client.DaemonClient.handleDaemonDisappearance(DaemonClient.java:241)
	at org.gradle.launcher.daemon.client.DaemonClient.monitorBuild(DaemonClient.java:217)
	at org.gradle.launcher.daemon.client.DaemonClient.executeBuild(DaemonClient.java:179)
	at org.gradle.launcher.daemon.client.DaemonClient.execute(DaemonClient.java:142)
	at org.gradle.launcher.daemon.client.DaemonClient.execute(DaemonClient.java:94)
	at org.gradle.launcher.cli.RunBuildAction.run(RunBuildAction.java:55)
	at org.gradle.internal.Actions$RunnableActionAdapter.execute(Actions.java:207)
	at org.gradle.launcher.cli.CommandLineActionFactory$ParseAndBuildAction.execute(CommandLineActionFactory.java:403)
	at org.gradle.launcher.cli.CommandLineActionFactory$ParseAndBuildAction.execute(CommandLineActionFactory.java:376)
	at org.gradle.launcher.cli.ExceptionReportingAction.execute(ExceptionReportingAction.java:37)
	at org.gradle.launcher.cli.ExceptionReportingAction.execute(ExceptionReportingAction.java:23)
	at org.gradle.launcher.cli.CommandLineActionFactory$WithLogging.execute(CommandLineActionFactory.java:369)
	at org.gradle.launcher.cli.CommandLineActionFactory$WithLogging.execute(CommandLineActionFactory.java:299)
	at org.gradle.launcher.Main.doAction(Main.java:36)
	at org.gradle.launcher.bootstrap.EntryPoint.run(EntryPoint.java:45)
	at sun.reflect.NativeMethodAccessorImpl.invoke0(Native Method)
	at sun.reflect.NativeMethodAccessorImpl.invoke(NativeMethodAccessorImpl.java:62)
	at sun.reflect.DelegatingMethodAccessorImpl.invoke(DelegatingMethodAccessorImpl.java:43)
	at java.lang.reflect.Method.invoke(Method.java:498)
	at org.gradle.launcher.bootstrap.ProcessBootstrap.runNoExit(ProcessBootstrap.java:60)
	at org.gradle.launcher.bootstrap.ProcessBootstrap.run(ProcessBootstrap.java:37)
	at org.gradle.launcher.GradleMain.main(GradleMain.java:23)
	at sun.reflect.NativeMethodAccessorImpl.invoke0(Native Method)
	at sun.reflect.NativeMethodAccessorImpl.invoke(NativeMethodAccessorImpl.java:62)
	at sun.reflect.DelegatingMethodAccessorImpl.invoke(DelegatingMethodAccessorImpl.java:43)
	at java.lang.reflect.Method.invoke(Method.java:498)
	at org.gradle.wrapper.BootstrapMainStarter.start(BootstrapMainStarter.java:31)
	at org.gradle.wrapper.WrapperExecutor.execute(WrapperExecutor.java:108)
	at org.gradle.wrapper.GradleWrapperMain.main(GradleWrapperMain.java:61)


* Get more help at https://help.gradle.org

2019-07-01 00:31:47,631 861588ad MainThread beam_integration_benchmark(1/1) ERROR    Error
during benchmark beam_integration_benchmark
Traceback (most recent call last):
  File "<https://builds.apache.org/job/beam_PerformanceTests_ParquetIOIT/ws/PerfKitBenchmarker/perfkitbenchmarker/pkb.py",>
line 760, in RunBenchmark
    DoRunPhase(spec, collector, detailed_timer)
  File "<https://builds.apache.org/job/beam_PerformanceTests_ParquetIOIT/ws/PerfKitBenchmarker/perfkitbenchmarker/pkb.py",>
line 609, in DoRunPhase
    samples = spec.BenchmarkRun(spec)
  File "<https://builds.apache.org/job/beam_PerformanceTests_ParquetIOIT/ws/PerfKitBenchmarker/perfkitbenchmarker/linux_benchmarks/beam_integration_benchmark.py",>
line 160, in Run
    job_type=job_type)
  File "<https://builds.apache.org/job/beam_PerformanceTests_ParquetIOIT/ws/PerfKitBenchmarker/perfkitbenchmarker/providers/gcp/gcp_dpb_dataflow.py",>
line 90, in SubmitJob
    assert retcode == 0, "Integration Test Failed."
AssertionError: Integration Test Failed.
2019-07-01 00:31:47,632 861588ad MainThread beam_integration_benchmark(1/1) INFO     Cleaning
up benchmark beam_integration_benchmark
2019-07-01 00:31:47,634 861588ad MainThread beam_integration_benchmark(1/1) ERROR    Exception
running benchmark
Traceback (most recent call last):
  File "<https://builds.apache.org/job/beam_PerformanceTests_ParquetIOIT/ws/PerfKitBenchmarker/perfkitbenchmarker/pkb.py",>
line 903, in RunBenchmarkTask
    RunBenchmark(spec, collector)
  File "<https://builds.apache.org/job/beam_PerformanceTests_ParquetIOIT/ws/PerfKitBenchmarker/perfkitbenchmarker/pkb.py",>
line 760, in RunBenchmark
    DoRunPhase(spec, collector, detailed_timer)
  File "<https://builds.apache.org/job/beam_PerformanceTests_ParquetIOIT/ws/PerfKitBenchmarker/perfkitbenchmarker/pkb.py",>
line 609, in DoRunPhase
    samples = spec.BenchmarkRun(spec)
  File "<https://builds.apache.org/job/beam_PerformanceTests_ParquetIOIT/ws/PerfKitBenchmarker/perfkitbenchmarker/linux_benchmarks/beam_integration_benchmark.py",>
line 160, in Run
    job_type=job_type)
  File "<https://builds.apache.org/job/beam_PerformanceTests_ParquetIOIT/ws/PerfKitBenchmarker/perfkitbenchmarker/providers/gcp/gcp_dpb_dataflow.py",>
line 90, in SubmitJob
    assert retcode == 0, "Integration Test Failed."
AssertionError: Integration Test Failed.
2019-07-01 00:31:47,635 861588ad MainThread beam_integration_benchmark(1/1) ERROR    Benchmark
1/1 beam_integration_benchmark (UID: beam_integration_benchmark0) failed. Execution will continue.
2019-07-01 00:31:47,635 861588ad MainThread beam_integration_benchmark(1/1) INFO     Benchmark
run statuses:
---------------------------------------------------------------------------------
Name                        UID                          Status  Failed Substatus
---------------------------------------------------------------------------------
beam_integration_benchmark  beam_integration_benchmark0  FAILED                  
---------------------------------------------------------------------------------
Success rate: 0.00% (0/1)
2019-07-01 00:31:47,636 861588ad MainThread beam_integration_benchmark(1/1) INFO     Complete
logs can be found at: <https://builds.apache.org/job/beam_PerformanceTests_ParquetIOIT/ws/runs/861588ad/pkb.log>
2019-07-01 00:31:47,636 861588ad MainThread beam_integration_benchmark(1/1) INFO     Completion
statuses can be found at: <https://builds.apache.org/job/beam_PerformanceTests_ParquetIOIT/ws/runs/861588ad/completion_statuses.json>
Build step 'Execute shell' marked build as failure

---------------------------------------------------------------------
To unsubscribe, e-mail: builds-unsubscribe@beam.apache.org
For additional commands, e-mail: builds-help@beam.apache.org


Mime
View raw message