beam-builds mailing list archives

Site index · List index
Message view « Date » · « Thread »
Top « Date » · « Thread »
From Apache Jenkins Server <jenk...@builds.apache.org>
Subject Build failed in Jenkins: beam_PostCommit_Py_VR_Dataflow #3927
Date Mon, 01 Jul 2019 19:19:39 GMT
See <https://builds.apache.org/job/beam_PostCommit_Py_VR_Dataflow/3927/display/redirect>

------------------------------------------
[...truncated 420.00 KB...]
test_dofn_lifecycle (apache_beam.transforms.dofn_lifecycle_test.DoFnLifecycleTest) ... ok
test_as_dict_twice (apache_beam.transforms.sideinputs_test.SideInputsTest) ... ok
test_flatten_multiple_pcollections_having_multiple_consumers (apache_beam.transforms.ptransform_test.PTransformTest)
... ok
test_par_do_with_multiple_outputs_and_using_return (apache_beam.transforms.ptransform_test.PTransformTest)
... ok
test_multiple_empty_outputs (apache_beam.transforms.ptransform_test.PTransformTest) ... ok
test_undeclared_outputs (apache_beam.transforms.ptransform_test.PTransformTest) ... ok
test_par_do_with_multiple_outputs_and_using_yield (apache_beam.transforms.ptransform_test.PTransformTest)
... ok
test_as_list_and_as_dict_side_inputs (apache_beam.transforms.sideinputs_test.SideInputsTest)
... ok
test_as_singleton_with_different_defaults (apache_beam.transforms.sideinputs_test.SideInputsTest)
... ok
test_iterable_side_input (apache_beam.transforms.sideinputs_test.SideInputsTest) ... ok
test_as_list_twice (apache_beam.transforms.sideinputs_test.SideInputsTest) ... ok
test_default_value_singleton_side_input (apache_beam.transforms.sideinputs_test.SideInputsTest)
... ok
test_empty_singleton_side_input (apache_beam.transforms.sideinputs_test.SideInputsTest) ...
ok
test_as_singleton_without_unique_labels (apache_beam.transforms.sideinputs_test.SideInputsTest)
... ok
test_flattened_side_input (apache_beam.transforms.sideinputs_test.SideInputsTest) ... ok
test_multi_valued_singleton_side_input (apache_beam.transforms.sideinputs_test.SideInputsTest)
... ok

----------------------------------------------------------------------
XML: <https://builds.apache.org/job/beam_PostCommit_Py_VR_Dataflow/ws/src/sdks/python/nosetests.xml>
----------------------------------------------------------------------
Ran 17 tests in 1390.163s

OK

> Task :sdks:python:test-suites:dataflow:py35:validatesRunnerStreamingTests
>>> RUNNING integration tests with pipeline options: --runner=TestDataflowRunner
--project=apache-beam-testing --staging_location=gs://temp-storage-for-end-to-end-tests/staging-it
--temp_location=gs://temp-storage-for-end-to-end-tests/temp-it --output=gs://temp-storage-for-end-to-end-tests/py-it-cloud/output
--sdk_location=<https://builds.apache.org/job/beam_PostCommit_Py_VR_Dataflow/ws/src/sdks/python/test-suites/dataflow/py35/build/apache-beam.tar.gz>
--requirements_file=postcommit_requirements.txt --num_workers=1 --sleep_secs=20 --streaming
--dataflow_worker_jar=<https://builds.apache.org/job/beam_PostCommit_Py_VR_Dataflow/ws/src/runners/google-cloud-dataflow-java/worker/build/libs/beam-runners-google-cloud-dataflow-java-fn-api-worker-2.15.0-SNAPSHOT.jar>
--kms_key_name=projects/apache-beam-testing/locations/global/keyRings/beam-it/cryptoKeys/test
--dataflow_kms_key=projects/apache-beam-testing/locations/global/keyRings/beam-it/cryptoKeys/test
>>>   test options: --nocapture --processes=8 --process-timeout=4500 --attr=ValidatesRunner,!sickbay-streaming
running nosetests
running egg_info
writing apache_beam.egg-info/PKG-INFO
writing dependency_links to apache_beam.egg-info/dependency_links.txt
writing top-level names to apache_beam.egg-info/top_level.txt
writing requirements to apache_beam.egg-info/requires.txt
writing entry points to apache_beam.egg-info/entry_points.txt
reading manifest file 'apache_beam.egg-info/SOURCES.txt'
reading manifest template 'MANIFEST.in'
setup.py:177: UserWarning: Some syntactic constructs of Python 3 are not yet fully supported
by Apache Beam.
  'Some syntactic constructs of Python 3 are not yet fully supported by '
<https://builds.apache.org/job/beam_PostCommit_Py_VR_Dataflow/ws/src/build/gradleenv/-1734967054/lib/python3.5/site-packages/setuptools/dist.py>:472:
UserWarning: Normalizing '2.15.0.dev' to '2.15.0.dev0'
  normalized_version,
warning: no files found matching 'README.md'
warning: no files found matching 'NOTICE'
warning: no files found matching 'LICENSE'
writing manifest file 'apache_beam.egg-info/SOURCES.txt'
<https://builds.apache.org/job/beam_PostCommit_Py_VR_Dataflow/ws/src/sdks/python/apache_beam/__init__.py>:84:
UserWarning: Some syntactic constructs of Python 3 are not yet fully supported by Apache Beam.
  'Some syntactic constructs of Python 3 are not yet fully supported by '
<https://builds.apache.org/job/beam_PostCommit_Py_VR_Dataflow/ws/src/sdks/python/apache_beam/io/gcp/datastore/v1/datastoreio.py>:59:
UserWarning: Datastore IO will support Python 3 after replacing googledatastore by google-cloud-datastore,
see: BEAM-4543.
  warnings.warn('Datastore IO will support Python 3 after replacing '
<https://builds.apache.org/job/beam_PostCommit_Py_VR_Dataflow/ws/src/sdks/python/apache_beam/io/vcfio.py>:47:
UserWarning: VCF IO will support Python 3 after migration to Nucleus, see: BEAM-5628.
  warnings.warn("VCF IO will support Python 3 after migration to Nucleus, "

> Task :sdks:python:validatesRunnerStreamingTests
test_as_list_and_as_dict_side_inputs (apache_beam.transforms.sideinputs_test.SideInputsTest)
... ok
test_flatten_multiple_pcollections_having_multiple_consumers (apache_beam.transforms.ptransform_test.PTransformTest)
... ok
test_par_do_with_multiple_outputs_and_using_yield (apache_beam.transforms.ptransform_test.PTransformTest)
... ok
test_as_dict_twice (apache_beam.transforms.sideinputs_test.SideInputsTest) ... ok
test_dofn_lifecycle (apache_beam.transforms.dofn_lifecycle_test.DoFnLifecycleTest) ... ok
test_multiple_empty_outputs (apache_beam.transforms.ptransform_test.PTransformTest) ... ok
test_par_do_with_multiple_outputs_and_using_return (apache_beam.transforms.ptransform_test.PTransformTest)
... ok
test_undeclared_outputs (apache_beam.transforms.ptransform_test.PTransformTest) ... ok
test_default_value_singleton_side_input (apache_beam.transforms.sideinputs_test.SideInputsTest)
... ok
test_as_list_twice (apache_beam.transforms.sideinputs_test.SideInputsTest) ... ok
test_as_singleton_with_different_defaults (apache_beam.transforms.sideinputs_test.SideInputsTest)
... ok
test_as_singleton_without_unique_labels (apache_beam.transforms.sideinputs_test.SideInputsTest)
... ok
test_empty_singleton_side_input (apache_beam.transforms.sideinputs_test.SideInputsTest) ...
ok
test_flattened_side_input (apache_beam.transforms.sideinputs_test.SideInputsTest) ... ok
test_iterable_side_input (apache_beam.transforms.sideinputs_test.SideInputsTest) ... ok

----------------------------------------------------------------------
XML: <https://builds.apache.org/job/beam_PostCommit_Py_VR_Dataflow/ws/src/sdks/python/nosetests.xml>
----------------------------------------------------------------------
Ran 15 tests in 999.624s

OK
Found: https://console.cloud.google.com/dataflow/jobsDetail/locations/us-central1/jobs/2019-07-01_11_58_34-9999586643757317693?project=apache-beam-testing.
Found: https://console.cloud.google.com/dataflow/jobsDetail/locations/us-central1/jobs/2019-07-01_12_06_45-4373900073429731164?project=apache-beam-testing.
Found: https://console.cloud.google.com/dataflow/jobsDetail/locations/us-central1/jobs/2019-07-01_11_58_35-13813119955505731187?project=apache-beam-testing.
Found: https://console.cloud.google.com/dataflow/jobsDetail/locations/us-central1/jobs/2019-07-01_11_58_35-2727011898487421800?project=apache-beam-testing.
Found: https://console.cloud.google.com/dataflow/jobsDetail/locations/us-central1/jobs/2019-07-01_12_06_50-7856137060888533276?project=apache-beam-testing.
Found: https://console.cloud.google.com/dataflow/jobsDetail/locations/us-central1/jobs/2019-07-01_11_58_34-13301751915844297911?project=apache-beam-testing.
Found: https://console.cloud.google.com/dataflow/jobsDetail/locations/us-central1/jobs/2019-07-01_12_06_44-4092027208397049282?project=apache-beam-testing.
Found: https://console.cloud.google.com/dataflow/jobsDetail/locations/us-central1/jobs/2019-07-01_11_58_34-2590514241944065025?project=apache-beam-testing.
Found: https://console.cloud.google.com/dataflow/jobsDetail/locations/us-central1/jobs/2019-07-01_12_06_15-11959746176545248937?project=apache-beam-testing.
Found: https://console.cloud.google.com/dataflow/jobsDetail/locations/us-central1/jobs/2019-07-01_11_58_35-14012496569988814835?project=apache-beam-testing.
Found: https://console.cloud.google.com/dataflow/jobsDetail/locations/us-central1/jobs/2019-07-01_12_05_39-4863359308936590441?project=apache-beam-testing.
Found: https://console.cloud.google.com/dataflow/jobsDetail/locations/us-central1/jobs/2019-07-01_11_58_35-15053856260166824979?project=apache-beam-testing.
Found: https://console.cloud.google.com/dataflow/jobsDetail/locations/us-central1/jobs/2019-07-01_12_06_20-11243909122219349842?project=apache-beam-testing.
Found: https://console.cloud.google.com/dataflow/jobsDetail/locations/us-central1/jobs/2019-07-01_11_58_34-10883896506917907115?project=apache-beam-testing.
Found: https://console.cloud.google.com/dataflow/jobsDetail/locations/us-central1/jobs/2019-07-01_12_06_25-10066459854381082716?project=apache-beam-testing.

> Task :sdks:python:test-suites:dataflow:py37:validatesRunnerStreamingTests
Found: https://console.cloud.google.com/dataflow/jobsDetail/locations/us-central1/jobs/2019-07-01_11_59_25-16879297496556839361?project=apache-beam-testing.
Found: https://console.cloud.google.com/dataflow/jobsDetail/locations/us-central1/jobs/2019-07-01_12_07_20-9065634355580072235?project=apache-beam-testing.
Found: https://console.cloud.google.com/dataflow/jobsDetail/locations/us-central1/jobs/2019-07-01_11_59_27-10022216970095209468?project=apache-beam-testing.
Found: https://console.cloud.google.com/dataflow/jobsDetail/locations/us-central1/jobs/2019-07-01_12_07_17-13725715816492100467?project=apache-beam-testing.
Found: https://console.cloud.google.com/dataflow/jobsDetail/locations/us-central1/jobs/2019-07-01_11_59_27-8693260692777903036?project=apache-beam-testing.
Found: https://console.cloud.google.com/dataflow/jobsDetail/locations/us-central1/jobs/2019-07-01_12_08_08-7075070732039897244?project=apache-beam-testing.
Found: https://console.cloud.google.com/dataflow/jobsDetail/locations/us-central1/jobs/2019-07-01_11_59_27-15118429594977902608?project=apache-beam-testing.
Found: https://console.cloud.google.com/dataflow/jobsDetail/locations/us-central1/jobs/2019-07-01_12_08_08-6211188256540940293?project=apache-beam-testing.
Found: https://console.cloud.google.com/dataflow/jobsDetail/locations/us-central1/jobs/2019-07-01_11_59_26-5482507076444487177?project=apache-beam-testing.
Found: https://console.cloud.google.com/dataflow/jobsDetail/locations/us-central1/jobs/2019-07-01_11_59_27-17200142116236497243?project=apache-beam-testing.
Found: https://console.cloud.google.com/dataflow/jobsDetail/locations/us-central1/jobs/2019-07-01_12_08_03-6208380918287875936?project=apache-beam-testing.
Found: https://console.cloud.google.com/dataflow/jobsDetail/locations/us-central1/jobs/2019-07-01_11_59_26-5631705523779691298?project=apache-beam-testing.
Found: https://console.cloud.google.com/dataflow/jobsDetail/locations/us-central1/jobs/2019-07-01_12_08_12-3695534112685038867?project=apache-beam-testing.
Found: https://console.cloud.google.com/dataflow/jobsDetail/locations/us-central1/jobs/2019-07-01_11_59_27-17098693302014258254?project=apache-beam-testing.
Found: https://console.cloud.google.com/dataflow/jobsDetail/locations/us-central1/jobs/2019-07-01_12_07_43-5871052688941953116?project=apache-beam-testing.
test_flatten_multiple_pcollections_having_multiple_consumers (apache_beam.transforms.ptransform_test.PTransformTest)
... ok
test_dofn_lifecycle (apache_beam.transforms.dofn_lifecycle_test.DoFnLifecycleTest) ... ok
test_as_list_and_as_dict_side_inputs (apache_beam.transforms.sideinputs_test.SideInputsTest)
... ok
test_undeclared_outputs (apache_beam.transforms.ptransform_test.PTransformTest) ... ok
test_par_do_with_multiple_outputs_and_using_return (apache_beam.transforms.ptransform_test.PTransformTest)
... ok
test_multiple_empty_outputs (apache_beam.transforms.ptransform_test.PTransformTest) ... ok
test_as_dict_twice (apache_beam.transforms.sideinputs_test.SideInputsTest) ... ok
test_par_do_with_multiple_outputs_and_using_yield (apache_beam.transforms.ptransform_test.PTransformTest)
... ok
test_as_singleton_with_different_defaults (apache_beam.transforms.sideinputs_test.SideInputsTest)
... ok
test_as_list_twice (apache_beam.transforms.sideinputs_test.SideInputsTest) ... ok
test_empty_singleton_side_input (apache_beam.transforms.sideinputs_test.SideInputsTest) ...
ok
test_as_singleton_without_unique_labels (apache_beam.transforms.sideinputs_test.SideInputsTest)
... ok
test_flattened_side_input (apache_beam.transforms.sideinputs_test.SideInputsTest) ... ok
test_iterable_side_input (apache_beam.transforms.sideinputs_test.SideInputsTest) ... ok
test_default_value_singleton_side_input (apache_beam.transforms.sideinputs_test.SideInputsTest)
... ok

----------------------------------------------------------------------
XML: <https://builds.apache.org/job/beam_PostCommit_Py_VR_Dataflow/ws/src/sdks/python/nosetests.xml>
----------------------------------------------------------------------
Ran 15 tests in 1044.316s

OK

> Task :sdks:python:test-suites:dataflow:py36:validatesRunnerStreamingTests
Found: https://console.cloud.google.com/dataflow/jobsDetail/locations/us-central1/jobs/2019-07-01_12_01_17-8225289524116241730?project=apache-beam-testing.
Found: https://console.cloud.google.com/dataflow/jobsDetail/locations/us-central1/jobs/2019-07-01_12_08_58-7318622575012336308?project=apache-beam-testing.
Found: https://console.cloud.google.com/dataflow/jobsDetail/locations/us-central1/jobs/2019-07-01_12_01_18-718436912072575938?project=apache-beam-testing.
Found: https://console.cloud.google.com/dataflow/jobsDetail/locations/us-central1/jobs/2019-07-01_12_10_04-8063233024324849755?project=apache-beam-testing.
Found: https://console.cloud.google.com/dataflow/jobsDetail/locations/us-central1/jobs/2019-07-01_12_01_17-8575666505408878535?project=apache-beam-testing.
Found: https://console.cloud.google.com/dataflow/jobsDetail/locations/us-central1/jobs/2019-07-01_12_08_58-13363838092590290210?project=apache-beam-testing.
Found: https://console.cloud.google.com/dataflow/jobsDetail/locations/us-central1/jobs/2019-07-01_12_01_18-8995158337342849526?project=apache-beam-testing.
Found: https://console.cloud.google.com/dataflow/jobsDetail/locations/us-central1/jobs/2019-07-01_12_01_18-11900403908461197967?project=apache-beam-testing.
Found: https://console.cloud.google.com/dataflow/jobsDetail/locations/us-central1/jobs/2019-07-01_12_10_04-6646766672261390904?project=apache-beam-testing.
Found: https://console.cloud.google.com/dataflow/jobsDetail/locations/us-central1/jobs/2019-07-01_12_01_18-6429425617609518635?project=apache-beam-testing.
Found: https://console.cloud.google.com/dataflow/jobsDetail/locations/us-central1/jobs/2019-07-01_12_10_14-7517966919150968852?project=apache-beam-testing.
Found: https://console.cloud.google.com/dataflow/jobsDetail/locations/us-central1/jobs/2019-07-01_12_01_18-11294269524100291343?project=apache-beam-testing.
Found: https://console.cloud.google.com/dataflow/jobsDetail/locations/us-central1/jobs/2019-07-01_12_10_33-1770830439374862000?project=apache-beam-testing.
Found: https://console.cloud.google.com/dataflow/jobsDetail/locations/us-central1/jobs/2019-07-01_12_01_18-12187617162790426180?project=apache-beam-testing.
Found: https://console.cloud.google.com/dataflow/jobsDetail/locations/us-central1/jobs/2019-07-01_12_10_15-1766350056680070049?project=apache-beam-testing.
test_dofn_lifecycle (apache_beam.transforms.dofn_lifecycle_test.DoFnLifecycleTest) ... ok
test_multiple_empty_outputs (apache_beam.transforms.ptransform_test.PTransformTest) ... ok
test_flatten_multiple_pcollections_having_multiple_consumers (apache_beam.transforms.ptransform_test.PTransformTest)
... ok
test_par_do_with_multiple_outputs_and_using_yield (apache_beam.transforms.ptransform_test.PTransformTest)
... ok
test_as_list_and_as_dict_side_inputs (apache_beam.transforms.sideinputs_test.SideInputsTest)
... ok
test_undeclared_outputs (apache_beam.transforms.ptransform_test.PTransformTest) ... ok
test_as_dict_twice (apache_beam.transforms.sideinputs_test.SideInputsTest) ... ok
test_par_do_with_multiple_outputs_and_using_return (apache_beam.transforms.ptransform_test.PTransformTest)
... ok
test_as_list_twice (apache_beam.transforms.sideinputs_test.SideInputsTest) ... ok
test_as_singleton_with_different_defaults (apache_beam.transforms.sideinputs_test.SideInputsTest)
... ok
test_empty_singleton_side_input (apache_beam.transforms.sideinputs_test.SideInputsTest) ...
ok
test_as_singleton_without_unique_labels (apache_beam.transforms.sideinputs_test.SideInputsTest)
... ok
test_iterable_side_input (apache_beam.transforms.sideinputs_test.SideInputsTest) ... ok
test_default_value_singleton_side_input (apache_beam.transforms.sideinputs_test.SideInputsTest)
... ok
test_flattened_side_input (apache_beam.transforms.sideinputs_test.SideInputsTest) ... ok

----------------------------------------------------------------------
XML: <https://builds.apache.org/job/beam_PostCommit_Py_VR_Dataflow/ws/src/sdks/python/nosetests.xml>
----------------------------------------------------------------------
Ran 15 tests in 1096.062s

OK

> Task :sdks:python:test-suites:dataflow:py35:validatesRunnerStreamingTests
Found: https://console.cloud.google.com/dataflow/jobsDetail/locations/us-central1/jobs/2019-07-01_12_01_53-3432536141016180744?project=apache-beam-testing.
Found: https://console.cloud.google.com/dataflow/jobsDetail/locations/us-central1/jobs/2019-07-01_12_09_49-6678831645558410564?project=apache-beam-testing.
Found: https://console.cloud.google.com/dataflow/jobsDetail/locations/us-central1/jobs/2019-07-01_12_01_53-3628864594867108299?project=apache-beam-testing.
Found: https://console.cloud.google.com/dataflow/jobsDetail/locations/us-central1/jobs/2019-07-01_12_10_44-7836498339493374894?project=apache-beam-testing.
Found: https://console.cloud.google.com/dataflow/jobsDetail/locations/us-central1/jobs/2019-07-01_12_01_54-4443800808021080148?project=apache-beam-testing.
Found: https://console.cloud.google.com/dataflow/jobsDetail/locations/us-central1/jobs/2019-07-01_12_01_53-9543272638084330752?project=apache-beam-testing.
Found: https://console.cloud.google.com/dataflow/jobsDetail/locations/us-central1/jobs/2019-07-01_12_10_34-13053203417992700028?project=apache-beam-testing.
Found: https://console.cloud.google.com/dataflow/jobsDetail/locations/us-central1/jobs/2019-07-01_12_01_54-1236906175968800407?project=apache-beam-testing.
Found: https://console.cloud.google.com/dataflow/jobsDetail/locations/us-central1/jobs/2019-07-01_12_09_45-17871082944853832957?project=apache-beam-testing.
Found: https://console.cloud.google.com/dataflow/jobsDetail/locations/us-central1/jobs/2019-07-01_12_01_54-15904627335722882264?project=apache-beam-testing.
Found: https://console.cloud.google.com/dataflow/jobsDetail/locations/us-central1/jobs/2019-07-01_12_11_20-14559349782783886444?project=apache-beam-testing.
Found: https://console.cloud.google.com/dataflow/jobsDetail/locations/us-central1/jobs/2019-07-01_12_01_53-4713539334572236938?project=apache-beam-testing.
Found: https://console.cloud.google.com/dataflow/jobsDetail/locations/us-central1/jobs/2019-07-01_12_10_24-10983595739703482239?project=apache-beam-testing.
Found: https://console.cloud.google.com/dataflow/jobsDetail/locations/us-central1/jobs/2019-07-01_12_01_53-17896489723772991462?project=apache-beam-testing.
Found: https://console.cloud.google.com/dataflow/jobsDetail/locations/us-central1/jobs/2019-07-01_12_11_19-3844932461627304899?project=apache-beam-testing.
test_as_dict_twice (apache_beam.transforms.sideinputs_test.SideInputsTest) ... ok
test_dofn_lifecycle (apache_beam.transforms.dofn_lifecycle_test.DoFnLifecycleTest) ... ok
test_undeclared_outputs (apache_beam.transforms.ptransform_test.PTransformTest) ... ok
test_par_do_with_multiple_outputs_and_using_return (apache_beam.transforms.ptransform_test.PTransformTest)
... ok
test_flatten_multiple_pcollections_having_multiple_consumers (apache_beam.transforms.ptransform_test.PTransformTest)
... ok
test_as_list_and_as_dict_side_inputs (apache_beam.transforms.sideinputs_test.SideInputsTest)
... ok
test_par_do_with_multiple_outputs_and_using_yield (apache_beam.transforms.ptransform_test.PTransformTest)
... ok
test_multiple_empty_outputs (apache_beam.transforms.ptransform_test.PTransformTest) ... ok
test_as_singleton_with_different_defaults (apache_beam.transforms.sideinputs_test.SideInputsTest)
... ok
test_as_list_twice (apache_beam.transforms.sideinputs_test.SideInputsTest) ... ok
test_empty_singleton_side_input (apache_beam.transforms.sideinputs_test.SideInputsTest) ...
ok
test_iterable_side_input (apache_beam.transforms.sideinputs_test.SideInputsTest) ... ok
test_default_value_singleton_side_input (apache_beam.transforms.sideinputs_test.SideInputsTest)
... ok
test_flattened_side_input (apache_beam.transforms.sideinputs_test.SideInputsTest) ... ok
test_as_singleton_without_unique_labels (apache_beam.transforms.sideinputs_test.SideInputsTest)
... ok

----------------------------------------------------------------------
XML: <https://builds.apache.org/job/beam_PostCommit_Py_VR_Dataflow/ws/src/sdks/python/nosetests.xml>
----------------------------------------------------------------------
Ran 15 tests in 1092.394s

OK

FAILURE: Build completed with 2 failures.

1: Task failed with an exception.
-----------
* Where:
Build file '<https://builds.apache.org/job/beam_PostCommit_Py_VR_Dataflow/ws/src/sdks/python/build.gradle'>
line: 197

* What went wrong:
Execution failed for task ':sdks:python:validatesRunnerBatchTests'.
> Process 'command 'sh'' finished with non-zero exit value 1

* Try:
Run with --stacktrace option to get the stack trace. Run with --info or --debug option to
get more log output. Run with --scan to get full insights.
==============================================================================

2: Task failed with an exception.
-----------
* Where:
Build file '<https://builds.apache.org/job/beam_PostCommit_Py_VR_Dataflow/ws/src/sdks/python/test-suites/dataflow/py37/build.gradle'>
line: 97

* What went wrong:
Execution failed for task ':sdks:python:test-suites:dataflow:py37:validatesRunnerBatchTests'.
> Process 'command 'sh'' finished with non-zero exit value 1

* Try:
Run with --stacktrace option to get the stack trace. Run with --info or --debug option to
get more log output. Run with --scan to get full insights.
==============================================================================

* Get more help at https://help.gradle.org

Deprecated Gradle features were used in this build, making it incompatible with Gradle 6.0.
Use '--warning-mode all' to show the individual deprecation warnings.
See https://docs.gradle.org/5.2.1/userguide/command_line_interface.html#sec:command_line_warnings

BUILD FAILED in 42m 34s
76 actionable tasks: 61 executed, 15 from cache

Publishing build scan...
https://gradle.com/s/istlxg2g7l5vo

Build step 'Invoke Gradle script' changed build result to FAILURE
Build step 'Invoke Gradle script' marked build as failure

---------------------------------------------------------------------
To unsubscribe, e-mail: builds-unsubscribe@beam.apache.org
For additional commands, e-mail: builds-help@beam.apache.org


Mime
View raw message