beam-builds mailing list archives

Site index · List index
Message view « Date » · « Thread »
Top « Date » · « Thread »
From Apache Jenkins Server <jenk...@builds.apache.org>
Subject Build failed in Jenkins: beam_PostCommit_Python35 #18
Date Mon, 22 Jul 2019 12:00:02 GMT
See <https://builds.apache.org/job/beam_PostCommit_Python35/18/display/redirect?page=changes>

Changes:

[robertwb] [BEAM-7060] Support translation of native type variables.

[robertwb] [BEAM-7060] Translate the typing.Iterable type hint.

[robertwb] Minor fixes discovered in migration.

[robertwb] [BEAM-7060] Automated replace of typehints with typing.

[github] Remove 4 empty spaces from PR template that mess up Python postcommit

[github] Relax pydot requirements.

[robertwb] Post-rewrite lint fixes.

[robertwb] Manual fixes for over-agressive replace.

[robertwb] More conservative typing module translation.

------------------------------------------
[...truncated 75.99 KB...]
test_big_query_write_schema_autodetect (apache_beam.io.gcp.bigquery_write_it_test.BigQueryWriteIntegrationTests)
... ok
test_big_query_write_without_schema (apache_beam.io.gcp.bigquery_write_it_test.BigQueryWriteIntegrationTests)
... ok
test_big_query_legacy_sql (apache_beam.io.gcp.big_query_query_to_table_it_test.BigQueryQueryToTableIT)
... ok
test_big_query_new_types (apache_beam.io.gcp.big_query_query_to_table_it_test.BigQueryQueryToTableIT)
... ok
test_big_query_standard_sql (apache_beam.io.gcp.big_query_query_to_table_it_test.BigQueryQueryToTableIT)
... ok
test_big_query_standard_sql_kms_key_native (apache_beam.io.gcp.big_query_query_to_table_it_test.BigQueryQueryToTableIT)
... SKIP: This test doesn't work on DirectRunner.
test_wordcount_it (apache_beam.examples.wordcount_it_test.WordCountIT) ... ok

======================================================================
ERROR: test_bigquery_read_1M_python (apache_beam.io.gcp.bigquery_io_read_it_test.BigqueryIOReadIT)
----------------------------------------------------------------------
Traceback (most recent call last):
  File "<https://builds.apache.org/job/beam_PostCommit_Python35/ws/src/sdks/python/apache_beam/io/gcp/bigquery_io_read_it_test.py",>
line 58, in test_bigquery_read_1M_python
    self.run_bigquery_io_read_pipeline('1M')
  File "<https://builds.apache.org/job/beam_PostCommit_Python35/ws/src/sdks/python/apache_beam/io/gcp/bigquery_io_read_it_test.py",>
line 54, in run_bigquery_io_read_pipeline
    **extra_opts))
  File "<https://builds.apache.org/job/beam_PostCommit_Python35/ws/src/sdks/python/apache_beam/io/gcp/bigquery_io_read_pipeline.py",>
line 74, in run
    p.run()
  File "<https://builds.apache.org/job/beam_PostCommit_Python35/ws/src/sdks/python/apache_beam/testing/test_pipeline.py",>
line 107, in run
    else test_runner_api))
  File "<https://builds.apache.org/job/beam_PostCommit_Python35/ws/src/sdks/python/apache_beam/pipeline.py",>
line 406, in run
    self._options).run(False)
  File "<https://builds.apache.org/job/beam_PostCommit_Python35/ws/src/sdks/python/apache_beam/pipeline.py",>
line 419, in run
    return self.runner.run_pipeline(self, self._options)
  File "<https://builds.apache.org/job/beam_PostCommit_Python35/ws/src/sdks/python/apache_beam/runners/direct/test_direct_runner.py",>
line 43, in run_pipeline
    self.result = super(TestDirectRunner, self).run_pipeline(pipeline, options)
  File "<https://builds.apache.org/job/beam_PostCommit_Python35/ws/src/sdks/python/apache_beam/runners/direct/direct_runner.py",>
line 129, in run_pipeline
    return runner.run_pipeline(pipeline, options)
  File "<https://builds.apache.org/job/beam_PostCommit_Python35/ws/src/sdks/python/apache_beam/runners/direct/direct_runner.py",>
line 355, in run_pipeline
    pipeline.replace_all(_get_transform_overrides(options))
  File "<https://builds.apache.org/job/beam_PostCommit_Python35/ws/src/sdks/python/apache_beam/pipeline.py",>
line 389, in replace_all
    self._replace(override)
  File "<https://builds.apache.org/job/beam_PostCommit_Python35/ws/src/sdks/python/apache_beam/pipeline.py",>
line 300, in _replace
    self.visit(TransformUpdater(self))
  File "<https://builds.apache.org/job/beam_PostCommit_Python35/ws/src/sdks/python/apache_beam/pipeline.py",>
line 447, in visit
    self._root_transform().visit(visitor, self, visited)
  File "<https://builds.apache.org/job/beam_PostCommit_Python35/ws/src/sdks/python/apache_beam/pipeline.py",>
line 824, in visit
    part.visit(visitor, pipeline, visited)
  File "<https://builds.apache.org/job/beam_PostCommit_Python35/ws/src/sdks/python/apache_beam/pipeline.py",>
line 824, in visit
    part.visit(visitor, pipeline, visited)
  File "<https://builds.apache.org/job/beam_PostCommit_Python35/ws/src/sdks/python/apache_beam/pipeline.py",>
line 824, in visit
    part.visit(visitor, pipeline, visited)
  File "<https://builds.apache.org/job/beam_PostCommit_Python35/ws/src/sdks/python/apache_beam/pipeline.py",>
line 822, in visit
    visitor.enter_composite_transform(self)
  File "<https://builds.apache.org/job/beam_PostCommit_Python35/ws/src/sdks/python/apache_beam/pipeline.py",>
line 295, in enter_composite_transform
    self._replace_if_needed(transform_node)
  File "<https://builds.apache.org/job/beam_PostCommit_Python35/ws/src/sdks/python/apache_beam/pipeline.py",>
line 264, in _replace_if_needed
    new_output = replacement_transform.expand(input_node)
  File "<https://builds.apache.org/job/beam_PostCommit_Python35/ws/src/sdks/python/apache_beam/runners/direct/helper_transforms.py",>
line 51, in expand
    | beam.ParDo(FinishCombine(self._combine_fn)))
  File "<https://builds.apache.org/job/beam_PostCommit_Python35/ws/src/sdks/python/apache_beam/pvalue.py",>
line 111, in __or__
    return self.pipeline.apply(ptransform, self)
  File "<https://builds.apache.org/job/beam_PostCommit_Python35/ws/src/sdks/python/apache_beam/pipeline.py",>
line 514, in apply
    transform.type_check_inputs(pvalueish)
  File "<https://builds.apache.org/job/beam_PostCommit_Python35/ws/src/sdks/python/apache_beam/transforms/ptransform.py",>
line 758, in type_check_inputs
    type_hints = self.get_type_hints().input_types
  File "<https://builds.apache.org/job/beam_PostCommit_Python35/ws/src/sdks/python/apache_beam/typehints/decorators.py",>
line 213, in get_type_hints
    .with_defaults(self.default_type_hints())
  File "<https://builds.apache.org/job/beam_PostCommit_Python35/ws/src/sdks/python/apache_beam/transforms/core.py",>
line 1068, in default_type_hints
    return self.fn.get_type_hints()
  File "<https://builds.apache.org/job/beam_PostCommit_Python35/ws/src/sdks/python/apache_beam/typehints/decorators.py",>
line 213, in get_type_hints
    .with_defaults(self.default_type_hints())
  File "<https://builds.apache.org/job/beam_PostCommit_Python35/ws/src/sdks/python/apache_beam/runners/direct/helper_transforms.py",>
line 81, in default_type_hints
    args = (typing.Tuple[K, args[0]],) + args[1:]
  File "/usr/lib/python3.5/typing.py", line 710, in __getitem__
    parameters = tuple(_type_check(p, msg) for p in parameters)
  File "/usr/lib/python3.5/typing.py", line 710, in <genexpr>
    parameters = tuple(_type_check(p, msg) for p in parameters)
  File "/usr/lib/python3.5/typing.py", line 312, in _type_check
    raise TypeError(msg + " Got %.100r." % (arg,))
TypeError: Tuple[t0, t1, ...]: each t must be a type. Got Any.

----------------------------------------------------------------------
XML: nosetests-postCommitIT-direct-py35.xml
----------------------------------------------------------------------
XML: <https://builds.apache.org/job/beam_PostCommit_Python35/ws/src/sdks/python/nosetests.xml>
----------------------------------------------------------------------
Ran 15 tests in 23.965s

FAILED (SKIP=1, errors=1)

> Task :sdks:python:test-suites:direct:py35:postCommitIT FAILED

> Task :sdks:python:test-suites:dataflow:py35:postCommitIT
>>> RUNNING integration tests with pipeline options: --runner=TestDataflowRunner
--project=apache-beam-testing --staging_location=gs://temp-storage-for-end-to-end-tests/staging-it
--temp_location=gs://temp-storage-for-end-to-end-tests/temp-it --output=gs://temp-storage-for-end-to-end-tests/py-it-cloud/output
--sdk_location=<https://builds.apache.org/job/beam_PostCommit_Python35/ws/src/sdks/python/test-suites/dataflow/py35/build/apache-beam.tar.gz>
--requirements_file=postcommit_requirements.txt --num_workers=1 --sleep_secs=20 --dataflow_worker_jar=<https://builds.apache.org/job/beam_PostCommit_Python35/ws/src/runners/google-cloud-dataflow-java/worker/build/libs/beam-runners-google-cloud-dataflow-java-fn-api-worker-2.15.0-SNAPSHOT.jar>
--kms_key_name=projects/apache-beam-testing/locations/global/keyRings/beam-it/cryptoKeys/test
--dataflow_kms_key=projects/apache-beam-testing/locations/global/keyRings/beam-it/cryptoKeys/test
>>>   test options: --nocapture --processes=8 --process-timeout=4500 --attr=IT
running nosetests
running egg_info
writing apache_beam.egg-info/PKG-INFO
writing requirements to apache_beam.egg-info/requires.txt
writing dependency_links to apache_beam.egg-info/dependency_links.txt
writing top-level names to apache_beam.egg-info/top_level.txt
writing entry points to apache_beam.egg-info/entry_points.txt
reading manifest file 'apache_beam.egg-info/SOURCES.txt'
reading manifest template 'MANIFEST.in'
setup.py:178: UserWarning: Some syntactic constructs of Python 3 are not yet fully supported
by Apache Beam.
  'Some syntactic constructs of Python 3 are not yet fully supported by '
<https://builds.apache.org/job/beam_PostCommit_Python35/ws/src/build/gradleenv/-1734967054/lib/python3.5/site-packages/setuptools/dist.py>:472:
UserWarning: Normalizing '2.15.0.dev' to '2.15.0.dev0'
  normalized_version,
warning: no files found matching 'README.md'
warning: no files found matching 'NOTICE'
warning: no files found matching 'LICENSE'
writing manifest file 'apache_beam.egg-info/SOURCES.txt'
<https://builds.apache.org/job/beam_PostCommit_Python35/ws/src/sdks/python/apache_beam/__init__.py>:84:
UserWarning: Some syntactic constructs of Python 3 are not yet fully supported by Apache Beam.
  'Some syntactic constructs of Python 3 are not yet fully supported by '
<https://builds.apache.org/job/beam_PostCommit_Python35/ws/src/sdks/python/apache_beam/io/gcp/datastore/v1/datastoreio.py>:59:
UserWarning: Datastore IO will support Python 3 after replacing googledatastore by google-cloud-datastore,
see: BEAM-4543.
  warnings.warn('Datastore IO will support Python 3 after replacing '
<https://builds.apache.org/job/beam_PostCommit_Python35/ws/src/sdks/python/apache_beam/io/vcfio.py>:47:
UserWarning: VCF IO will support Python 3 after migration to Nucleus, see: BEAM-5628.
  warnings.warn("VCF IO will support Python 3 after migration to Nucleus, "
Found: https://console.cloud.google.com/dataflow/jobsDetail/locations/us-central1/jobs/2019-07-22_04_06_43-4781799480118029371?project=apache-beam-testing.
<https://builds.apache.org/job/beam_PostCommit_Python35/ws/src/sdks/python/apache_beam/io/gcp/bigquery.py>:1140:
BeamDeprecationWarning: options is deprecated since First stable release. References to <pipeline>.options
will not be supported
Found: https://console.cloud.google.com/dataflow/jobsDetail/locations/us-central1/jobs/2019-07-22_04_22_00-3902845667267718810?project=apache-beam-testing.
  method_to_use = self._compute_method(p, p.options)
Found: https://console.cloud.google.com/dataflow/jobsDetail/locations/us-central1/jobs/2019-07-22_04_31_32-14408350250314502409?project=apache-beam-testing.
Found: https://console.cloud.google.com/dataflow/jobsDetail/locations/us-central1/jobs/2019-07-22_04_39_48-10367584710728842890?project=apache-beam-testing.
<https://builds.apache.org/job/beam_PostCommit_Python35/ws/src/sdks/python/apache_beam/runners/dataflow/dataflow_runner.py>:686:
BeamDeprecationWarning: BigQuerySink is deprecated since 2.11.0. Use WriteToBigQuery instead.
Found: https://console.cloud.google.com/dataflow/jobsDetail/locations/us-central1/jobs/2019-07-22_04_06_41-4498420315614009746?project=apache-beam-testing.
  kms_key=transform.kms_key))
Found: https://console.cloud.google.com/dataflow/jobsDetail/locations/us-central1/jobs/2019-07-22_04_27_48-581443013440032764?project=apache-beam-testing.
Found: https://console.cloud.google.com/dataflow/jobsDetail/locations/us-central1/jobs/2019-07-22_04_36_21-17467720814713218053?project=apache-beam-testing.
Found: https://console.cloud.google.com/dataflow/jobsDetail/locations/us-central1/jobs/2019-07-22_04_46_20-3325907735492992375?project=apache-beam-testing.
Found: https://console.cloud.google.com/dataflow/jobsDetail/locations/us-central1/jobs/2019-07-22_04_06_43-6498804809188587162?project=apache-beam-testing.
<https://builds.apache.org/job/beam_PostCommit_Python35/ws/src/sdks/python/apache_beam/io/gcp/bigquery.py>:1140:
BeamDeprecationWarning: options is deprecated since First stable release. References to <pipeline>.options
will not be supported
  method_to_use = self._compute_method(p, p.options)
<https://builds.apache.org/job/beam_PostCommit_Python35/ws/src/sdks/python/apache_beam/io/fileio_test.py>:232:
FutureWarning: MatchAll is experimental.
  | 'GetPath' >> beam.Map(lambda metadata: metadata.path))
Found: https://console.cloud.google.com/dataflow/jobsDetail/locations/us-central1/jobs/2019-07-22_04_20_08-17358539319279041733?project=apache-beam-testing.
<https://builds.apache.org/job/beam_PostCommit_Python35/ws/src/sdks/python/apache_beam/io/fileio_test.py>:243:
FutureWarning: MatchAll is experimental.
Found: https://console.cloud.google.com/dataflow/jobsDetail/locations/us-central1/jobs/2019-07-22_04_29_15-5075331766528895632?project=apache-beam-testing.
  | 'Checksums' >> beam.Map(compute_hash))
<https://builds.apache.org/job/beam_PostCommit_Python35/ws/src/sdks/python/apache_beam/io/fileio_test.py>:243:
FutureWarning: ReadMatches is experimental.
Found: https://console.cloud.google.com/dataflow/jobsDetail/locations/us-central1/jobs/2019-07-22_04_38_22-4875999942073256967?project=apache-beam-testing.
  | 'Checksums' >> beam.Map(compute_hash))
Found: https://console.cloud.google.com/dataflow/jobsDetail/locations/us-central1/jobs/2019-07-22_04_46_54-13617511212032290567?project=apache-beam-testing.
Found: https://console.cloud.google.com/dataflow/jobsDetail/locations/us-central1/jobs/2019-07-22_04_06_41-15448071552313665420?project=apache-beam-testing.
Found: https://console.cloud.google.com/dataflow/jobsDetail/locations/us-central1/jobs/2019-07-22_04_28_41-1893516443664783881?project=apache-beam-testing.
Found: https://console.cloud.google.com/dataflow/jobsDetail/locations/us-central1/jobs/2019-07-22_04_37_00-15818545568736776324?project=apache-beam-testing.
Found: https://console.cloud.google.com/dataflow/jobsDetail/locations/us-central1/jobs/2019-07-22_04_06_41-17173809236785401402?project=apache-beam-testing.
<https://builds.apache.org/job/beam_PostCommit_Python35/ws/src/sdks/python/apache_beam/runners/dataflow/dataflow_runner.py>:686:
BeamDeprecationWarning: BigQuerySink is deprecated since 2.11.0. Use WriteToBigQuery instead.
Found: https://console.cloud.google.com/dataflow/jobsDetail/locations/us-central1/jobs/2019-07-22_04_16_07-16264683257034578860?project=apache-beam-testing.
  kms_key=transform.kms_key))
Found: https://console.cloud.google.com/dataflow/jobsDetail/locations/us-central1/jobs/2019-07-22_04_24_50-2597609301950642737?project=apache-beam-testing.
<https://builds.apache.org/job/beam_PostCommit_Python35/ws/src/sdks/python/apache_beam/io/gcp/big_query_query_to_table_pipeline.py>:73:
BeamDeprecationWarning: BigQuerySink is deprecated since 2.11.0. Use WriteToBigQuery instead.
Found: https://console.cloud.google.com/dataflow/jobsDetail/locations/us-central1/jobs/2019-07-22_04_33_02-5334527616593354583?project=apache-beam-testing.
  kms_key=kms_key))
Found: https://console.cloud.google.com/dataflow/jobsDetail/locations/us-central1/jobs/2019-07-22_04_41_24-5610816837130252526?project=apache-beam-testing.
Found: https://console.cloud.google.com/dataflow/jobsDetail/locations/us-central1/jobs/2019-07-22_04_06_40-5512473003921227906?project=apache-beam-testing.
<https://builds.apache.org/job/beam_PostCommit_Python35/ws/src/sdks/python/apache_beam/runners/dataflow/dataflow_runner.py>:686:
BeamDeprecationWarning: BigQuerySink is deprecated since 2.11.0. Use WriteToBigQuery instead.
Found: https://console.cloud.google.com/dataflow/jobsDetail/locations/us-central1/jobs/2019-07-22_04_15_09-3532110325237726030?project=apache-beam-testing.
  kms_key=transform.kms_key))
Found: https://console.cloud.google.com/dataflow/jobsDetail/locations/us-central1/jobs/2019-07-22_04_24_27-14143123318058027095?project=apache-beam-testing.
<https://builds.apache.org/job/beam_PostCommit_Python35/ws/src/sdks/python/apache_beam/io/gcp/bigquery_test.py>:565:
BeamDeprecationWarning: options is deprecated since First stable release. References to <pipeline>.options
will not be supported
  streaming = self.test_pipeline.options.view_as(StandardOptions).streaming
<https://builds.apache.org/job/beam_PostCommit_Python35/ws/src/sdks/python/apache_beam/io/gcp/bigquery.py>:1140:
BeamDeprecationWarning: options is deprecated since First stable release. References to <pipeline>.options
will not be supported
  method_to_use = self._compute_method(p, p.options)
<https://builds.apache.org/job/beam_PostCommit_Python35/ws/src/sdks/python/apache_beam/io/gcp/bigquery_file_loads.py>:557:
BeamDeprecationWarning: options is deprecated since First stable release. References to <pipeline>.options
will not be supported
Found: https://console.cloud.google.com/dataflow/jobsDetail/locations/us-central1/jobs/2019-07-22_04_33_32-6405936954411498327?project=apache-beam-testing.
  temp_location = p.options.view_as(GoogleCloudOptions).temp_location
Found: https://console.cloud.google.com/dataflow/jobsDetail/locations/us-central1/jobs/2019-07-22_04_06_43-6021433396874770110?project=apache-beam-testing.
Found: https://console.cloud.google.com/dataflow/jobsDetail/locations/us-central1/jobs/2019-07-22_04_16_05-6797321607004957?project=apache-beam-testing.
Found: https://console.cloud.google.com/dataflow/jobsDetail/locations/us-central1/jobs/2019-07-22_04_24_31-9553249777390308233?project=apache-beam-testing.
Found: https://console.cloud.google.com/dataflow/jobsDetail/locations/us-central1/jobs/2019-07-22_04_34_29-5772917735915345337?project=apache-beam-testing.
Found: https://console.cloud.google.com/dataflow/jobsDetail/locations/us-central1/jobs/2019-07-22_04_43_29-13459829944299101417?project=apache-beam-testing.
Found: https://console.cloud.google.com/dataflow/jobsDetail/locations/us-central1/jobs/2019-07-22_04_52_10-9552460137297615369?project=apache-beam-testing.
Found: https://console.cloud.google.com/dataflow/jobsDetail/locations/us-central1/jobs/2019-07-22_04_06_41-6879524233163595004?project=apache-beam-testing.
Found: https://console.cloud.google.com/dataflow/jobsDetail/locations/us-central1/jobs/2019-07-22_04_16_11-6915289505870046595?project=apache-beam-testing.
Found: https://console.cloud.google.com/dataflow/jobsDetail/locations/us-central1/jobs/2019-07-22_04_26_42-3778200560773913192?project=apache-beam-testing.
Found: https://console.cloud.google.com/dataflow/jobsDetail/locations/us-central1/jobs/2019-07-22_04_35_24-144727419869262476?project=apache-beam-testing.
<https://builds.apache.org/job/beam_PostCommit_Python35/ws/src/sdks/python/apache_beam/io/gcp/bigquery.py>:1140:
BeamDeprecationWarning: options is deprecated since First stable release. References to <pipeline>.options
will not be supported
  method_to_use = self._compute_method(p, p.options)
<https://builds.apache.org/job/beam_PostCommit_Python35/ws/src/sdks/python/apache_beam/io/gcp/bigquery_file_loads.py>:557:
BeamDeprecationWarning: options is deprecated since First stable release. References to <pipeline>.options
will not be supported
  temp_location = p.options.view_as(GoogleCloudOptions).temp_location
test_datastore_wordcount_it (apache_beam.examples.cookbook.datastore_wordcount_it_test.DatastoreWordCountIT)
... SKIP: This test still needs to be fixed on Python 3TODO: BEAM-4543
test_avro_it (apache_beam.examples.fastavro_it_test.FastavroIT) ... SKIP: Due to a known issue
in avro-python3 package, thistest is skipped until BEAM-6522 is addressed. 
test_bigquery_tornadoes_it (apache_beam.examples.cookbook.bigquery_tornadoes_it_test.BigqueryTornadoesIT)
... ok
test_streaming_wordcount_it (apache_beam.examples.streaming_wordcount_it_test.StreamingWordCountIT)
... ok
test_autocomplete_it (apache_beam.examples.complete.autocomplete_test.AutocompleteTest) ...
ok
test_wordcount_fnapi_it (apache_beam.examples.wordcount_it_test.WordCountIT) ... ok
test_leader_board_it (apache_beam.examples.complete.game.leader_board_it_test.LeaderBoardIT)
... ok
test_game_stats_it (apache_beam.examples.complete.game.game_stats_it_test.GameStatsIT) ...
ok
test_wordcount_it (apache_beam.examples.wordcount_it_test.WordCountIT) ... ok
test_hourly_team_score_it (apache_beam.examples.complete.game.hourly_team_score_it_test.HourlyTeamScoreIT)
... ok
test_user_score_it (apache_beam.examples.complete.game.user_score_it_test.UserScoreIT) ...
ok
test_datastore_write_limit (apache_beam.io.gcp.datastore_write_it_test.DatastoreWriteIT) ...
SKIP: This test still needs to be fixed on Python 3TODO: BEAM-4543
test_copy (apache_beam.io.gcp.gcsio_integration_test.GcsIOIntegrationTest) ... ok
test_copy_batch (apache_beam.io.gcp.gcsio_integration_test.GcsIOIntegrationTest) ... ok
test_copy_batch_kms (apache_beam.io.gcp.gcsio_integration_test.GcsIOIntegrationTest) ... ok
test_copy_batch_rewrite_token (apache_beam.io.gcp.gcsio_integration_test.GcsIOIntegrationTest)
... ok
test_copy_kms (apache_beam.io.gcp.gcsio_integration_test.GcsIOIntegrationTest) ... ok
test_copy_rewrite_token (apache_beam.io.gcp.gcsio_integration_test.GcsIOIntegrationTest) ...
ok
test_bigquery_read_1M_python (apache_beam.io.gcp.bigquery_io_read_it_test.BigqueryIOReadIT)
... ok
test_multiple_destinations_transform (apache_beam.io.gcp.bigquery_file_loads_test.BigQueryFileLoadsIT)
... ok
test_one_job_fails_all_jobs_fail (apache_beam.io.gcp.bigquery_file_loads_test.BigQueryFileLoadsIT)
... ok
test_transform_on_gcs (apache_beam.io.fileio_test.MatchIntegrationTest) ... ok
test_big_query_read (apache_beam.io.gcp.bigquery_read_it_test.BigQueryReadIntegrationTests)
... ok
test_big_query_read_new_types (apache_beam.io.gcp.bigquery_read_it_test.BigQueryReadIntegrationTests)
... ok
test_multiple_destinations_transform (apache_beam.io.gcp.bigquery_test.BigQueryStreamingInsertTransformIntegrationTests)
... ok
test_value_provider_transform (apache_beam.io.gcp.bigquery_test.BigQueryStreamingInsertTransformIntegrationTests)
... ok
test_parquetio_it (apache_beam.io.parquetio_it_test.TestParquetIT) ... ok
test_streaming_data_only (apache_beam.io.gcp.pubsub_integration_test.PubSubIntegrationTest)
... ok
test_streaming_with_attributes (apache_beam.io.gcp.pubsub_integration_test.PubSubIntegrationTest)
... ok
test_job_python_from_python_it (apache_beam.transforms.external_test_it.ExternalTransformIT)
... ok
test_big_query_legacy_sql (apache_beam.io.gcp.big_query_query_to_table_it_test.BigQueryQueryToTableIT)
... ok
test_big_query_new_types (apache_beam.io.gcp.big_query_query_to_table_it_test.BigQueryQueryToTableIT)
... ok
test_big_query_standard_sql (apache_beam.io.gcp.big_query_query_to_table_it_test.BigQueryQueryToTableIT)
... ok
test_big_query_standard_sql_kms_key_native (apache_beam.io.gcp.big_query_query_to_table_it_test.BigQueryQueryToTableIT)
... ok
test_big_query_write (apache_beam.io.gcp.bigquery_write_it_test.BigQueryWriteIntegrationTests)
... ok
test_big_query_write_new_types (apache_beam.io.gcp.bigquery_write_it_test.BigQueryWriteIntegrationTests)
... ok
test_big_query_write_schema_autodetect (apache_beam.io.gcp.bigquery_write_it_test.BigQueryWriteIntegrationTests)
... SKIP: DataflowRunner does not support schema autodetection
test_big_query_write_without_schema (apache_beam.io.gcp.bigquery_write_it_test.BigQueryWriteIntegrationTests)
... ok
test_metrics_fnapi_it (apache_beam.runners.dataflow.dataflow_exercise_metrics_pipeline_test.ExerciseMetricsPipelineTest)
... ok
test_metrics_it (apache_beam.runners.dataflow.dataflow_exercise_metrics_pipeline_test.ExerciseMetricsPipelineTest)
... ok
test_datastore_write_limit (apache_beam.io.gcp.datastore.v1new.datastore_write_it_test.DatastoreWriteIT)
... ok

----------------------------------------------------------------------
XML: nosetests-postCommitIT-df-py35.xml
----------------------------------------------------------------------
XML: <https://builds.apache.org/job/beam_PostCommit_Python35/ws/src/sdks/python/nosetests.xml>
----------------------------------------------------------------------
Ran 41 tests in 3227.742s

OK (SKIP=4)

FAILURE: Build failed with an exception.

* Where:
Build file '<https://builds.apache.org/job/beam_PostCommit_Python35/ws/src/sdks/python/test-suites/direct/py35/build.gradle'>
line: 49

* What went wrong:
Execution failed for task ':sdks:python:test-suites:direct:py35:postCommitIT'.
> Process 'command 'sh'' finished with non-zero exit value 1

* Try:
Run with --stacktrace option to get the stack trace. Run with --info or --debug option to
get more log output. Run with --scan to get full insights.

* Get more help at https://help.gradle.org

Deprecated Gradle features were used in this build, making it incompatible with Gradle 6.0.
Use '--warning-mode all' to show the individual deprecation warnings.
See https://docs.gradle.org/5.2.1/userguide/command_line_interface.html#sec:command_line_warnings

BUILD FAILED in 54m 43s
63 actionable tasks: 46 executed, 17 from cache

Publishing build scan...
https://gradle.com/s/kxup7wfglhgnc

Build step 'Invoke Gradle script' changed build result to FAILURE
Build step 'Invoke Gradle script' marked build as failure

---------------------------------------------------------------------
To unsubscribe, e-mail: builds-unsubscribe@beam.apache.org
For additional commands, e-mail: builds-help@beam.apache.org


Mime
View raw message