beam-builds mailing list archives

Site index · List index
Message view « Date » · « Thread »
Top « Date » · « Thread »
From Apache Jenkins Server <jenk...@builds.apache.org>
Subject Build failed in Jenkins: beam_PostCommit_Py_VR_Dataflow #3939
Date Wed, 03 Jul 2019 00:37:11 GMT
See <https://builds.apache.org/job/beam_PostCommit_Py_VR_Dataflow/3939/display/redirect>

------------------------------------------
[...truncated 1.56 MB...]
            "output_name": "out",
            "user_name": "Map(<lambda at sideinputs_test.py:238>)/MapToVoidKey0.out"
          }
        ],
        "parallel_input": {
          "@type": "OutputReference",
          "output_name": "out",
          "step_name": "s4"
        },
        "serialized_fn": "ref_AppliedPTransform_Map(<lambda at sideinputs_test.py:238>)/MapToVoidKey0_23",
        "user_name": "Map(<lambda at sideinputs_test.py:238>)/MapToVoidKey0"
      }
    },
    {
      "kind": "ParallelDo",
      "name": "s22",
      "properties": {
        "display_data": [
          {
            "key": "fn",
            "label": "Transform Function",
            "namespace": "apache_beam.transforms.core.CallableWrapperDoFn",
            "type": "STRING",
            "value": "<lambda>"
          },
          {
            "key": "fn",
            "label": "Transform Function",
            "namespace": "apache_beam.transforms.core.ParDo",
            "shortValue": "CallableWrapperDoFn",
            "type": "STRING",
            "value": "apache_beam.transforms.core.CallableWrapperDoFn"
          }
        ],
        "non_parallel_inputs": {},
        "output_info": [
          {
            "encoding": {
              "@type": "kind:windowed_value",
              "component_encodings": [
                {
                  "@type": "kind:pair",
                  "component_encodings": [
                    {
                      "@type": "kind:bytes"
                    },
                    {
                      "@type": "FastPrimitivesCoder$eNprYE5OLEhMzkiNT0pNzNVLzk9JLSqGUlxuicUlAUWZuZklmWWpxc4gQa5CBs3GQsbaQqYIfgYGhvi0xJycpMTk7HiwlkJ8pgVkJmfnpEJNYQGawlpbyJZUnKQHACYlLgM=",
                      "component_encodings": [
                        {
                          "@type": "FastPrimitivesCoder$eNprYE5OLEhMzkiNT0pNzNVLzk9JLSqGUlxuicUlAUWZuZklmWWpxc4gQa5CBs3GQsbaQqYIfgYGhvi0xJycpMTk7HiwlkJ8pgVkJmfnpEJNYQGawlpbyJZUnKQHACYlLgM=",
                          "component_encodings": [],
                          "pipeline_proto_coder_id": "ref_Coder_FastPrimitivesCoder_3"
                        },
                        {
                          "@type": "FastPrimitivesCoder$eNprYE5OLEhMzkiNT0pNzNVLzk9JLSqGUlxuicUlAUWZuZklmWWpxc4gQa5CBs3GQsbaQqYIfgYGhvi0xJycpMTk7HiwlkJ8pgVkJmfnpEJNYQGawlpbyJZUnKQHACYlLgM=",
                          "component_encodings": [],
                          "pipeline_proto_coder_id": "ref_Coder_FastPrimitivesCoder_3"
                        }
                      ],
                      "is_pair_like": true,
                      "pipeline_proto_coder_id": "ref_Coder_FastPrimitivesCoder_3"
                    }
                  ],
                  "is_pair_like": true
                },
                {
                  "@type": "kind:global_window"
                }
              ],
              "is_wrapper": true
            },
            "output_name": "out",
            "user_name": "Map(<lambda at sideinputs_test.py:238>)/MapToVoidKey1.out"
          }
        ],
        "parallel_input": {
          "@type": "OutputReference",
          "output_name": "out",
          "step_name": "s4"
        },
        "serialized_fn": "ref_AppliedPTransform_Map(<lambda at sideinputs_test.py:238>)/MapToVoidKey1_24",
        "user_name": "Map(<lambda at sideinputs_test.py:238>)/MapToVoidKey1"
      }
    }
  ],
  "type": "JOB_TYPE_STREAMING"
}
root: INFO: Create job: <Job
 createTime: '2019-07-03T00:19:41.788158Z'
 currentStateTime: '1970-01-01T00:00:00Z'
 id: '2019-07-02_17_19_40-14453028367702758409'
 location: 'us-central1'
 name: 'beamapp-jenkins-0703001916-343150'
 projectId: 'apache-beam-testing'
 stageStates: []
 startTime: '2019-07-03T00:19:41.788158Z'
 steps: []
 tempFiles: []
 type: TypeValueValuesEnum(JOB_TYPE_STREAMING, 2)>
root: INFO: Created job with id: [2019-07-02_17_19_40-14453028367702758409]
root: INFO: To access the Dataflow monitoring console, please navigate to https://console.cloud.google.com/dataflow/jobsDetail/locations/us-central1/jobs/2019-07-02_17_19_40-14453028367702758409?project=apache-beam-testing
root: WARNING: Waiting indefinitely for streaming job.
--------------------- >> end captured logging << ---------------------
Found: https://console.cloud.google.com/dataflow/jobsDetail/locations/us-central1/jobs/2019-07-02_17_19_04-14368125775734229369?project=apache-beam-testing.
Found: https://console.cloud.google.com/dataflow/jobsDetail/locations/us-central1/jobs/2019-07-02_17_27_45-10677121491717442919?project=apache-beam-testing.
Found: https://console.cloud.google.com/dataflow/jobsDetail/locations/us-central1/jobs/2019-07-02_17_19_04-746191011909999421?project=apache-beam-testing.
Found: https://console.cloud.google.com/dataflow/jobsDetail/locations/us-central1/jobs/2019-07-02_17_27_36-17222771784351234379?project=apache-beam-testing.
Found: https://console.cloud.google.com/dataflow/jobsDetail/locations/us-central1/jobs/2019-07-02_17_19_06-17522124876163600777?project=apache-beam-testing.
Found: https://console.cloud.google.com/dataflow/jobsDetail/locations/us-central1/jobs/2019-07-02_17_27_37-4790446888421406665?project=apache-beam-testing.
Found: https://console.cloud.google.com/dataflow/jobsDetail/locations/us-central1/jobs/2019-07-02_17_19_05-267857313690946165?project=apache-beam-testing.
Found: https://console.cloud.google.com/dataflow/jobsDetail/locations/us-central1/jobs/2019-07-02_17_19_05-3924116591253409678?project=apache-beam-testing.
Found: https://console.cloud.google.com/dataflow/jobsDetail/locations/us-central1/jobs/2019-07-02_17_27_46-13908279872510624348?project=apache-beam-testing.
Found: https://console.cloud.google.com/dataflow/jobsDetail/locations/us-central1/jobs/2019-07-02_17_19_06-5095235675592754109?project=apache-beam-testing.
Found: https://console.cloud.google.com/dataflow/jobsDetail/locations/us-central1/jobs/2019-07-02_17_19_04-715286061672689197?project=apache-beam-testing.
Found: https://console.cloud.google.com/dataflow/jobsDetail/locations/us-central1/jobs/2019-07-02_17_19_40-8945994744662221143?project=apache-beam-testing.
Found: https://console.cloud.google.com/dataflow/jobsDetail/locations/us-central1/jobs/2019-07-02_17_19_04-17464416796186117367?project=apache-beam-testing.
Found: https://console.cloud.google.com/dataflow/jobsDetail/locations/us-central1/jobs/2019-07-02_17_19_40-14453028367702758409?project=apache-beam-testing.
Found: https://console.cloud.google.com/dataflow/jobsDetail/locations/us-central1/jobs/2019-07-02_17_20_16-8780006683363227129?project=apache-beam-testing.

----------------------------------------------------------------------
XML: <https://builds.apache.org/job/beam_PostCommit_Py_VR_Dataflow/ws/src/sdks/python/nosetests.xml>
----------------------------------------------------------------------
Ran 15 tests in 1110.580s

FAILED (failures=3)

> Task :sdks:python:test-suites:dataflow:py35:validatesRunnerStreamingTests FAILED

FAILURE: Build completed with 8 failures.

1: Task failed with an exception.
-----------
* Where:
Build file '<https://builds.apache.org/job/beam_PostCommit_Py_VR_Dataflow/ws/src/sdks/python/test-suites/dataflow/py37/build.gradle'>
line: 97

* What went wrong:
Execution failed for task ':sdks:python:test-suites:dataflow:py37:validatesRunnerBatchTests'.
> Process 'command 'sh'' finished with non-zero exit value 1

* Try:
Run with --stacktrace option to get the stack trace. Run with --info or --debug option to
get more log output. Run with --scan to get full insights.
==============================================================================

2: Task failed with an exception.
-----------
* Where:
Build file '<https://builds.apache.org/job/beam_PostCommit_Py_VR_Dataflow/ws/src/sdks/python/build.gradle'>
line: 197

* What went wrong:
Execution failed for task ':sdks:python:validatesRunnerBatchTests'.
> Process 'command 'sh'' finished with non-zero exit value 1

* Try:
Run with --stacktrace option to get the stack trace. Run with --info or --debug option to
get more log output. Run with --scan to get full insights.
==============================================================================

3: Task failed with an exception.
-----------
* Where:
Build file '<https://builds.apache.org/job/beam_PostCommit_Py_VR_Dataflow/ws/src/sdks/python/test-suites/dataflow/py36/build.gradle'>
line: 67

* What went wrong:
Execution failed for task ':sdks:python:test-suites:dataflow:py36:validatesRunnerBatchTests'.
> Process 'command 'sh'' finished with non-zero exit value 1

* Try:
Run with --stacktrace option to get the stack trace. Run with --info or --debug option to
get more log output. Run with --scan to get full insights.
==============================================================================

4: Task failed with an exception.
-----------
* Where:
Build file '<https://builds.apache.org/job/beam_PostCommit_Py_VR_Dataflow/ws/src/sdks/python/test-suites/dataflow/py35/build.gradle'>
line: 67

* What went wrong:
Execution failed for task ':sdks:python:test-suites:dataflow:py35:validatesRunnerBatchTests'.
> Process 'command 'sh'' finished with non-zero exit value 1

* Try:
Run with --stacktrace option to get the stack trace. Run with --info or --debug option to
get more log output. Run with --scan to get full insights.
==============================================================================

5: Task failed with an exception.
-----------
* Where:
Build file '<https://builds.apache.org/job/beam_PostCommit_Py_VR_Dataflow/ws/src/sdks/python/build.gradle'>
line: 216

* What went wrong:
Execution failed for task ':sdks:python:validatesRunnerStreamingTests'.
> Process 'command 'sh'' finished with non-zero exit value 1

* Try:
Run with --stacktrace option to get the stack trace. Run with --info or --debug option to
get more log output. Run with --scan to get full insights.
==============================================================================

6: Task failed with an exception.
-----------
* Where:
Build file '<https://builds.apache.org/job/beam_PostCommit_Py_VR_Dataflow/ws/src/sdks/python/test-suites/dataflow/py37/build.gradle'>
line: 117

* What went wrong:
Execution failed for task ':sdks:python:test-suites:dataflow:py37:validatesRunnerStreamingTests'.
> Process 'command 'sh'' finished with non-zero exit value 1

* Try:
Run with --stacktrace option to get the stack trace. Run with --info or --debug option to
get more log output. Run with --scan to get full insights.
==============================================================================

7: Task failed with an exception.
-----------
* Where:
Build file '<https://builds.apache.org/job/beam_PostCommit_Py_VR_Dataflow/ws/src/sdks/python/test-suites/dataflow/py36/build.gradle'>
line: 87

* What went wrong:
Execution failed for task ':sdks:python:test-suites:dataflow:py36:validatesRunnerStreamingTests'.
> Process 'command 'sh'' finished with non-zero exit value 1

* Try:
Run with --stacktrace option to get the stack trace. Run with --info or --debug option to
get more log output. Run with --scan to get full insights.
==============================================================================

8: Task failed with an exception.
-----------
* Where:
Build file '<https://builds.apache.org/job/beam_PostCommit_Py_VR_Dataflow/ws/src/sdks/python/test-suites/dataflow/py35/build.gradle'>
line: 87

* What went wrong:
Execution failed for task ':sdks:python:test-suites:dataflow:py35:validatesRunnerStreamingTests'.
> Process 'command 'sh'' finished with non-zero exit value 1

* Try:
Run with --stacktrace option to get the stack trace. Run with --info or --debug option to
get more log output. Run with --scan to get full insights.
==============================================================================

* Get more help at https://help.gradle.org

Deprecated Gradle features were used in this build, making it incompatible with Gradle 6.0.
Use '--warning-mode all' to show the individual deprecation warnings.
See https://docs.gradle.org/5.2.1/userguide/command_line_interface.html#sec:command_line_warnings

BUILD FAILED in 36m 56s
76 actionable tasks: 59 executed, 17 from cache

Publishing build scan...
https://gradle.com/s/emv5okikjt6ak

Build step 'Invoke Gradle script' changed build result to FAILURE
Build step 'Invoke Gradle script' marked build as failure

---------------------------------------------------------------------
To unsubscribe, e-mail: builds-unsubscribe@beam.apache.org
For additional commands, e-mail: builds-help@beam.apache.org


Mime
View raw message