beam-builds mailing list archives

Site index · List index
Message view « Date » · « Thread »
Top « Date » · « Thread »
From Apache Jenkins Server <jenk...@builds.apache.org>
Subject Build failed in Jenkins: beam_PerformanceTests_WordCountIT_Py37 #249
Date Mon, 22 Jul 2019 19:32:58 GMT
See <https://builds.apache.org/job/beam_PerformanceTests_WordCountIT_Py37/249/display/redirect?page=changes>

Changes:

[ehudm] [BEAM-7679] Add randomness to ITs' BQ dataset name

[valentyn] Default to PiplelineState.UNKNOWN when job state returned from v1beta3

[valentyn] fixup: Address review feedback.

[alireza4263] [BEAM-7783] Adding BeamTableStatistics.

------------------------------------------
[...truncated 43.62 KB...]
> Task :sdks:python:test-suites:dataflow:py37:installGcpTest
Caching disabled for task ':sdks:python:test-suites:dataflow:py37:installGcpTest': Caching
has not been enabled for the task
Task ':sdks:python:test-suites:dataflow:py37:installGcpTest' is not up-to-date because:
  Task has not declared any outputs despite executing actions.
Custom actions are attached to task ':sdks:python:test-suites:dataflow:py37:installGcpTest'.
Starting process 'command 'sh''. Working directory: <https://builds.apache.org/job/beam_PerformanceTests_WordCountIT_Py37/ws/src/sdks/python/test-suites/dataflow/py37>
Command: sh -c . <https://builds.apache.org/job/beam_PerformanceTests_WordCountIT_Py37/ws/src/build/gradleenv/-1734967052/bin/activate>
&& pip install --retries 10 -e <https://builds.apache.org/job/beam_PerformanceTests_WordCountIT_Py37/ws/src/sdks/python/[gcp,test]>
Successfully started process 'command 'sh''
Obtaining file://<https://builds.apache.org/job/beam_PerformanceTests_WordCountIT_Py37/ws/src/sdks/python>
Collecting crcmod<2.0,>=1.7 (from apache-beam==2.15.0.dev0)
Collecting dill<0.2.10,>=0.2.9 (from apache-beam==2.15.0.dev0)
Collecting fastavro<0.22,>=0.21.4 (from apache-beam==2.15.0.dev0)
  Using cached https://files.pythonhosted.org/packages/af/fa/1c7b265aa44cf6089ce56a2702377a4994632016688b2b9ccde38a884024/fastavro-0.21.24-cp37-cp37m-manylinux1_x86_64.whl
Requirement already satisfied: future<1.0.0,>=0.16.0 in <https://builds.apache.org/job/beam_PerformanceTests_WordCountIT_Py37/ws/src/build/gradleenv/-1734967052/lib/python3.7/site-packages>
(from apache-beam==2.15.0.dev0) (0.16.0)
Requirement already satisfied: grpcio<2,>=1.8 in <https://builds.apache.org/job/beam_PerformanceTests_WordCountIT_Py37/ws/src/build/gradleenv/-1734967052/lib/python3.7/site-packages>
(from apache-beam==2.15.0.dev0) (1.22.0)
Collecting hdfs<3.0.0,>=2.1.0 (from apache-beam==2.15.0.dev0)
Collecting httplib2<=0.12.0,>=0.8 (from apache-beam==2.15.0.dev0)
Collecting mock<3.0.0,>=1.0.1 (from apache-beam==2.15.0.dev0)
  Using cached https://files.pythonhosted.org/packages/e6/35/f187bdf23be87092bd0f1200d43d23076cee4d0dec109f195173fd3ebc79/mock-2.0.0-py2.py3-none-any.whl
Collecting pymongo<4.0.0,>=3.8.0 (from apache-beam==2.15.0.dev0)
  Using cached https://files.pythonhosted.org/packages/ee/f9/c748aa7807dafcc5eade282db46e16242b15dfe951da10ff434fd22ca282/pymongo-3.8.0-cp37-cp37m-manylinux1_x86_64.whl
Collecting oauth2client<4,>=2.0.1 (from apache-beam==2.15.0.dev0)
Requirement already satisfied: protobuf<4,>=3.5.0.post1 in <https://builds.apache.org/job/beam_PerformanceTests_WordCountIT_Py37/ws/src/build/gradleenv/-1734967052/lib/python3.7/site-packages>
(from apache-beam==2.15.0.dev0) (3.9.0)
Collecting pydot<2,>=1.2.0 (from apache-beam==2.15.0.dev0)
  Using cached https://files.pythonhosted.org/packages/33/d1/b1479a770f66d962f545c2101630ce1d5592d90cb4f083d38862e93d16d2/pydot-1.4.1-py2.py3-none-any.whl
Collecting pytz>=2018.3 (from apache-beam==2.15.0.dev0)
  Using cached https://files.pythonhosted.org/packages/3d/73/fe30c2daaaa0713420d0382b16fbb761409f532c56bdcc514bf7b6262bb6/pytz-2019.1-py2.py3-none-any.whl
Collecting pyyaml<4.0.0,>=3.12 (from apache-beam==2.15.0.dev0)
Collecting avro-python3<2.0.0,>=1.8.1 (from apache-beam==2.15.0.dev0)
Collecting pyarrow<0.15.0,>=0.11.1 (from apache-beam==2.15.0.dev0)
  Using cached https://files.pythonhosted.org/packages/53/fd/6017bc298a224dc8fd0e7ab71288a5495ce951e6347c6fcccd5c9c922c46/pyarrow-0.14.0-cp37-cp37m-manylinux1_x86_64.whl
Collecting cachetools<4,>=3.1.0 (from apache-beam==2.15.0.dev0)
  Using cached https://files.pythonhosted.org/packages/2f/a6/30b0a0bef12283e83e58c1d6e7b5aabc7acfc4110df81a4471655d33e704/cachetools-3.1.1-py2.py3-none-any.whl
Collecting google-apitools<0.5.29,>=0.5.28 (from apache-beam==2.15.0.dev0)
Collecting google-cloud-datastore<1.8.0,>=1.7.1 (from apache-beam==2.15.0.dev0)
  Using cached https://files.pythonhosted.org/packages/d0/aa/29cbcf8cf7d08ce2d55b9dce858f7c632b434cb6451bed17cb4275804217/google_cloud_datastore-1.7.4-py2.py3-none-any.whl
Collecting google-cloud-pubsub<0.40.0,>=0.39.0 (from apache-beam==2.15.0.dev0)
  Using cached https://files.pythonhosted.org/packages/c0/9a/4455b1c1450e9b912855b58ca6eee7a27ff1e9b52e4d98c243d93256f469/google_cloud_pubsub-0.39.1-py2.py3-none-any.whl
Collecting google-cloud-bigquery<1.7.0,>=1.6.0 (from apache-beam==2.15.0.dev0)
  Using cached https://files.pythonhosted.org/packages/b7/1b/2b95f2fefddbbece38110712c225bfb5649206f4056445653bd5ca4dc86d/google_cloud_bigquery-1.6.1-py2.py3-none-any.whl
Collecting google-cloud-core<0.30.0,>=0.28.1 (from apache-beam==2.15.0.dev0)
  Using cached https://files.pythonhosted.org/packages/0c/f2/3c225e7a69cb27d283b68bff867722bd066bc1858611180197f711815ea5/google_cloud_core-0.29.1-py2.py3-none-any.whl
Collecting google-cloud-bigtable<0.33.0,>=0.31.1 (from apache-beam==2.15.0.dev0)
  Using cached https://files.pythonhosted.org/packages/08/77/b468e209dbb0a6f614e6781f06a4894299a4c6167c2c525cc086caa7c075/google_cloud_bigtable-0.32.2-py2.py3-none-any.whl
Collecting nose>=1.3.7 (from apache-beam==2.15.0.dev0)
  Using cached https://files.pythonhosted.org/packages/15/d8/dd071918c040f50fa1cf80da16423af51ff8ce4a0f2399b7bf8de45ac3d9/nose-1.3.7-py3-none-any.whl
Collecting nose_xunitmp>=0.4.1 (from apache-beam==2.15.0.dev0)
Collecting numpy<2,>=1.14.3 (from apache-beam==2.15.0.dev0)
  Using cached https://files.pythonhosted.org/packages/fc/d1/45be1144b03b6b1e24f9a924f23f66b4ad030d834ad31fb9e5581bd328af/numpy-1.16.4-cp37-cp37m-manylinux1_x86_64.whl
Collecting pandas<0.24,>=0.23.4 (from apache-beam==2.15.0.dev0)
  Using cached https://files.pythonhosted.org/packages/67/a7/12261a51ac2e7be4c698ca27cbe364ca5f16d64999456ee47ea8c7b44417/pandas-0.23.4-cp37-cp37m-manylinux1_x86_64.whl
Collecting parameterized<0.7.0,>=0.6.0 (from apache-beam==2.15.0.dev0)
  Using cached https://files.pythonhosted.org/packages/3a/49/75f6dadb09e2f8ace3cdffe0c99a04f1b98dff41fbf9e768665d8b469e29/parameterized-0.6.3-py2.py3-none-any.whl
Collecting pyhamcrest<2.0,>=1.9 (from apache-beam==2.15.0.dev0)
  Using cached https://files.pythonhosted.org/packages/9a/d5/d37fd731b7d0e91afcc84577edeccf4638b4f9b82f5ffe2f8b62e2ddc609/PyHamcrest-1.9.0-py2.py3-none-any.whl
Collecting tenacity<6.0,>=5.0.2 (from apache-beam==2.15.0.dev0)
  Using cached https://files.pythonhosted.org/packages/6a/93/dfcf5b1b46ab29196274b78dcba69fab5e54b6dc303a7eed90a79194d277/tenacity-5.0.4-py2.py3-none-any.whl
Requirement already satisfied: six>=1.5.2 in <https://builds.apache.org/job/beam_PerformanceTests_WordCountIT_Py37/ws/src/build/gradleenv/-1734967052/lib/python3.7/site-packages>
(from grpcio<2,>=1.8->apache-beam==2.15.0.dev0) (1.12.0)
Collecting docopt (from hdfs<3.0.0,>=2.1.0->apache-beam==2.15.0.dev0)
Collecting requests>=2.7.0 (from hdfs<3.0.0,>=2.1.0->apache-beam==2.15.0.dev0)
  Using cached https://files.pythonhosted.org/packages/51/bd/23c926cd341ea6b7dd0b2a00aba99ae0f828be89d72b2190f27c11d4b7fb/requests-2.22.0-py2.py3-none-any.whl
Collecting pbr>=0.11 (from mock<3.0.0,>=1.0.1->apache-beam==2.15.0.dev0)
  Using cached https://files.pythonhosted.org/packages/8b/67/bb6fe2e2c66585acb4dd2b57f50c8db65848f737f63b04cb35f0627bce5e/pbr-5.4.1-py2.py3-none-any.whl
Collecting pyasn1>=0.1.7 (from oauth2client<4,>=2.0.1->apache-beam==2.15.0.dev0)
  Using cached https://files.pythonhosted.org/packages/7b/7c/c9386b82a25115cccf1903441bba3cbadcfae7b678a20167347fa8ded34c/pyasn1-0.4.5-py2.py3-none-any.whl
Collecting rsa>=3.1.4 (from oauth2client<4,>=2.0.1->apache-beam==2.15.0.dev0)
  Using cached https://files.pythonhosted.org/packages/02/e5/38518af393f7c214357079ce67a317307936896e961e35450b70fad2a9cf/rsa-4.0-py2.py3-none-any.whl
Collecting pyasn1-modules>=0.0.5 (from oauth2client<4,>=2.0.1->apache-beam==2.15.0.dev0)
  Using cached https://files.pythonhosted.org/packages/91/f0/b03e00ce9fddf4827c42df1c3ce10c74eadebfb706231e8d6d1c356a4062/pyasn1_modules-0.2.5-py2.py3-none-any.whl
Requirement already satisfied: setuptools in <https://builds.apache.org/job/beam_PerformanceTests_WordCountIT_Py37/ws/src/build/gradleenv/-1734967052/lib/python3.7/site-packages>
(from protobuf<4,>=3.5.0.post1->apache-beam==2.15.0.dev0) (41.0.1)
Collecting pyparsing>=2.1.4 (from pydot<2,>=1.2.0->apache-beam==2.15.0.dev0)
  Using cached https://files.pythonhosted.org/packages/9f/dc/b205465a60baca8e04a1555a84d9c79f910661765056f071fb6fc2db4841/pyparsing-2.4.1-py2.py3-none-any.whl
Collecting fasteners>=0.14 (from google-apitools<0.5.29,>=0.5.28->apache-beam==2.15.0.dev0)
  Using cached https://files.pythonhosted.org/packages/18/bd/55eb2d6397b9c0e263af9d091ebdb756b15756029b3cededf6461481bc63/fasteners-0.15-py2.py3-none-any.whl
Collecting google-api-core[grpc]<2.0.0dev,>=1.6.0 (from google-cloud-datastore<1.8.0,>=1.7.1->apache-beam==2.15.0.dev0)
  Using cached https://files.pythonhosted.org/packages/5b/3e/48b8ee54f24fd8d5d274bcf642857399f074310032a244353419fc5774b7/google_api_core-1.14.0-py2.py3-none-any.whl
Collecting grpc-google-iam-v1<0.12dev,>=0.11.4 (from google-cloud-pubsub<0.40.0,>=0.39.0->apache-beam==2.15.0.dev0)
Collecting google-resumable-media>=0.2.1 (from google-cloud-bigquery<1.7.0,>=1.6.0->apache-beam==2.15.0.dev0)
  Using cached https://files.pythonhosted.org/packages/e2/5d/4bc5c28c252a62efe69ed1a1561da92bd5af8eca0cdcdf8e60354fae9b29/google_resumable_media-0.3.2-py2.py3-none-any.whl
Collecting python-dateutil>=2.5.0 (from pandas<0.24,>=0.23.4->apache-beam==2.15.0.dev0)
  Using cached https://files.pythonhosted.org/packages/41/17/c62faccbfbd163c7f57f3844689e3a78bae1f403648a6afb1d0866d87fbb/python_dateutil-2.8.0-py2.py3-none-any.whl
Collecting urllib3!=1.25.0,!=1.25.1,<1.26,>=1.21.1 (from requests>=2.7.0->hdfs<3.0.0,>=2.1.0->apache-beam==2.15.0.dev0)
  Using cached https://files.pythonhosted.org/packages/e6/60/247f23a7121ae632d62811ba7f273d0e58972d75e58a94d329d51550a47d/urllib3-1.25.3-py2.py3-none-any.whl
Collecting chardet<3.1.0,>=3.0.2 (from requests>=2.7.0->hdfs<3.0.0,>=2.1.0->apache-beam==2.15.0.dev0)
  Using cached https://files.pythonhosted.org/packages/bc/a9/01ffebfb562e4274b6487b4bb1ddec7ca55ec7510b22e4c51f14098443b8/chardet-3.0.4-py2.py3-none-any.whl
Collecting idna<2.9,>=2.5 (from requests>=2.7.0->hdfs<3.0.0,>=2.1.0->apache-beam==2.15.0.dev0)
  Using cached https://files.pythonhosted.org/packages/14/2c/cd551d81dbe15200be1cf41cd03869a46fe7226e7450af7a6545bfc474c9/idna-2.8-py2.py3-none-any.whl
Collecting certifi>=2017.4.17 (from requests>=2.7.0->hdfs<3.0.0,>=2.1.0->apache-beam==2.15.0.dev0)
  Using cached https://files.pythonhosted.org/packages/69/1b/b853c7a9d4f6a6d00749e94eb6f3a041e342a885b87340b79c1ef73e3a78/certifi-2019.6.16-py2.py3-none-any.whl
Collecting monotonic>=0.1 (from fasteners>=0.14->google-apitools<0.5.29,>=0.5.28->apache-beam==2.15.0.dev0)
  Using cached https://files.pythonhosted.org/packages/ac/aa/063eca6a416f397bd99552c534c6d11d57f58f2e94c14780f3bbf818c4cf/monotonic-1.5-py2.py3-none-any.whl
Collecting googleapis-common-protos<2.0dev,>=1.6.0 (from google-api-core[grpc]<2.0.0dev,>=1.6.0->google-cloud-datastore<1.8.0,>=1.7.1->apache-beam==2.15.0.dev0)
Collecting google-auth<2.0dev,>=0.4.0 (from google-api-core[grpc]<2.0.0dev,>=1.6.0->google-cloud-datastore<1.8.0,>=1.7.1->apache-beam==2.15.0.dev0)
  Using cached https://files.pythonhosted.org/packages/c5/9b/ed0516cc1f7609fb0217e3057ff4f0f9f3e3ce79a369c6af4a6c5ca25664/google_auth-1.6.3-py2.py3-none-any.whl
Installing collected packages: crcmod, dill, fastavro, docopt, urllib3, chardet, idna, certifi,
requests, hdfs, httplib2, pbr, mock, pymongo, pyasn1, rsa, pyasn1-modules, oauth2client, pyparsing,
pydot, pytz, pyyaml, avro-python3, numpy, pyarrow, cachetools, monotonic, fasteners, google-apitools,
googleapis-common-protos, google-auth, google-api-core, google-cloud-core, google-cloud-datastore,
grpc-google-iam-v1, google-cloud-pubsub, google-resumable-media, google-cloud-bigquery, google-cloud-bigtable,
nose, nose-xunitmp, python-dateutil, pandas, parameterized, pyhamcrest, tenacity, apache-beam
  Running setup.py develop for apache-beam
Successfully installed apache-beam avro-python3-1.9.0 cachetools-3.1.1 certifi-2019.6.16 chardet-3.0.4
crcmod-1.7 dill-0.2.9 docopt-0.6.2 fastavro-0.21.24 fasteners-0.15 google-api-core-1.14.0
google-apitools-0.5.28 google-auth-1.6.3 google-cloud-bigquery-1.6.1 google-cloud-bigtable-0.32.2
google-cloud-core-0.29.1 google-cloud-datastore-1.7.4 google-cloud-pubsub-0.39.1 google-resumable-media-0.3.2
googleapis-common-protos-1.6.0 grpc-google-iam-v1-0.11.4 hdfs-2.5.8 httplib2-0.12.0 idna-2.8
mock-2.0.0 monotonic-1.5 nose-1.3.7 nose-xunitmp-0.4.1 numpy-1.16.4 oauth2client-3.0.0 pandas-0.23.4
parameterized-0.6.3 pbr-5.4.1 pyarrow-0.14.0 pyasn1-0.4.5 pyasn1-modules-0.2.5 pydot-1.4.1
pyhamcrest-1.9.0 pymongo-3.8.0 pyparsing-2.4.1 python-dateutil-2.8.0 pytz-2019.1 pyyaml-3.13
requests-2.22.0 rsa-4.0 tenacity-5.0.4 urllib3-1.25.3
:sdks:python:test-suites:dataflow:py37:installGcpTest (Thread[Execution worker for ':',5,main])
completed. Took 20.787 secs.
:sdks:python:test-suites:dataflow:py37:integrationTest (Thread[Execution worker for ':',5,main])
started.

> Task :sdks:python:test-suites:dataflow:py37:integrationTest
Caching disabled for task ':sdks:python:test-suites:dataflow:py37:integrationTest': Caching
has not been enabled for the task
Task ':sdks:python:test-suites:dataflow:py37:integrationTest' is not up-to-date because:
  Task has not declared any outputs despite executing actions.
Custom actions are attached to task ':sdks:python:test-suites:dataflow:py37:integrationTest'.
Starting process 'command 'sh''. Working directory: <https://builds.apache.org/job/beam_PerformanceTests_WordCountIT_Py37/ws/src/sdks/python/test-suites/dataflow/py37>
Command: sh -c . <https://builds.apache.org/job/beam_PerformanceTests_WordCountIT_Py37/ws/src/build/gradleenv/-1734967052/bin/activate>
&& <https://builds.apache.org/job/beam_PerformanceTests_WordCountIT_Py37/ws/src/sdks/python/scripts/run_integration_test.sh>
--test_opts "--tests=apache_beam.examples.wordcount_it_test:WordCountIT.test_wordcount_it
--attr=IT --nocapture" --pipeline_opts "--project=apache-beam-testing --staging_location=gs://temp-storage-for-end-to-end-tests/staging-it
--temp_location=gs://temp-storage-for-end-to-end-tests/temp-it --input=gs://apache-beam-samples/input_small_files/ascii_sort_1MB_input.0000*
--output=gs://temp-storage-for-end-to-end-tests/py-it-cloud/output --expect_checksum=ea0ca2e5ee4ea5f218790f28d0b9fe7d09d8d710
--num_workers=10 --autoscaling_algorithm=NONE --runner=TestDataflowRunner --sdk_location=test-suites/dataflow/py37/build/apache-beam.tar.gz"
--suite integrationTest-perf
Successfully started process 'command 'sh''
>>> RUNNING integration tests with pipeline options: --project=apache-beam-testing
--staging_location=gs://temp-storage-for-end-to-end-tests/staging-it --temp_location=gs://temp-storage-for-end-to-end-tests/temp-it
--input=gs://apache-beam-samples/input_small_files/ascii_sort_1MB_input.0000* --output=gs://temp-storage-for-end-to-end-tests/py-it-cloud/output
--expect_checksum=ea0ca2e5ee4ea5f218790f28d0b9fe7d09d8d710 --num_workers=10 --autoscaling_algorithm=NONE
--runner=TestDataflowRunner --sdk_location=test-suites/dataflow/py37/build/apache-beam.tar.gz
>>>   test options: --tests=apache_beam.examples.wordcount_it_test:WordCountIT.test_wordcount_it
--attr=IT --nocapture
running nosetests
running egg_info
writing apache_beam.egg-info/PKG-INFO
writing dependency_links to apache_beam.egg-info/dependency_links.txt
writing entry points to apache_beam.egg-info/entry_points.txt
writing requirements to apache_beam.egg-info/requires.txt
writing top-level names to apache_beam.egg-info/top_level.txt
reading manifest file 'apache_beam.egg-info/SOURCES.txt'
reading manifest template 'MANIFEST.in'
writing manifest file 'apache_beam.egg-info/SOURCES.txt'


STDERR: beam_fn_api.proto: warning: Import google/protobuf/descriptor.proto but not used.
beam_fn_api.proto: warning: Import google/protobuf/wrappers.proto but not used.
RefactoringTool: Skipping optional fixer: idioms
RefactoringTool: Skipping optional fixer: ws_comma
RefactoringTool: No changes to <https://builds.apache.org/job/beam_PerformanceTests_WordCountIT_Py37/ws/src/sdks/python/test-suites/dataflow/py37/build/srcs/sdks/python/apache_beam/portability/api/beam_artifact_api_pb2.py>
RefactoringTool: Refactored <https://builds.apache.org/job/beam_PerformanceTests_WordCountIT_Py37/ws/src/sdks/python/test-suites/dataflow/py37/build/srcs/sdks/python/apache_beam/portability/api/beam_artifact_api_pb2_grpc.py>
RefactoringTool: Refactored <https://builds.apache.org/job/beam_PerformanceTests_WordCountIT_Py37/ws/src/sdks/python/test-suites/dataflow/py37/build/srcs/sdks/python/apache_beam/portability/api/beam_expansion_api_pb2.py>
RefactoringTool: Refactored <https://builds.apache.org/job/beam_PerformanceTests_WordCountIT_Py37/ws/src/sdks/python/test-suites/dataflow/py37/build/srcs/sdks/python/apache_beam/portability/api/beam_expansion_api_pb2_grpc.py>
RefactoringTool: Refactored <https://builds.apache.org/job/beam_PerformanceTests_WordCountIT_Py37/ws/src/sdks/python/test-suites/dataflow/py37/build/srcs/sdks/python/apache_beam/portability/api/beam_fn_api_pb2.py>
RefactoringTool: Refactored <https://builds.apache.org/job/beam_PerformanceTests_WordCountIT_Py37/ws/src/sdks/python/test-suites/dataflow/py37/build/srcs/sdks/python/apache_beam/portability/api/beam_fn_api_pb2_grpc.py>
RefactoringTool: Refactored <https://builds.apache.org/job/beam_PerformanceTests_WordCountIT_Py37/ws/src/sdks/python/test-suites/dataflow/py37/build/srcs/sdks/python/apache_beam/portability/api/beam_job_api_pb2.py>
RefactoringTool: Refactored <https://builds.apache.org/job/beam_PerformanceTests_WordCountIT_Py37/ws/src/sdks/python/test-suites/dataflow/py37/build/srcs/sdks/python/apache_beam/portability/api/beam_job_api_pb2_grpc.py>
RefactoringTool: No changes to <https://builds.apache.org/job/beam_PerformanceTests_WordCountIT_Py37/ws/src/sdks/python/test-suites/dataflow/py37/build/srcs/sdks/python/apache_beam/portability/api/beam_provision_api_pb2.py>
RefactoringTool: Refactored <https://builds.apache.org/job/beam_PerformanceTests_WordCountIT_Py37/ws/src/sdks/python/test-suites/dataflow/py37/build/srcs/sdks/python/apache_beam/portability/api/beam_provision_api_pb2_grpc.py>
RefactoringTool: Refactored <https://builds.apache.org/job/beam_PerformanceTests_WordCountIT_Py37/ws/src/sdks/python/test-suites/dataflow/py37/build/srcs/sdks/python/apache_beam/portability/api/beam_runner_api_pb2.py>
RefactoringTool: No changes to <https://builds.apache.org/job/beam_PerformanceTests_WordCountIT_Py37/ws/src/sdks/python/test-suites/dataflow/py37/build/srcs/sdks/python/apache_beam/portability/api/endpoints_pb2.py>
RefactoringTool: Refactored <https://builds.apache.org/job/beam_PerformanceTests_WordCountIT_Py37/ws/src/sdks/python/test-suites/dataflow/py37/build/srcs/sdks/python/apache_beam/portability/api/external_transforms_pb2.py>
RefactoringTool: Refactored <https://builds.apache.org/job/beam_PerformanceTests_WordCountIT_Py37/ws/src/sdks/python/test-suites/dataflow/py37/build/srcs/sdks/python/apache_beam/portability/api/metrics_pb2.py>
RefactoringTool: Refactored <https://builds.apache.org/job/beam_PerformanceTests_WordCountIT_Py37/ws/src/sdks/python/test-suites/dataflow/py37/build/srcs/sdks/python/apache_beam/portability/api/standard_window_fns_pb2.py>
RefactoringTool: Files that were modified:
RefactoringTool: <https://builds.apache.org/job/beam_PerformanceTests_WordCountIT_Py37/ws/src/sdks/python/test-suites/dataflow/py37/build/srcs/sdks/python/apache_beam/portability/api/beam_artifact_api_pb2.py>
RefactoringTool: <https://builds.apache.org/job/beam_PerformanceTests_WordCountIT_Py37/ws/src/sdks/python/test-suites/dataflow/py37/build/srcs/sdks/python/apache_beam/portability/api/beam_artifact_api_pb2_grpc.py>
RefactoringTool: <https://builds.apache.org/job/beam_PerformanceTests_WordCountIT_Py37/ws/src/sdks/python/test-suites/dataflow/py37/build/srcs/sdks/python/apache_beam/portability/api/beam_expansion_api_pb2.py>
RefactoringTool: <https://builds.apache.org/job/beam_PerformanceTests_WordCountIT_Py37/ws/src/sdks/python/test-suites/dataflow/py37/build/srcs/sdks/python/apache_beam/portability/api/beam_expansion_api_pb2_grpc.py>
RefactoringTool: <https://builds.apache.org/job/beam_PerformanceTests_WordCountIT_Py37/ws/src/sdks/python/test-suites/dataflow/py37/build/srcs/sdks/python/apache_beam/portability/api/beam_fn_api_pb2.py>
RefactoringTool: <https://builds.apache.org/job/beam_PerformanceTests_WordCountIT_Py37/ws/src/sdks/python/test-suites/dataflow/py37/build/srcs/sdks/python/apache_beam/portability/api/beam_fn_api_pb2_grpc.py>
RefactoringTool: <https://builds.apache.org/job/beam_PerformanceTests_WordCountIT_Py37/ws/src/sdks/python/test-suites/dataflow/py37/build/srcs/sdks/python/apache_beam/portability/api/beam_job_api_pb2.py>
RefactoringTool: <https://builds.apache.org/job/beam_PerformanceTests_WordCountIT_Py37/ws/src/sdks/python/test-suites/dataflow/py37/build/srcs/sdks/python/apache_beam/portability/api/beam_job_api_pb2_grpc.py>
RefactoringTool: <https://builds.apache.org/job/beam_PerformanceTests_WordCountIT_Py37/ws/src/sdks/python/test-suites/dataflow/py37/build/srcs/sdks/python/apache_beam/portability/api/beam_provision_api_pb2.py>
RefactoringTool: <https://builds.apache.org/job/beam_PerformanceTests_WordCountIT_Py37/ws/src/sdks/python/test-suites/dataflow/py37/build/srcs/sdks/python/apache_beam/portability/api/beam_provision_api_pb2_grpc.py>
RefactoringTool: <https://builds.apache.org/job/beam_PerformanceTests_WordCountIT_Py37/ws/src/sdks/python/test-suites/dataflow/py37/build/srcs/sdks/python/apache_beam/portability/api/beam_runner_api_pb2.py>
RefactoringTool: <https://builds.apache.org/job/beam_PerformanceTests_WordCountIT_Py37/ws/src/sdks/python/test-suites/dataflow/py37/build/srcs/sdks/python/apache_beam/portability/api/endpoints_pb2.py>
RefactoringTool: <https://builds.apache.org/job/beam_PerformanceTests_WordCountIT_Py37/ws/src/sdks/python/test-suites/dataflow/py37/build/srcs/sdks/python/apache_beam/portability/api/external_transforms_pb2.py>
RefactoringTool: <https://builds.apache.org/job/beam_PerformanceTests_WordCountIT_Py37/ws/src/sdks/python/test-suites/dataflow/py37/build/srcs/sdks/python/apache_beam/portability/api/metrics_pb2.py>
RefactoringTool: <https://builds.apache.org/job/beam_PerformanceTests_WordCountIT_Py37/ws/src/sdks/python/test-suites/dataflow/py37/build/srcs/sdks/python/apache_beam/portability/api/standard_window_fns_pb2.py>
setup.py:178: UserWarning: Some syntactic constructs of Python 3 are not yet fully supported
by Apache Beam.
  'Some syntactic constructs of Python 3 are not yet fully supported by '
<https://builds.apache.org/job/beam_PerformanceTests_WordCountIT_Py37/ws/src/build/gradleenv/-1734967052/lib/python3.7/site-packages/setuptools/dist.py>:472:
UserWarning: Normalizing '2.15.0.dev' to '2.15.0.dev0'
  normalized_version,
warning: no files found matching 'README.md'
warning: no files found matching 'NOTICE'
warning: no files found matching 'LICENSE'
warning: cmd: standard file not found: should have one of README, README.rst, README.txt,
README.md

setup.py:178: UserWarning: Some syntactic constructs of Python 3 are not yet fully supported
by Apache Beam.
  'Some syntactic constructs of Python 3 are not yet fully supported by '
<https://builds.apache.org/job/beam_PerformanceTests_WordCountIT_Py37/ws/src/build/gradleenv/-1734967052/lib/python3.7/site-packages/setuptools/dist.py>:472:
UserWarning: Normalizing '2.15.0.dev' to '2.15.0.dev0'
  normalized_version,
warning: no files found matching 'README.md'
warning: no files found matching 'NOTICE'
warning: no files found matching 'LICENSE'
<https://builds.apache.org/job/beam_PerformanceTests_WordCountIT_Py37/ws/src/sdks/python/apache_beam/__init__.py>:84:
UserWarning: Some syntactic constructs of Python 3 are not yet fully supported by Apache Beam.
  'Some syntactic constructs of Python 3 are not yet fully supported by '
test_wordcount_it (apache_beam.examples.wordcount_it_test.WordCountIT) ... Terminated
The message received from the daemon indicates that the daemon has disappeared.
Build request sent: Build{id=93ba4250-aad4-480b-b740-7a2198bd0107, currentDir=<https://builds.apache.org/job/beam_PerformanceTests_WordCountIT_Py37/ws/src}>
Attempting to read last messages from the daemon log...
Daemon pid: 17786
  log file: /home/jenkins/.gradle/daemon/5.2.1/daemon-17786.out.log
----- Last  20 lines from daemon log file - daemon-17786.out.log -----
running egg_info
writing apache_beam.egg-info/PKG-INFO
writing dependency_links to apache_beam.egg-info/dependency_links.txt
writing entry points to apache_beam.egg-info/entry_points.txt
writing requirements to apache_beam.egg-info/requires.txt
writing top-level names to apache_beam.egg-info/top_level.txt
reading manifest file 'apache_beam.egg-info/SOURCES.txt'
reading manifest template 'MANIFEST.in'
setup.py:178: UserWarning: Some syntactic constructs of Python 3 are not yet fully supported
by Apache Beam.
  'Some syntactic constructs of Python 3 are not yet fully supported by '
<https://builds.apache.org/job/beam_PerformanceTests_WordCountIT_Py37/ws/src/build/gradleenv/-1734967052/lib/python3.7/site-packages/setuptools/dist.py>:472:
UserWarning: Normalizing '2.15.0.dev' to '2.15.0.dev0'
  normalized_version,
warning: no files found matching 'README.md'
warning: no files found matching 'NOTICE'
warning: no files found matching 'LICENSE'
writing manifest file 'apache_beam.egg-info/SOURCES.txt'
<https://builds.apache.org/job/beam_PerformanceTests_WordCountIT_Py37/ws/src/sdks/python/apache_beam/__init__.py>:84:
UserWarning: Some syntactic constructs of Python 3 are not yet fully supported by Apache Beam.
  'Some syntactic constructs of Python 3 are not yet fully supported by '
test_wordcount_it (apache_beam.examples.wordcount_it_test.WordCountIT) ... Terminated
Daemon vm is shutting down... The daemon has exited normally or was terminated in response
to a user interrupt.
----- End of the daemon log -----


FAILURE: Build failed with an exception.

* What went wrong:
Gradle build daemon disappeared unexpectedly (it may have been killed or may have crashed)

* Try:
Run with --stacktrace option to get the stack trace. Run with --debug option to get more log
output. Run with --scan to get full insights.

* Get more help at https://help.gradle.org

2019-07-22 19:32:57,382 c0a2a2df MainThread beam_integration_benchmark(1/1) ERROR    Error
during benchmark beam_integration_benchmark
Traceback (most recent call last):
  File "<https://builds.apache.org/job/beam_PerformanceTests_WordCountIT_Py37/ws/PerfKitBenchmarker/perfkitbenchmarker/pkb.py",>
line 841, in RunBenchmark
    DoRunPhase(spec, collector, detailed_timer)
  File "<https://builds.apache.org/job/beam_PerformanceTests_WordCountIT_Py37/ws/PerfKitBenchmarker/perfkitbenchmarker/pkb.py",>
line 690, in DoRunPhase
    samples = spec.BenchmarkRun(spec)
  File "<https://builds.apache.org/job/beam_PerformanceTests_WordCountIT_Py37/ws/PerfKitBenchmarker/perfkitbenchmarker/linux_benchmarks/beam_integration_benchmark.py",>
line 160, in Run
    job_type=job_type)
  File "<https://builds.apache.org/job/beam_PerformanceTests_WordCountIT_Py37/ws/PerfKitBenchmarker/perfkitbenchmarker/providers/gcp/gcp_dpb_dataflow.py",>
line 90, in SubmitJob
    assert retcode == 0, "Integration Test Failed."
AssertionError: Integration Test Failed.
2019-07-22 19:32:57,383 c0a2a2df MainThread beam_integration_benchmark(1/1) INFO     Cleaning
up benchmark beam_integration_benchmark
2019-07-22 19:32:57,385 c0a2a2df MainThread beam_integration_benchmark(1/1) ERROR    Exception
running benchmark
Traceback (most recent call last):
  File "<https://builds.apache.org/job/beam_PerformanceTests_WordCountIT_Py37/ws/PerfKitBenchmarker/perfkitbenchmarker/pkb.py",>
line 984, in RunBenchmarkTask
    RunBenchmark(spec, collector)
  File "<https://builds.apache.org/job/beam_PerformanceTests_WordCountIT_Py37/ws/PerfKitBenchmarker/perfkitbenchmarker/pkb.py",>
line 841, in RunBenchmark
    DoRunPhase(spec, collector, detailed_timer)
  File "<https://builds.apache.org/job/beam_PerformanceTests_WordCountIT_Py37/ws/PerfKitBenchmarker/perfkitbenchmarker/pkb.py",>
line 690, in DoRunPhase
    samples = spec.BenchmarkRun(spec)
  File "<https://builds.apache.org/job/beam_PerformanceTests_WordCountIT_Py37/ws/PerfKitBenchmarker/perfkitbenchmarker/linux_benchmarks/beam_integration_benchmark.py",>
line 160, in Run
    job_type=job_type)
  File "<https://builds.apache.org/job/beam_PerformanceTests_WordCountIT_Py37/ws/PerfKitBenchmarker/perfkitbenchmarker/providers/gcp/gcp_dpb_dataflow.py",>
line 90, in SubmitJob
    assert retcode == 0, "Integration Test Failed."
AssertionError: Integration Test Failed.
2019-07-22 19:32:57,386 c0a2a2df MainThread beam_integration_benchmark(1/1) ERROR    Benchmark
1/1 beam_integration_benchmark (UID: beam_integration_benchmark0) failed. Execution will continue.
2019-07-22 19:32:57,386 c0a2a2df MainThread beam_integration_benchmark(1/1) INFO     Benchmark
run statuses:
---------------------------------------------------------------------------------
Name                        UID                          Status  Failed Substatus
---------------------------------------------------------------------------------
beam_integration_benchmark  beam_integration_benchmark0  FAILED                  
---------------------------------------------------------------------------------
Success rate: 0.00% (0/1)
2019-07-22 19:32:57,386 c0a2a2df MainThread beam_integration_benchmark(1/1) INFO     Complete
logs can be found at: <https://builds.apache.org/job/beam_PerformanceTests_WordCountIT_Py37/ws/runs/c0a2a2df/pkb.log>
2019-07-22 19:32:57,386 c0a2a2df MainThread beam_integration_benchmark(1/1) INFO     Completion
statuses can be found at: <https://builds.apache.org/job/beam_PerformanceTests_WordCountIT_Py37/ws/runs/c0a2a2df/completion_statuses.json>
Build step 'Execute shell' marked build as failure

---------------------------------------------------------------------
To unsubscribe, e-mail: builds-unsubscribe@beam.apache.org
For additional commands, e-mail: builds-help@beam.apache.org


Mime
View raw message