beam-builds mailing list archives

Site index · List index
Message view « Date » · « Thread »
Top « Date » · « Thread »
From Apache Jenkins Server <jenk...@builds.apache.org>
Subject Build failed in Jenkins: beam_PostCommit_Java_ValidatesRunner_PortabilityApi_Dataflow #1658
Date Tue, 09 Jul 2019 00:16:30 GMT
See <https://builds.apache.org/job/beam_PostCommit_Java_ValidatesRunner_PortabilityApi_Dataflow/1658/display/redirect?page=changes>

Changes:

[lcwik] [BEAM-5605] Update Beam Java SDK backlog to track latest changes in Beam

------------------------------------------
[...truncated 53.77 KB...]
12cb127eee44: Waiting
fbb641a8b943: Waiting
f350d0146bb3: Waiting
af5ae4841776: Waiting
e38df31d449c: Waiting
a3112a1fd9f7: Waiting
fd5ca30d50f4: Layer already exists
d69b7475c0e9: Layer already exists
f350d0146bb3: Layer already exists
f7d12d471667: Layer already exists
af5ae4841776: Layer already exists
e38df31d449c: Layer already exists
12cb127eee44: Layer already exists
b17cc31e431b: Layer already exists
604829a174eb: Layer already exists
fbb641a8b943: Layer already exists
6e41f3d0b592: Layer already exists
0cc3ed2e458c: Layer already exists
7d53dbdeb706: Layer already exists
a3112a1fd9f7: Layer already exists
20190610221846: digest: sha256:ad3718eb058f5be4fe295884a56bfaf031730cb928dac7c6526be63a5f46d68a
size: 3262
b9feb2610646: Preparing
aa9b4603fe79: Preparing
211686a16759: Preparing
f6a585633f92: Preparing
559ba80d9f0c: Preparing
3eb476227b73: Preparing
f7d12d471667: Preparing
f350d0146bb3: Preparing
e38df31d449c: Preparing
af5ae4841776: Preparing
b17cc31e431b: Preparing
12cb127eee44: Preparing
604829a174eb: Preparing
fbb641a8b943: Preparing
f350d0146bb3: Waiting
e38df31d449c: Waiting
af5ae4841776: Waiting
604829a174eb: Waiting
fbb641a8b943: Waiting
b17cc31e431b: Waiting
12cb127eee44: Waiting
3eb476227b73: Waiting
f7d12d471667: Waiting
b9feb2610646: Layer already exists
f6a585633f92: Layer already exists
f350d0146bb3: Layer already exists
f7d12d471667: Layer already exists
e38df31d449c: Layer already exists
af5ae4841776: Layer already exists
b17cc31e431b: Layer already exists
12cb127eee44: Layer already exists
604829a174eb: Layer already exists
fbb641a8b943: Layer already exists
211686a16759: Layer already exists
aa9b4603fe79: Layer already exists
559ba80d9f0c: Layer already exists
3eb476227b73: Layer already exists
20190615060024: digest: sha256:925656e674eae20e743378a2ae2660fc1531d30b597e9c5af9696ded7f2f6a0f
size: 3262
9edd8f6cb16a: Preparing
f4f4bfff0c03: Preparing
20f809ab1ef3: Preparing
8c992cc400ea: Preparing
e1016a11481b: Preparing
ee82cc5a3d24: Preparing
f7d12d471667: Preparing
f350d0146bb3: Preparing
e38df31d449c: Preparing
af5ae4841776: Preparing
b17cc31e431b: Preparing
12cb127eee44: Preparing
604829a174eb: Preparing
fbb641a8b943: Preparing
e38df31d449c: Waiting
af5ae4841776: Waiting
604829a174eb: Waiting
b17cc31e431b: Waiting
12cb127eee44: Waiting
fbb641a8b943: Waiting
ee82cc5a3d24: Waiting
f7d12d471667: Waiting
f350d0146bb3: Waiting
9edd8f6cb16a: Layer already exists
f4f4bfff0c03: Layer already exists
f7d12d471667: Layer already exists
12cb127eee44: Layer already exists
b17cc31e431b: Layer already exists
604829a174eb: Layer already exists
fbb641a8b943: Layer already exists
f350d0146bb3: Layer already exists
af5ae4841776: Layer already exists
e38df31d449c: Layer already exists
20f809ab1ef3: Layer already exists
8c992cc400ea: Layer already exists
e1016a11481b: Layer already exists
ee82cc5a3d24: Layer already exists
20190623000021: digest: sha256:3a063671186383a6b438cc3ef14ef8b63d96f164d08a936c4e40aa4a3c3a382d
size: 3262
2d2b3dff1322: Preparing
81d160bd35a0: Preparing
9533ec74f759: Preparing
b680ed802694: Preparing
5caee7d90642: Preparing
fed6c9b05964: Preparing
f7d12d471667: Preparing
f350d0146bb3: Preparing
e38df31d449c: Preparing
af5ae4841776: Preparing
b17cc31e431b: Preparing
12cb127eee44: Preparing
604829a174eb: Preparing
fbb641a8b943: Preparing
f350d0146bb3: Waiting
e38df31d449c: Waiting
af5ae4841776: Waiting
b17cc31e431b: Waiting
fbb641a8b943: Waiting
12cb127eee44: Waiting
fed6c9b05964: Waiting
f7d12d471667: Waiting
604829a174eb: Waiting
9533ec74f759: Layer already exists
f7d12d471667: Layer already exists
b680ed802694: Layer already exists
f350d0146bb3: Layer already exists
e38df31d449c: Layer already exists
af5ae4841776: Layer already exists
b17cc31e431b: Layer already exists
604829a174eb: Layer already exists
12cb127eee44: Layer already exists
fbb641a8b943: Layer already exists
5caee7d90642: Layer already exists
81d160bd35a0: Layer already exists
2d2b3dff1322: Layer already exists
fed6c9b05964: Layer already exists
20190701000024: digest: sha256:2150ab65fdaab71f014a1194514352ac94d2688bd6ac9683eca81e04edc974b9
size: 3262
cdfa1231c1c3: Preparing
2e07e6480416: Preparing
be9c8ccf4816: Preparing
bee47554da7b: Preparing
72e32bd7ff72: Preparing
f2abcc72497c: Preparing
f7d12d471667: Preparing
f350d0146bb3: Preparing
e38df31d449c: Preparing
af5ae4841776: Preparing
b17cc31e431b: Preparing
12cb127eee44: Preparing
604829a174eb: Preparing
fbb641a8b943: Preparing
e38df31d449c: Waiting
af5ae4841776: Waiting
604829a174eb: Waiting
b17cc31e431b: Waiting
fbb641a8b943: Waiting
12cb127eee44: Waiting
f7d12d471667: Waiting
f350d0146bb3: Waiting
be9c8ccf4816: Pushed
72e32bd7ff72: Pushed
f7d12d471667: Layer already exists
f350d0146bb3: Layer already exists
e38df31d449c: Layer already exists
af5ae4841776: Layer already exists
b17cc31e431b: Layer already exists
604829a174eb: Layer already exists
12cb127eee44: Layer already exists
fbb641a8b943: Layer already exists
2e07e6480416: Pushed
f2abcc72497c: Pushed
cdfa1231c1c3: Pushed
bee47554da7b: Pushed
20190708214758: digest: sha256:0de4a9213e00da291633cb7ffe88c6fcf0aa95c019ca51e6b0ecc7de76a37d10
size: 3262

> Task :runners:google-cloud-dataflow-java:validatesRunnerFnApiWorkerTest

org.apache.beam.sdk.transforms.ViewTest > testWindowedListSideInput FAILED
    java.lang.RuntimeException at ViewTest.java:290

org.apache.beam.sdk.transforms.ViewTest > testWindowedMapSideInput FAILED
    java.lang.RuntimeException at ViewTest.java:1056

org.apache.beam.sdk.transforms.ViewTest > testIterableSideInputIsImmutable FAILED
    java.lang.RuntimeException at ViewTest.java:505

org.apache.beam.sdk.transforms.ViewTest > testListSideInputIsImmutable FAILED
    java.lang.RuntimeException at ViewTest.java:368

org.apache.beam.sdk.transforms.ViewTest > testEmptyListSideInput FAILED
    java.lang.RuntimeException at ViewTest.java:319

org.apache.beam.sdk.transforms.ViewTest > testWindowedSideInputFixedToFixed FAILED
    java.lang.RuntimeException at ViewTest.java:1375

org.apache.beam.sdk.transforms.ViewTest > testSingletonSideInput FAILED
    java.lang.RuntimeException at ViewTest.java:113

156 tests completed, 7 failed, 2 skipped

> Task :runners:google-cloud-dataflow-java:validatesRunnerFnApiWorkerTest FAILED

> Task :runners:google-cloud-dataflow-java:cleanUpDockerImages
Untagged: us.gcr.io/apache-beam-testing/java-postcommit-it/java:20190708214758
Untagged: us.gcr.io/apache-beam-testing/java-postcommit-it/java@sha256:0de4a9213e00da291633cb7ffe88c6fcf0aa95c019ca51e6b0ecc7de76a37d10
Deleted: sha256:63fe9da088711fda76a7315fa5182e66aadf646575042720321223313f506d3a
Deleted: sha256:734af061b2e4d14a7d6cabf42ce821d4d154f7502c052349c7e49ba2baf82eea
Deleted: sha256:56743b14be774de81bfe363c2080e837485f14f355f8a657682541cc064fd47f
Deleted: sha256:bf6ee3eaaa0356b4372e47fe093317eed0d7c2493716d2aa77f04306fc389921
Deleted: sha256:68995cf19786834a97d783f6351e135feedd4b56428d19ed13fac1bccd66f929
Deleted: sha256:c2e04aa8120a66106ac86b8378dc004e710eaed3c61c4f6c6629b4b3974db978
Deleted: sha256:3110a6a0816778713978e8fe16176085deea09ca38b7e19aa5ad343782f6879a
Deleted: sha256:2a84084f93b7dd70473f29fb6173371b2671a58aafe43d06926b2d31efa5618e
Deleted: sha256:729a53a5748c0c4ce5557fbdc2c370b784bc592d319f4a6cc34999c01a1a7bd0
Deleted: sha256:15d9faecd07a4ed1c1e0f3206594e4baf7f366697d5066b2fe3d9f87bb1aa278
Deleted: sha256:6663055e280b791549a915ce894d1d7b72ee4041e83960908b4a4c9a99edb766
Deleted: sha256:1ef035e948c0cba4f0dea52fa53d379c045dd2ccc39b7af7b4f91a183b7ac027
Deleted: sha256:38ee00e69bfa94e64c3742c42679c4597386b44127f6013a6bb2dd6aaad0b0a2
Deleted: sha256:59b5342320008e4f2a56a10b47265d5dce0465edcbd94516b0f6cb1e7a3cd571
Digests:
- us.gcr.io/apache-beam-testing/java-postcommit-it/java@sha256:0de4a9213e00da291633cb7ffe88c6fcf0aa95c019ca51e6b0ecc7de76a37d10
  Associated tags:
 - 20190708214758
Tags:
- us.gcr.io/apache-beam-testing/java-postcommit-it/java:20190708214758
Deleted [us.gcr.io/apache-beam-testing/java-postcommit-it/java:20190708214758].
Deleted [us.gcr.io/apache-beam-testing/java-postcommit-it/java@sha256:0de4a9213e00da291633cb7ffe88c6fcf0aa95c019ca51e6b0ecc7de76a37d10].

FAILURE: Build failed with an exception.

* What went wrong:
Execution failed for task ':runners:google-cloud-dataflow-java:validatesRunnerFnApiWorkerTest'.
> There were failing tests. See the report at: file://<https://builds.apache.org/job/beam_PostCommit_Java_ValidatesRunner_PortabilityApi_Dataflow/ws/src/runners/google-cloud-dataflow-java/build/reports/tests/validatesRunnerFnApiWorkerTest/index.html>

* Try:
Run with --stacktrace option to get the stack trace. Run with --info or --debug option to
get more log output. Run with --scan to get full insights.

* Get more help at https://help.gradle.org

Deprecated Gradle features were used in this build, making it incompatible with Gradle 6.0.
Use '--warning-mode all' to show the individual deprecation warnings.
See https://docs.gradle.org/5.2.1/userguide/command_line_interface.html#sec:command_line_warnings

BUILD FAILED in 2h 28m 43s
79 actionable tasks: 59 executed, 19 from cache, 1 up-to-date

Publishing build scan...
https://gradle.com/s/3bdbcimpmguca

Build step 'Invoke Gradle script' changed build result to FAILURE
Build step 'Invoke Gradle script' marked build as failure

---------------------------------------------------------------------
To unsubscribe, e-mail: builds-unsubscribe@beam.apache.org
For additional commands, e-mail: builds-help@beam.apache.org


Mime
View raw message