beam-builds mailing list archives

Site index · List index
Message view « Date » · « Thread »
Top « Date » · « Thread »
From Apache Jenkins Server <jenk...@builds.apache.org>
Subject Build failed in Jenkins: beam_PreCommit_JavaPortabilityApi_Cron #989
Date Mon, 08 Jul 2019 18:17:21 GMT
See <https://builds.apache.org/job/beam_PreCommit_JavaPortabilityApi_Cron/989/display/redirect>

------------------------------------------
[...truncated 35.54 KB...]
> Task :sdks:java:extensions:protobuf:generateProto NO-SOURCE
> Task :vendor:sdks-java-extensions-protobuf:compileJava FROM-CACHE
> Task :vendor:sdks-java-extensions-protobuf:classes UP-TO-DATE
> Task :runners:local-java:compileJava FROM-CACHE
> Task :runners:local-java:classes UP-TO-DATE
> Task :runners:local-java:jar
> Task :sdks:java:io:kafka:compileJava FROM-CACHE
> Task :sdks:java:io:kafka:classes UP-TO-DATE
> Task :sdks:java:extensions:google-cloud-platform-core:compileJava FROM-CACHE
> Task :sdks:java:extensions:google-cloud-platform-core:classes UP-TO-DATE
> Task :sdks:java:extensions:google-cloud-platform-core:jar
> Task :runners:core-construction-java:compileJava FROM-CACHE
> Task :sdks:java:io:kafka:jar
> Task :runners:core-construction-java:classes UP-TO-DATE
> Task :sdks:java:fn-execution:compileJava FROM-CACHE
> Task :sdks:java:fn-execution:classes UP-TO-DATE
> Task :sdks:java:fn-execution:jar
> Task :runners:core-construction-java:jar
> Task :runners:core-java:compileJava FROM-CACHE
> Task :runners:core-java:classes UP-TO-DATE
> Task :sdks:java:extensions:protobuf:compileJava FROM-CACHE
> Task :sdks:java:extensions:protobuf:classes UP-TO-DATE
> Task :sdks:java:extensions:protobuf:jar
> Task :runners:core-java:jar
> Task :sdks:java:harness:compileJava FROM-CACHE
> Task :sdks:java:harness:classes UP-TO-DATE
> Task :sdks:java:io:google-cloud-platform:compileJava FROM-CACHE
> Task :sdks:java:io:google-cloud-platform:classes UP-TO-DATE
> Task :sdks:java:core:compileTestJava FROM-CACHE
> Task :sdks:java:core:testClasses
> Task :sdks:java:harness:jar
> Task :sdks:java:io:google-cloud-platform:jar
> Task :examples:java:compileJava FROM-CACHE
> Task :examples:java:classes UP-TO-DATE
> Task :runners:google-cloud-dataflow-java:compileJava FROM-CACHE
> Task :runners:google-cloud-dataflow-java:classes
> Task :examples:java:jar
> Task :runners:google-cloud-dataflow-java:jar
> Task :examples:java:compileTestJava FROM-CACHE
> Task :examples:java:testClasses
> Task :examples:java:testJar

> Task :sdks:go:resolveBuildDependencies
Resolving golang.org/x/crypto: commit='d9133f5469342136e669e85192a26056b587f503', urls=[https://go.googlesource.com/crypto]
Resolving golang.org/x/debug: commit='95515998a8a4bd7448134b2cb5971dbeb12e0b77', urls=[https://go.googlesource.com/debug]

> Task :vendor:sdks-java-extensions-protobuf:shadowJar

> Task :sdks:go:resolveBuildDependencies
Resolving golang.org/x/net: commit='2fb46b16b8dda405028c50f7c7f0f9dd1fa6bfb1', urls=[https://go.googlesource.com/net]
Resolving golang.org/x/oauth2: commit='a032972e28060ca4f5644acffae3dfc268cc09db', urls=[https://go.googlesource.com/oauth2]
Resolving golang.org/x/sync: commit='fd80eb99c8f653c847d294a001bdf2a3a6f768f5', urls=[https://go.googlesource.com/sync]

> Task :sdks:java:core:shadowTestJar
> Task :sdks:java:extensions:google-cloud-platform-core:compileTestJava FROM-CACHE
> Task :sdks:java:extensions:google-cloud-platform-core:testClasses UP-TO-DATE
> Task :sdks:java:extensions:google-cloud-platform-core:testJar
> Task :runners:core-java:compileTestJava FROM-CACHE
> Task :runners:core-java:testClasses UP-TO-DATE
> Task :runners:core-java:testJar

> Task :sdks:go:resolveBuildDependencies
Resolving golang.org/x/sys: commit='37707fdb30a5b38865cfb95e5aab41707daec7fd', urls=[https://go.googlesource.com/sys]
Resolving cached github.com/coreos/etcd: commit='11214aa33bf5a47d3d9d8dafe0f6b97237dfe921',
urls=[https://github.com/coreos/etcd.git, git@github.com:coreos/etcd.git]
Resolving cached github.com/coreos/etcd: commit='11214aa33bf5a47d3d9d8dafe0f6b97237dfe921',
urls=[https://github.com/coreos/etcd.git, git@github.com:coreos/etcd.git]

> Task :sdks:java:harness:shadowJar
> Task :sdks:java:harness:compileTestJava FROM-CACHE
> Task :sdks:java:harness:testClasses UP-TO-DATE
> Task :sdks:java:container:copyDockerfileDependencies
> Task :runners:java-fn-execution:compileJava FROM-CACHE
> Task :runners:java-fn-execution:classes UP-TO-DATE
> Task :runners:java-fn-execution:jar
> Task :runners:direct-java:compileJava FROM-CACHE
> Task :runners:direct-java:classes UP-TO-DATE
> Task :runners:google-cloud-dataflow-java:worker:compileJava FROM-CACHE
> Task :runners:google-cloud-dataflow-java:worker:classes
> Task :runners:direct-java:shadowJar
> Task :sdks:java:harness:shadowTestJar
> Task :runners:google-cloud-dataflow-java:worker:shadowJar
> Task :runners:google-cloud-dataflow-java:worker:jar
> Task :runners:google-cloud-dataflow-java:worker:compileTestJava FROM-CACHE
> Task :runners:google-cloud-dataflow-java:worker:testClasses UP-TO-DATE
> Task :runners:google-cloud-dataflow-java:worker:packageTests
> Task :runners:google-cloud-dataflow-java:worker:assemble
> Task :runners:google-cloud-dataflow-java:worker:analyzeClassesDependencies SKIPPED
> Task :runners:google-cloud-dataflow-java:worker:analyzeTestClassesDependencies SKIPPED
> Task :runners:google-cloud-dataflow-java:worker:analyzeDependencies SKIPPED
> Task :runners:google-cloud-dataflow-java:worker:checkstyleMain SKIPPED
> Task :runners:google-cloud-dataflow-java:worker:checkstyleTest SKIPPED
> Task :runners:google-cloud-dataflow-java:worker:javadoc SKIPPED

> Task :runners:google-cloud-dataflow-java:worker:spotbugsMain
SLF4J: Class path contains multiple SLF4J bindings.
SLF4J: Found binding in [jar:file:/home/jenkins/.gradle/caches/modules-2/files-2.1/org.slf4j/slf4j-simple/1.7.25/8dacf9514f0c707cbbcdd6fd699e8940d42fb54e/slf4j-simple-1.7.25.jar!/org/slf4j/impl/StaticLoggerBinder.class]
SLF4J: Found binding in [jar:file:/home/jenkins/.gradle/wrapper/dists/gradle-5.2.1-all/bviwmvmbexq6idcscbicws5me/gradle-5.2.1/lib/gradle-logging-5.2.1.jar!/org/slf4j/impl/StaticLoggerBinder.class]
SLF4J: See http://www.slf4j.org/codes.html#multiple_bindings for an explanation.
SLF4J: Actual binding is of type [org.slf4j.impl.SimpleLoggerFactory]

> Task :runners:google-cloud-dataflow-java:worker:test

> Task :sdks:go:resolveBuildDependencies
Resolving google.golang.org/api: commit='386d4e5f4f92f86e6aec85985761bba4b938a2d5', urls=[https://code.googlesource.com/google-api-go-client]
Resolving google.golang.org/genproto: commit='2b5a72b8730b0b16380010cfe5286c42108d88e7', urls=[https://github.com/google/go-genproto]
Resolving google.golang.org/grpc: commit='7646b5360d049a7ca31e9133315db43456f39e2e', urls=[https://github.com/grpc/grpc-go]
Resolving cached github.com/coreos/etcd: commit='11214aa33bf5a47d3d9d8dafe0f6b97237dfe921',
urls=[https://github.com/coreos/etcd.git, git@github.com:coreos/etcd.git]
Resolving cached github.com/coreos/etcd: commit='11214aa33bf5a47d3d9d8dafe0f6b97237dfe921',
urls=[https://github.com/coreos/etcd.git, git@github.com:coreos/etcd.git]

> Task :sdks:go:installDependencies
> Task :sdks:go:buildLinuxAmd64
> Task :sdks:go:goBuild

> Task :sdks:java:container:resolveBuildDependencies
Resolving ./github.com/apache/beam/sdks/go@<https://builds.apache.org/job/beam_PreCommit_JavaPortabilityApi_Cron/ws/src/sdks/go>

> Task :sdks:java:container:installDependencies
> Task :sdks:java:container:buildLinuxAmd64
> Task :sdks:java:container:goBuild
> Task :sdks:java:container:dockerPrepare
> Task :sdks:java:container:docker

> Task :runners:google-cloud-dataflow-java:buildAndPushDockerContainer
WARNING: `gcloud docker` will not be supported for Docker client versions above 18.03.

As an alternative, use `gcloud auth configure-docker` to configure `docker` to
use `gcloud` as a credential helper, then use `docker` as you would for non-GCR
registries, e.g. `docker pull gcr.io/project-id/my-image`. Add
`--verbosity=error` to silence this warning: `gcloud docker
--verbosity=error -- pull gcr.io/project-id/my-image`.

See: https://cloud.google.com/container-registry/docs/support/deprecation-notices#gcloud-docker

The push refers to repository [us.gcr.io/apache-beam-testing/java-postcommit-it/java]
940b4fb09470: Preparing
1313e4a1bd19: Preparing
8d0c7489f10f: Preparing
150134b77bf0: Preparing
f7d12d471667: Preparing
f350d0146bb3: Preparing
e38df31d449c: Preparing
af5ae4841776: Preparing
b17cc31e431b: Preparing
12cb127eee44: Preparing
604829a174eb: Preparing
fbb641a8b943: Preparing
af5ae4841776: Waiting
f350d0146bb3: Waiting
604829a174eb: Waiting
fbb641a8b943: Waiting
b17cc31e431b: Waiting
8d0c7489f10f: Layer already exists
f7d12d471667: Layer already exists
150134b77bf0: Layer already exists
1313e4a1bd19: Layer already exists
940b4fb09470: Layer already exists
f350d0146bb3: Layer already exists
12cb127eee44: Layer already exists
af5ae4841776: Layer already exists
b17cc31e431b: Layer already exists
e38df31d449c: Layer already exists
604829a174eb: Layer already exists
fbb641a8b943: Layer already exists
20190403225916: digest: sha256:113fa82e6d8fced5253734660525f85a82b72d7b5313e19474602d26be100c80
size: 2841
d8d0a13cce5f: Preparing
9dc27e250f89: Preparing
eb53782c4e76: Preparing
8af370ea6fd3: Preparing
6a850fcc7a11: Preparing
052664ad8908: Preparing
f7d12d471667: Preparing
f350d0146bb3: Preparing
e38df31d449c: Preparing
af5ae4841776: Preparing
b17cc31e431b: Preparing
12cb127eee44: Preparing
604829a174eb: Preparing
fbb641a8b943: Preparing
f350d0146bb3: Waiting
e38df31d449c: Waiting
052664ad8908: Waiting
af5ae4841776: Waiting
f7d12d471667: Waiting
b17cc31e431b: Waiting
12cb127eee44: Waiting
fbb641a8b943: Waiting
eb53782c4e76: Pushed
6a850fcc7a11: Pushed
f7d12d471667: Layer already exists
f350d0146bb3: Layer already exists
12cb127eee44: Layer already exists
604829a174eb: Layer already exists
fbb641a8b943: Layer already exists
b17cc31e431b: Layer already exists
e38df31d449c: Layer already exists
af5ae4841776: Layer already exists
9dc27e250f89: Pushed
052664ad8908: Pushed
d8d0a13cce5f: Pushed
8af370ea6fd3: Pushed
20190708180839: digest: sha256:9b3d289fc883072b323d95919be3e629d5fe6d1d5866d724d3f6dea44092b4b8
size: 3262

> Task :runners:google-cloud-dataflow-java:examples:verifyFnApiWorker
> Task :runners:google-cloud-dataflow-java:worker:check
> Task :runners:google-cloud-dataflow-java:worker:build

> Task :runners:google-cloud-dataflow-java:examples:verifyFnApiWorker

org.apache.beam.examples.WindowedWordCountIT > testWindowedWordCountInBatchDynamicSharding
FAILED
    java.lang.RuntimeException at WindowedWordCountIT.java:188

3 tests completed, 1 failed

> Task :runners:google-cloud-dataflow-java:examples:verifyFnApiWorker FAILED

> Task :runners:google-cloud-dataflow-java:cleanUpDockerImages
Untagged: us.gcr.io/apache-beam-testing/java-postcommit-it/java:20190708180839
Untagged: us.gcr.io/apache-beam-testing/java-postcommit-it/java@sha256:9b3d289fc883072b323d95919be3e629d5fe6d1d5866d724d3f6dea44092b4b8
Digests:
- us.gcr.io/apache-beam-testing/java-postcommit-it/java@sha256:9b3d289fc883072b323d95919be3e629d5fe6d1d5866d724d3f6dea44092b4b8
  Associated tags:
 - 20190708180839
Tags:
- us.gcr.io/apache-beam-testing/java-postcommit-it/java:20190708180839
Deleted [us.gcr.io/apache-beam-testing/java-postcommit-it/java:20190708180839].
Deleted [us.gcr.io/apache-beam-testing/java-postcommit-it/java@sha256:9b3d289fc883072b323d95919be3e629d5fe6d1d5866d724d3f6dea44092b4b8].

FAILURE: Build failed with an exception.

* What went wrong:
Execution failed for task ':runners:google-cloud-dataflow-java:examples:verifyFnApiWorker'.
> There were failing tests. See the report at: file://<https://builds.apache.org/job/beam_PreCommit_JavaPortabilityApi_Cron/ws/src/runners/google-cloud-dataflow-java/examples/build/reports/tests/verifyFnApiWorker/index.html>

* Try:
Run with --stacktrace option to get the stack trace. Run with --info or --debug option to
get more log output. Run with --scan to get full insights.

* Get more help at https://help.gradle.org

Deprecated Gradle features were used in this build, making it incompatible with Gradle 6.0.
Use '--warning-mode all' to show the individual deprecation warnings.
See https://docs.gradle.org/5.2.1/userguide/command_line_interface.html#sec:command_line_warnings

BUILD FAILED in 8m 49s
99 actionable tasks: 71 executed, 27 from cache, 1 up-to-date

Publishing build scan...
https://gradle.com/s/dciiwtx5zk4xy

Build step 'Invoke Gradle script' changed build result to FAILURE
Build step 'Invoke Gradle script' marked build as failure

---------------------------------------------------------------------
To unsubscribe, e-mail: builds-unsubscribe@beam.apache.org
For additional commands, e-mail: builds-help@beam.apache.org


Mime
View raw message