beam-builds mailing list archives

Site index · List index
Message view « Date » · « Thread »
Top « Date » · « Thread »
From Apache Jenkins Server <jenk...@builds.apache.org>
Subject Build failed in Jenkins: beam_PostCommit_Python_Verify #8644
Date Wed, 03 Jul 2019 00:48:56 GMT
See <https://builds.apache.org/job/beam_PostCommit_Python_Verify/8644/display/redirect>

------------------------------------------
[...truncated 1.10 MB...]
[CHAIN MapPartition (MapPartition at [3]{ExternalTransform(pytest:beam:transforms:filter_less_than), ExternalTransform(pytest:beam:transforms:count)}) -> FlatMap (FlatMap at ExtractOutput[0]) -> Map (Key Extractor) -> GroupCombine (GroupCombine at GroupCombine: ExternalTransform(pytest:beam:transforms:count)/Combine.perKey(Count)/Group) -> Map (Key Extractor) (1/2)] INFO org.apache.flink.runtime.taskmanager.Task - Ensuring all FileSystem streams are closed for task CHAIN MapPartition (MapPartition at [3]{ExternalTransform(pytest:beam:transforms:filter_less_than), ExternalTransform(pytest:beam:transforms:count)}) -> FlatMap (FlatMap at ExtractOutput[0]) -> Map (Key Extractor) -> GroupCombine (GroupCombine at GroupCombine: ExternalTransform(pytest:beam:transforms:count)/Combine.perKey(Count)/Group) -> Map (Key Extractor) (1/2) (4da0c6596b7e6439299422d384bb7dbc) [FINISHED]
[CHAIN MapPartition (MapPartition at [3]{ExternalTransform(pytest:beam:transforms:filter_less_than), ExternalTransform(pytest:beam:transforms:count)}) -> FlatMap (FlatMap at ExtractOutput[0]) -> Map (Key Extractor) -> GroupCombine (GroupCombine at GroupCombine: ExternalTransform(pytest:beam:transforms:count)/Combine.perKey(Count)/Group) -> Map (Key Extractor) (2/2)] INFO org.apache.flink.runtime.taskmanager.Task - Ensuring all FileSystem streams are closed for task CHAIN MapPartition (MapPartition at [3]{ExternalTransform(pytest:beam:transforms:filter_less_than), ExternalTransform(pytest:beam:transforms:count)}) -> FlatMap (FlatMap at ExtractOutput[0]) -> Map (Key Extractor) -> GroupCombine (GroupCombine at GroupCombine: ExternalTransform(pytest:beam:transforms:count)/Combine.perKey(Count)/Group) -> Map (Key Extractor) (2/2) (9f642c5852d6693463a113db9e044577) [FINISHED]
[flink-akka.actor.default-dispatcher-8] INFO org.apache.flink.runtime.taskexecutor.TaskExecutor - Un-registering task and sending final execution state FINISHED to JobManager for task CHAIN MapPartition (MapPartition at [3]{ExternalTransform(pytest:beam:transforms:filter_less_than), ExternalTransform(pytest:beam:transforms:count)}) -> FlatMap (FlatMap at ExtractOutput[0]) -> Map (Key Extractor) -> GroupCombine (GroupCombine at GroupCombine: ExternalTransform(pytest:beam:transforms:count)/Combine.perKey(Count)/Group) -> Map (Key Extractor) 4da0c6596b7e6439299422d384bb7dbc.
[flink-akka.actor.default-dispatcher-8] INFO org.apache.flink.runtime.taskexecutor.TaskExecutor - Un-registering task and sending final execution state FINISHED to JobManager for task CHAIN MapPartition (MapPartition at [3]{ExternalTransform(pytest:beam:transforms:filter_less_than), ExternalTransform(pytest:beam:transforms:count)}) -> FlatMap (FlatMap at ExtractOutput[0]) -> Map (Key Extractor) -> GroupCombine (GroupCombine at GroupCombine: ExternalTransform(pytest:beam:transforms:count)/Combine.perKey(Count)/Group) -> Map (Key Extractor) 9f642c5852d6693463a113db9e044577.
[flink-akka.actor.default-dispatcher-9] INFO org.apache.flink.runtime.executiongraph.ExecutionGraph - CHAIN MapPartition (MapPartition at [3]{ExternalTransform(pytest:beam:transforms:filter_less_than), ExternalTransform(pytest:beam:transforms:count)}) -> FlatMap (FlatMap at ExtractOutput[0]) -> Map (Key Extractor) -> GroupCombine (GroupCombine at GroupCombine: ExternalTransform(pytest:beam:transforms:count)/Combine.perKey(Count)/Group) -> Map (Key Extractor) (1/2) (4da0c6596b7e6439299422d384bb7dbc) switched from RUNNING to FINISHED.
[flink-akka.actor.default-dispatcher-9] INFO org.apache.flink.runtime.executiongraph.ExecutionGraph - CHAIN MapPartition (MapPartition at [3]{ExternalTransform(pytest:beam:transforms:filter_less_than), ExternalTransform(pytest:beam:transforms:count)}) -> FlatMap (FlatMap at ExtractOutput[0]) -> Map (Key Extractor) -> GroupCombine (GroupCombine at GroupCombine: ExternalTransform(pytest:beam:transforms:count)/Combine.perKey(Count)/Group) -> Map (Key Extractor) (2/2) (9f642c5852d6693463a113db9e044577) switched from RUNNING to FINISHED.
[jobmanager-future-thread-4] INFO org.apache.flink.runtime.executiongraph.ExecutionGraph - CHAIN MapPartition (MapPartition at [2]ExternalTransform(pytest:beam:transforms:count)/Combine.perKey(Count)/{Merge, ExtractOutputs}) -> FlatMap (FlatMap at ExtractOutput[0]) (2/2) (31232d9abfa3a68bcabb8172dd7e2a47) switched from CREATED to SCHEDULED.
[flink-akka.actor.default-dispatcher-2] INFO org.apache.flink.runtime.executiongraph.ExecutionGraph - CHAIN MapPartition (MapPartition at [2]ExternalTransform(pytest:beam:transforms:count)/Combine.perKey(Count)/{Merge, ExtractOutputs}) -> FlatMap (FlatMap at ExtractOutput[0]) (2/2) (31232d9abfa3a68bcabb8172dd7e2a47) switched from SCHEDULED to DEPLOYING.
[flink-akka.actor.default-dispatcher-2] INFO org.apache.flink.runtime.executiongraph.ExecutionGraph - Deploying CHAIN MapPartition (MapPartition at [2]ExternalTransform(pytest:beam:transforms:count)/Combine.perKey(Count)/{Merge, ExtractOutputs}) -> FlatMap (FlatMap at ExtractOutput[0]) (2/2) (attempt #0) to localhost
[flink-akka.actor.default-dispatcher-7] INFO org.apache.flink.runtime.taskexecutor.TaskExecutor - Received task CHAIN MapPartition (MapPartition at [2]ExternalTransform(pytest:beam:transforms:count)/Combine.perKey(Count)/{Merge, ExtractOutputs}) -> FlatMap (FlatMap at ExtractOutput[0]) (2/2).
[CHAIN MapPartition (MapPartition at [2]ExternalTransform(pytest:beam:transforms:count)/Combine.perKey(Count)/{Merge, ExtractOutputs}) -> FlatMap (FlatMap at ExtractOutput[0]) (2/2)] INFO org.apache.flink.runtime.taskmanager.Task - CHAIN MapPartition (MapPartition at [2]ExternalTransform(pytest:beam:transforms:count)/Combine.perKey(Count)/{Merge, ExtractOutputs}) -> FlatMap (FlatMap at ExtractOutput[0]) (2/2) (31232d9abfa3a68bcabb8172dd7e2a47) switched from CREATED to DEPLOYING.
[CHAIN MapPartition (MapPartition at [2]ExternalTransform(pytest:beam:transforms:count)/Combine.perKey(Count)/{Merge, ExtractOutputs}) -> FlatMap (FlatMap at ExtractOutput[0]) (2/2)] INFO org.apache.flink.runtime.taskmanager.Task - Creating FileSystem stream leak safety net for task CHAIN MapPartition (MapPartition at [2]ExternalTransform(pytest:beam:transforms:count)/Combine.perKey(Count)/{Merge, ExtractOutputs}) -> FlatMap (FlatMap at ExtractOutput[0]) (2/2) (31232d9abfa3a68bcabb8172dd7e2a47) [DEPLOYING]
[CHAIN MapPartition (MapPartition at [2]ExternalTransform(pytest:beam:transforms:count)/Combine.perKey(Count)/{Merge, ExtractOutputs}) -> FlatMap (FlatMap at ExtractOutput[0]) (2/2)] INFO org.apache.flink.runtime.taskmanager.Task - Loading JAR files for task CHAIN MapPartition (MapPartition at [2]ExternalTransform(pytest:beam:transforms:count)/Combine.perKey(Count)/{Merge, ExtractOutputs}) -> FlatMap (FlatMap at ExtractOutput[0]) (2/2) (31232d9abfa3a68bcabb8172dd7e2a47) [DEPLOYING].
[CHAIN MapPartition (MapPartition at [2]ExternalTransform(pytest:beam:transforms:count)/Combine.perKey(Count)/{Merge, ExtractOutputs}) -> FlatMap (FlatMap at ExtractOutput[0]) (2/2)] INFO org.apache.flink.runtime.taskmanager.Task - Registering task at network: CHAIN MapPartition (MapPartition at [2]ExternalTransform(pytest:beam:transforms:count)/Combine.perKey(Count)/{Merge, ExtractOutputs}) -> FlatMap (FlatMap at ExtractOutput[0]) (2/2) (31232d9abfa3a68bcabb8172dd7e2a47) [DEPLOYING].
[CHAIN MapPartition (MapPartition at [2]ExternalTransform(pytest:beam:transforms:count)/Combine.perKey(Count)/{Merge, ExtractOutputs}) -> FlatMap (FlatMap at ExtractOutput[0]) (2/2)] INFO org.apache.flink.runtime.taskmanager.Task - CHAIN MapPartition (MapPartition at [2]ExternalTransform(pytest:beam:transforms:count)/Combine.perKey(Count)/{Merge, ExtractOutputs}) -> FlatMap (FlatMap at ExtractOutput[0]) (2/2) (31232d9abfa3a68bcabb8172dd7e2a47) switched from DEPLOYING to RUNNING.
[flink-akka.actor.default-dispatcher-7] INFO org.apache.flink.runtime.executiongraph.ExecutionGraph - CHAIN MapPartition (MapPartition at [2]ExternalTransform(pytest:beam:transforms:count)/Combine.perKey(Count)/{Merge, ExtractOutputs}) -> FlatMap (FlatMap at ExtractOutput[0]) (2/2) (31232d9abfa3a68bcabb8172dd7e2a47) switched from DEPLOYING to RUNNING.
[CHAIN MapPartition (MapPartition at [2]ExternalTransform(pytest:beam:transforms:count)/Combine.perKey(Count)/{Merge, ExtractOutputs}) -> FlatMap (FlatMap at ExtractOutput[0]) (2/2)] WARN org.apache.flink.metrics.MetricGroup - The operator name MapPartition (MapPartition at [2]ExternalTransform(pytest:beam:transforms:count)/Combine.perKey(Count)/{Merge, ExtractOutputs}) exceeded the 80 characters length limit and was truncated.
[jobmanager-future-thread-14] INFO org.apache.flink.runtime.executiongraph.ExecutionGraph - CHAIN MapPartition (MapPartition at [2]ExternalTransform(pytest:beam:transforms:count)/Combine.perKey(Count)/{Merge, ExtractOutputs}) -> FlatMap (FlatMap at ExtractOutput[0]) (1/2) (a8dbf3e56f5d3573be8a1819ceb274da) switched from CREATED to SCHEDULED.
[flink-akka.actor.default-dispatcher-7] INFO org.apache.flink.runtime.executiongraph.ExecutionGraph - CHAIN MapPartition (MapPartition at [2]ExternalTransform(pytest:beam:transforms:count)/Combine.perKey(Count)/{Merge, ExtractOutputs}) -> FlatMap (FlatMap at ExtractOutput[0]) (1/2) (a8dbf3e56f5d3573be8a1819ceb274da) switched from SCHEDULED to DEPLOYING.
[flink-akka.actor.default-dispatcher-7] INFO org.apache.flink.runtime.executiongraph.ExecutionGraph - Deploying CHAIN MapPartition (MapPartition at [2]ExternalTransform(pytest:beam:transforms:count)/Combine.perKey(Count)/{Merge, ExtractOutputs}) -> FlatMap (FlatMap at ExtractOutput[0]) (1/2) (attempt #0) to localhost
[flink-akka.actor.default-dispatcher-2] INFO org.apache.flink.runtime.taskexecutor.TaskExecutor - Received task CHAIN MapPartition (MapPartition at [2]ExternalTransform(pytest:beam:transforms:count)/Combine.perKey(Count)/{Merge, ExtractOutputs}) -> FlatMap (FlatMap at ExtractOutput[0]) (1/2).
[CHAIN MapPartition (MapPartition at [2]ExternalTransform(pytest:beam:transforms:count)/Combine.perKey(Count)/{Merge, ExtractOutputs}) -> FlatMap (FlatMap at ExtractOutput[0]) (1/2)] INFO org.apache.flink.runtime.taskmanager.Task - CHAIN MapPartition (MapPartition at [2]ExternalTransform(pytest:beam:transforms:count)/Combine.perKey(Count)/{Merge, ExtractOutputs}) -> FlatMap (FlatMap at ExtractOutput[0]) (1/2) (a8dbf3e56f5d3573be8a1819ceb274da) switched from CREATED to DEPLOYING.
[CHAIN MapPartition (MapPartition at [2]ExternalTransform(pytest:beam:transforms:count)/Combine.perKey(Count)/{Merge, ExtractOutputs}) -> FlatMap (FlatMap at ExtractOutput[0]) (1/2)] INFO org.apache.flink.runtime.taskmanager.Task - Creating FileSystem stream leak safety net for task CHAIN MapPartition (MapPartition at [2]ExternalTransform(pytest:beam:transforms:count)/Combine.perKey(Count)/{Merge, ExtractOutputs}) -> FlatMap (FlatMap at ExtractOutput[0]) (1/2) (a8dbf3e56f5d3573be8a1819ceb274da) [DEPLOYING]
[CHAIN MapPartition (MapPartition at [2]ExternalTransform(pytest:beam:transforms:count)/Combine.perKey(Count)/{Merge, ExtractOutputs}) -> FlatMap (FlatMap at ExtractOutput[0]) (1/2)] INFO org.apache.flink.runtime.taskmanager.Task - Loading JAR files for task CHAIN MapPartition (MapPartition at [2]ExternalTransform(pytest:beam:transforms:count)/Combine.perKey(Count)/{Merge, ExtractOutputs}) -> FlatMap (FlatMap at ExtractOutput[0]) (1/2) (a8dbf3e56f5d3573be8a1819ceb274da) [DEPLOYING].
[CHAIN MapPartition (MapPartition at [2]ExternalTransform(pytest:beam:transforms:count)/Combine.perKey(Count)/{Merge, ExtractOutputs}) -> FlatMap (FlatMap at ExtractOutput[0]) (1/2)] INFO org.apache.flink.runtime.taskmanager.Task - Registering task at network: CHAIN MapPartition (MapPartition at [2]ExternalTransform(pytest:beam:transforms:count)/Combine.perKey(Count)/{Merge, ExtractOutputs}) -> FlatMap (FlatMap at ExtractOutput[0]) (1/2) (a8dbf3e56f5d3573be8a1819ceb274da) [DEPLOYING].
[CHAIN MapPartition (MapPartition at [2]ExternalTransform(pytest:beam:transforms:count)/Combine.perKey(Count)/{Merge, ExtractOutputs}) -> FlatMap (FlatMap at ExtractOutput[0]) (1/2)] INFO org.apache.flink.runtime.taskmanager.Task - CHAIN MapPartition (MapPartition at [2]ExternalTransform(pytest:beam:transforms:count)/Combine.perKey(Count)/{Merge, ExtractOutputs}) -> FlatMap (FlatMap at ExtractOutput[0]) (1/2) (a8dbf3e56f5d3573be8a1819ceb274da) switched from DEPLOYING to RUNNING.
[flink-akka.actor.default-dispatcher-2] INFO org.apache.flink.runtime.executiongraph.ExecutionGraph - CHAIN MapPartition (MapPartition at [2]ExternalTransform(pytest:beam:transforms:count)/Combine.perKey(Count)/{Merge, ExtractOutputs}) -> FlatMap (FlatMap at ExtractOutput[0]) (1/2) (a8dbf3e56f5d3573be8a1819ceb274da) switched from DEPLOYING to RUNNING.
[CHAIN MapPartition (MapPartition at [2]ExternalTransform(pytest:beam:transforms:count)/Combine.perKey(Count)/{Merge, ExtractOutputs}) -> FlatMap (FlatMap at ExtractOutput[0]) (1/2)] WARN org.apache.flink.metrics.MetricGroup - The operator name MapPartition (MapPartition at [2]ExternalTransform(pytest:beam:transforms:count)/Combine.perKey(Count)/{Merge, ExtractOutputs}) exceeded the 80 characters length limit and was truncated.
[GroupReduce (GroupReduce at ExternalTransform(pytest:beam:transforms:count)/Combine.perKey(Count)/Group) (2/2)] INFO org.apache.flink.runtime.taskmanager.Task - GroupReduce (GroupReduce at ExternalTransform(pytest:beam:transforms:count)/Combine.perKey(Count)/Group) (2/2) (71fd9595add8a21ce6121069ef3e1748) switched from RUNNING to FINISHED.
[GroupReduce (GroupReduce at ExternalTransform(pytest:beam:transforms:count)/Combine.perKey(Count)/Group) (2/2)] INFO org.apache.flink.runtime.taskmanager.Task - Freeing task resources for GroupReduce (GroupReduce at ExternalTransform(pytest:beam:transforms:count)/Combine.perKey(Count)/Group) (2/2) (71fd9595add8a21ce6121069ef3e1748).
[GroupReduce (GroupReduce at ExternalTransform(pytest:beam:transforms:count)/Combine.perKey(Count)/Group) (2/2)] INFO org.apache.flink.runtime.taskmanager.Task - Ensuring all FileSystem streams are closed for task GroupReduce (GroupReduce at ExternalTransform(pytest:beam:transforms:count)/Combine.perKey(Count)/Group) (2/2) (71fd9595add8a21ce6121069ef3e1748) [FINISHED]
[GroupReduce (GroupReduce at ExternalTransform(pytest:beam:transforms:count)/Combine.perKey(Count)/Group) (1/2)] INFO org.apache.flink.runtime.taskmanager.Task - GroupReduce (GroupReduce at ExternalTransform(pytest:beam:transforms:count)/Combine.perKey(Count)/Group) (1/2) (545a7db041cbab92e10360e83146e964) switched from RUNNING to FINISHED.
[GroupReduce (GroupReduce at ExternalTransform(pytest:beam:transforms:count)/Combine.perKey(Count)/Group) (1/2)] INFO org.apache.flink.runtime.taskmanager.Task - Freeing task resources for GroupReduce (GroupReduce at ExternalTransform(pytest:beam:transforms:count)/Combine.perKey(Count)/Group) (1/2) (545a7db041cbab92e10360e83146e964).
[GroupReduce (GroupReduce at ExternalTransform(pytest:beam:transforms:count)/Combine.perKey(Count)/Group) (1/2)] INFO org.apache.flink.runtime.taskmanager.Task - Ensuring all FileSystem streams are closed for task GroupReduce (GroupReduce at ExternalTransform(pytest:beam:transforms:count)/Combine.perKey(Count)/Group) (1/2) (545a7db041cbab92e10360e83146e964) [FINISHED]
[flink-akka.actor.default-dispatcher-8] INFO org.apache.flink.runtime.taskexecutor.TaskExecutor - Un-registering task and sending final execution state FINISHED to JobManager for task GroupReduce (GroupReduce at ExternalTransform(pytest:beam:transforms:count)/Combine.perKey(Count)/Group) 71fd9595add8a21ce6121069ef3e1748.
[flink-akka.actor.default-dispatcher-8] INFO org.apache.flink.runtime.taskexecutor.TaskExecutor - Un-registering task and sending final execution state FINISHED to JobManager for task GroupReduce (GroupReduce at ExternalTransform(pytest:beam:transforms:count)/Combine.perKey(Count)/Group) 545a7db041cbab92e10360e83146e964.
[flink-akka.actor.default-dispatcher-7] INFO org.apache.flink.runtime.executiongraph.ExecutionGraph - GroupReduce (GroupReduce at ExternalTransform(pytest:beam:transforms:count)/Combine.perKey(Count)/Group) (2/2) (71fd9595add8a21ce6121069ef3e1748) switched from RUNNING to FINISHED.
[flink-akka.actor.default-dispatcher-7] INFO org.apache.flink.runtime.executiongraph.ExecutionGraph - GroupReduce (GroupReduce at ExternalTransform(pytest:beam:transforms:count)/Combine.perKey(Count)/Group) (1/2) (545a7db041cbab92e10360e83146e964) switched from RUNNING to FINISHED.
[jobmanager-future-thread-6] INFO org.apache.flink.runtime.executiongraph.ExecutionGraph - CHAIN MapPartition (MapPartition at [6]{Map(<lambda at external_test.py:212>), Map(<lambda at external_test.py:213>), assert_that}) -> FlatMap (FlatMap at ExtractOutput[0]) (2/2) (a7dd83e7d4b6766e321b4ce15bbab8ab) switched from CREATED to SCHEDULED.
[flink-akka.actor.default-dispatcher-8] INFO org.apache.flink.runtime.executiongraph.ExecutionGraph - CHAIN MapPartition (MapPartition at [6]{Map(<lambda at external_test.py:212>), Map(<lambda at external_test.py:213>), assert_that}) -> FlatMap (FlatMap at ExtractOutput[0]) (2/2) (a7dd83e7d4b6766e321b4ce15bbab8ab) switched from SCHEDULED to DEPLOYING.
[flink-akka.actor.default-dispatcher-8] INFO org.apache.flink.runtime.executiongraph.ExecutionGraph - Deploying CHAIN MapPartition (MapPartition at [6]{Map(<lambda at external_test.py:212>), Map(<lambda at external_test.py:213>), assert_that}) -> FlatMap (FlatMap at ExtractOutput[0]) (2/2) (attempt #0) to localhost
[flink-akka.actor.default-dispatcher-2] INFO org.apache.flink.runtime.taskexecutor.TaskExecutor - Received task CHAIN MapPartition (MapPartition at [6]{Map(<lambda at external_test.py:212>), Map(<lambda at external_test.py:213>), assert_that}) -> FlatMap (FlatMap at ExtractOutput[0]) (2/2).
[CHAIN MapPartition (MapPartition at [6]{Map(<lambda at external_test.py:212>), Map(<lambda at external_test.py:213>), assert_that}) -> FlatMap (FlatMap at ExtractOutput[0]) (2/2)] INFO org.apache.flink.runtime.taskmanager.Task - CHAIN MapPartition (MapPartition at [6]{Map(<lambda at external_test.py:212>), Map(<lambda at external_test.py:213>), assert_that}) -> FlatMap (FlatMap at ExtractOutput[0]) (2/2) (a7dd83e7d4b6766e321b4ce15bbab8ab) switched from CREATED to DEPLOYING.
[CHAIN MapPartition (MapPartition at [6]{Map(<lambda at external_test.py:212>), Map(<lambda at external_test.py:213>), assert_that}) -> FlatMap (FlatMap at ExtractOutput[0]) (2/2)] INFO org.apache.flink.runtime.taskmanager.Task - Creating FileSystem stream leak safety net for task CHAIN MapPartition (MapPartition at [6]{Map(<lambda at external_test.py:212>), Map(<lambda at external_test.py:213>), assert_that}) -> FlatMap (FlatMap at ExtractOutput[0]) (2/2) (a7dd83e7d4b6766e321b4ce15bbab8ab) [DEPLOYING]
[CHAIN MapPartition (MapPartition at [6]{Map(<lambda at external_test.py:212>), Map(<lambda at external_test.py:213>), assert_that}) -> FlatMap (FlatMap at ExtractOutput[0]) (2/2)] INFO org.apache.flink.runtime.taskmanager.Task - Loading JAR files for task CHAIN MapPartition (MapPartition at [6]{Map(<lambda at external_test.py:212>), Map(<lambda at external_test.py:213>), assert_that}) -> FlatMap (FlatMap at ExtractOutput[0]) (2/2) (a7dd83e7d4b6766e321b4ce15bbab8ab) [DEPLOYING].
[CHAIN MapPartition (MapPartition at [6]{Map(<lambda at external_test.py:212>), Map(<lambda at external_test.py:213>), assert_that}) -> FlatMap (FlatMap at ExtractOutput[0]) (2/2)] INFO org.apache.flink.runtime.taskmanager.Task - Registering task at network: CHAIN MapPartition (MapPartition at [6]{Map(<lambda at external_test.py:212>), Map(<lambda at external_test.py:213>), assert_that}) -> FlatMap (FlatMap at ExtractOutput[0]) (2/2) (a7dd83e7d4b6766e321b4ce15bbab8ab) [DEPLOYING].
[CHAIN MapPartition (MapPartition at [6]{Map(<lambda at external_test.py:212>), Map(<lambda at external_test.py:213>), assert_that}) -> FlatMap (FlatMap at ExtractOutput[0]) (2/2)] INFO org.apache.flink.runtime.taskmanager.Task - CHAIN MapPartition (MapPartition at [6]{Map(<lambda at external_test.py:212>), Map(<lambda at external_test.py:213>), assert_that}) -> FlatMap (FlatMap at ExtractOutput[0]) (2/2) (a7dd83e7d4b6766e321b4ce15bbab8ab) switched from DEPLOYING to RUNNING.
[flink-akka.actor.default-dispatcher-2] INFO org.apache.flink.runtime.executiongraph.ExecutionGraph - CHAIN MapPartition (MapPartition at [6]{Map(<lambda at external_test.py:212>), Map(<lambda at external_test.py:213>), assert_that}) -> FlatMap (FlatMap at ExtractOutput[0]) (2/2) (a7dd83e7d4b6766e321b4ce15bbab8ab) switched from DEPLOYING to RUNNING.
[CHAIN MapPartition (MapPartition at [6]{Map(<lambda at external_test.py:212>), Map(<lambda at external_test.py:213>), assert_that}) -> FlatMap (FlatMap at ExtractOutput[0]) (2/2)] WARN org.apache.flink.metrics.MetricGroup - The operator name MapPartition (MapPartition at [6]{Map(<lambda at external_test.py:212>), Map(<lambda at external_test.py:213>), assert_that}) exceeded the 80 characters length limit and was truncated.
[CHAIN MapPartition (MapPartition at [2]ExternalTransform(pytest:beam:transforms:count)/Combine.perKey(Count)/{Merge, ExtractOutputs}) -> FlatMap (FlatMap at ExtractOutput[0]) (2/2)] INFO org.apache.flink.runtime.taskmanager.Task - CHAIN MapPartition (MapPartition at [2]ExternalTransform(pytest:beam:transforms:count)/Combine.perKey(Count)/{Merge, ExtractOutputs}) -> FlatMap (FlatMap at ExtractOutput[0]) (2/2) (31232d9abfa3a68bcabb8172dd7e2a47) switched from RUNNING to FINISHED.
[CHAIN MapPartition (MapPartition at [2]ExternalTransform(pytest:beam:transforms:count)/Combine.perKey(Count)/{Merge, ExtractOutputs}) -> FlatMap (FlatMap at ExtractOutput[0]) (2/2)] INFO org.apache.flink.runtime.taskmanager.Task - Freeing task resources for CHAIN MapPartition (MapPartition at [2]ExternalTransform(pytest:beam:transforms:count)/Combine.perKey(Count)/{Merge, ExtractOutputs}) -> FlatMap (FlatMap at ExtractOutput[0]) (2/2) (31232d9abfa3a68bcabb8172dd7e2a47).
[CHAIN MapPartition (MapPartition at [2]ExternalTransform(pytest:beam:transforms:count)/Combine.perKey(Count)/{Merge, ExtractOutputs}) -> FlatMap (FlatMap at ExtractOutput[0]) (2/2)] INFO org.apache.flink.runtime.taskmanager.Task - Ensuring all FileSystem streams are closed for task CHAIN MapPartition (MapPartition at [2]ExternalTransform(pytest:beam:transforms:count)/Combine.perKey(Count)/{Merge, ExtractOutputs}) -> FlatMap (FlatMap at ExtractOutput[0]) (2/2) (31232d9abfa3a68bcabb8172dd7e2a47) [FINISHED]
[flink-akka.actor.default-dispatcher-7] INFO org.apache.flink.runtime.taskexecutor.TaskExecutor - Un-registering task and sending final execution state FINISHED to JobManager for task CHAIN MapPartition (MapPartition at [2]ExternalTransform(pytest:beam:transforms:count)/Combine.perKey(Count)/{Merge, ExtractOutputs}) -> FlatMap (FlatMap at ExtractOutput[0]) 31232d9abfa3a68bcabb8172dd7e2a47.
[flink-akka.actor.default-dispatcher-7] INFO org.apache.flink.runtime.executiongraph.ExecutionGraph - CHAIN MapPartition (MapPartition at [2]ExternalTransform(pytest:beam:transforms:count)/Combine.perKey(Count)/{Merge, ExtractOutputs}) -> FlatMap (FlatMap at ExtractOutput[0]) (2/2) (31232d9abfa3a68bcabb8172dd7e2a47) switched from RUNNING to FINISHED.
[jobmanager-future-thread-2] INFO org.apache.flink.runtime.executiongraph.ExecutionGraph - CHAIN MapPartition (MapPartition at [6]{Map(<lambda at external_test.py:212>), Map(<lambda at external_test.py:213>), assert_that}) -> FlatMap (FlatMap at ExtractOutput[0]) (1/2) (f6d7ed59d32bc52a02869e34e9873cb1) switched from CREATED to SCHEDULED.
[flink-akka.actor.default-dispatcher-8] INFO org.apache.flink.runtime.executiongraph.ExecutionGraph - CHAIN MapPartition (MapPartition at [6]{Map(<lambda at external_test.py:212>), Map(<lambda at external_test.py:213>), assert_that}) -> FlatMap (FlatMap at ExtractOutput[0]) (1/2) (f6d7ed59d32bc52a02869e34e9873cb1) switched from SCHEDULED to DEPLOYING.
[flink-akka.actor.default-dispatcher-8] INFO org.apache.flink.runtime.executiongraph.ExecutionGraph - Deploying CHAIN MapPartition (MapPartition at [6]{Map(<lambda at external_test.py:212>), Map(<lambda at external_test.py:213>), assert_that}) -> FlatMap (FlatMap at ExtractOutput[0]) (1/2) (attempt #0) to localhost
[flink-akka.actor.default-dispatcher-7] INFO org.apache.flink.runtime.taskexecutor.TaskExecutor - Received task CHAIN MapPartition (MapPartition at [6]{Map(<lambda at external_test.py:212>), Map(<lambda at external_test.py:213>), assert_that}) -> FlatMap (FlatMap at ExtractOutput[0]) (1/2).
[CHAIN MapPartition (MapPartition at [6]{Map(<lambda at external_test.py:212>), Map(<lambda at external_test.py:213>), assert_that}) -> FlatMap (FlatMap at ExtractOutput[0]) (1/2)] INFO org.apache.flink.runtime.taskmanager.Task - CHAIN MapPartition (MapPartition at [6]{Map(<lambda at external_test.py:212>), Map(<lambda at external_test.py:213>), assert_that}) -> FlatMap (FlatMap at ExtractOutput[0]) (1/2) (f6d7ed59d32bc52a02869e34e9873cb1) switched from CREATED to DEPLOYING.
[CHAIN MapPartition (MapPartition at [6]{Map(<lambda at external_test.py:212>), Map(<lambda at external_test.py:213>), assert_that}) -> FlatMap (FlatMap at ExtractOutput[0]) (1/2)] INFO org.apache.flink.runtime.taskmanager.Task - Creating FileSystem stream leak safety net for task CHAIN MapPartition (MapPartition at [6]{Map(<lambda at external_test.py:212>), Map(<lambda at external_test.py:213>), assert_that}) -> FlatMap (FlatMap at ExtractOutput[0]) (1/2) (f6d7ed59d32bc52a02869e34e9873cb1) [DEPLOYING]
[CHAIN MapPartition (MapPartition at [6]{Map(<lambda at external_test.py:212>), Map(<lambda at external_test.py:213>), assert_that}) -> FlatMap (FlatMap at ExtractOutput[0]) (1/2)] INFO org.apache.flink.runtime.taskmanager.Task - Loading JAR files for task CHAIN MapPartition (MapPartition at [6]{Map(<lambda at external_test.py:212>), Map(<lambda at external_test.py:213>), assert_that}) -> FlatMap (FlatMap at ExtractOutput[0]) (1/2) (f6d7ed59d32bc52a02869e34e9873cb1) [DEPLOYING].
[CHAIN MapPartition (MapPartition at [6]{Map(<lambda at external_test.py:212>), Map(<lambda at external_test.py:213>), assert_that}) -> FlatMap (FlatMap at ExtractOutput[0]) (1/2)] INFO org.apache.flink.runtime.taskmanager.Task - Registering task at network: CHAIN MapPartition (MapPartition at [6]{Map(<lambda at external_test.py:212>), Map(<lambda at external_test.py:213>), assert_that}) -> FlatMap (FlatMap at ExtractOutput[0]) (1/2) (f6d7ed59d32bc52a02869e34e9873cb1) [DEPLOYING].
[CHAIN MapPartition (MapPartition at [6]{Map(<lambda at external_test.py:212>), Map(<lambda at external_test.py:213>), assert_that}) -> FlatMap (FlatMap at ExtractOutput[0]) (1/2)] INFO org.apache.flink.runtime.taskmanager.Task - CHAIN MapPartition (MapPartition at [6]{Map(<lambda at external_test.py:212>), Map(<lambda at external_test.py:213>), assert_that}) -> FlatMap (FlatMap at ExtractOutput[0]) (1/2) (f6d7ed59d32bc52a02869e34e9873cb1) switched from DEPLOYING to RUNNING.
[CHAIN MapPartition (MapPartition at [6]{Map(<lambda at external_test.py:212>), Map(<lambda at external_test.py:213>), assert_that}) -> FlatMap (FlatMap at ExtractOutput[0]) (1/2)] WARN org.apache.flink.metrics.MetricGroup - The operator name MapPartition (MapPartition at [6]{Map(<lambda at external_test.py:212>), Map(<lambda at external_test.py:213>), assert_that}) exceeded the 80 characters length limit and was truncated.
[flink-akka.actor.default-dispatcher-2] INFO org.apache.flink.runtime.executiongraph.ExecutionGraph - CHAIN MapPartition (MapPartition at [6]{Map(<lambda at external_test.py:212>), Map(<lambda at external_test.py:213>), assert_that}) -> FlatMap (FlatMap at ExtractOutput[0]) (1/2) (f6d7ed59d32bc52a02869e34e9873cb1) switched from DEPLOYING to RUNNING.
[CHAIN MapPartition (MapPartition at [2]ExternalTransform(pytest:beam:transforms:count)/Combine.perKey(Count)/{Merge, ExtractOutputs}) -> FlatMap (FlatMap at ExtractOutput[0]) (1/2)] INFO org.apache.flink.runtime.taskmanager.Task - CHAIN MapPartition (MapPartition at [2]ExternalTransform(pytest:beam:transforms:count)/Combine.perKey(Count)/{Merge, ExtractOutputs}) -> FlatMap (FlatMap at ExtractOutput[0]) (1/2) (a8dbf3e56f5d3573be8a1819ceb274da) switched from RUNNING to FINISHED.
[CHAIN MapPartition (MapPartition at [2]ExternalTransform(pytest:beam:transforms:count)/Combine.perKey(Count)/{Merge, ExtractOutputs}) -> FlatMap (FlatMap at ExtractOutput[0]) (1/2)] INFO org.apache.flink.runtime.taskmanager.Task - Freeing task resources for CHAIN MapPartition (MapPartition at [2]ExternalTransform(pytest:beam:transforms:count)/Combine.perKey(Count)/{Merge, ExtractOutputs}) -> FlatMap (FlatMap at ExtractOutput[0]) (1/2) (a8dbf3e56f5d3573be8a1819ceb274da).
[CHAIN MapPartition (MapPartition at [2]ExternalTransform(pytest:beam:transforms:count)/Combine.perKey(Count)/{Merge, ExtractOutputs}) -> FlatMap (FlatMap at ExtractOutput[0]) (1/2)] INFO org.apache.flink.runtime.taskmanager.Task - Ensuring all FileSystem streams are closed for task CHAIN MapPartition (MapPartition at [2]ExternalTransform(pytest:beam:transforms:count)/Combine.perKey(Count)/{Merge, ExtractOutputs}) -> FlatMap (FlatMap at ExtractOutput[0]) (1/2) (a8dbf3e56f5d3573be8a1819ceb274da) [FINISHED]
[flink-akka.actor.default-dispatcher-9] INFO org.apache.flink.runtime.taskexecutor.TaskExecutor - Un-registering task and sending final execution state FINISHED to JobManager for task CHAIN MapPartition (MapPartition at [2]ExternalTransform(pytest:beam:transforms:count)/Combine.perKey(Count)/{Merge, ExtractOutputs}) -> FlatMap (FlatMap at ExtractOutput[0]) a8dbf3e56f5d3573be8a1819ceb274da.
[grpc-default-executor-1] WARN bundle_processor.create_operation - No unique name set for transform fn/write/ref_PCollection_PCollection_24:0:0 
[flink-akka.actor.default-dispatcher-9] INFO org.apache.flink.runtime.executiongraph.ExecutionGraph - CHAIN MapPartition (MapPartition at [2]ExternalTransform(pytest:beam:transforms:count)/Combine.perKey(Count)/{Merge, ExtractOutputs}) -> FlatMap (FlatMap at ExtractOutput[0]) (1/2) (a8dbf3e56f5d3573be8a1819ceb274da) switched from RUNNING to FINISHED.
[grpc-default-executor-1] WARN bundle_processor.create_operation - No unique name set for transform fn/write/ref_PCollection_PCollection_24:0:0 
[grpc-default-executor-1] WARN bundle_processor.create_operation - No unique name set for transform fn/read/ref_PCollection_PCollection_14:0 
[grpc-default-executor-1] WARN bundle_processor.create_operation - No unique name set for transform fn/read/ref_PCollection_PCollection_14:0 
[CHAIN MapPartition (MapPartition at [6]{Map(<lambda at external_test.py:212>), Map(<lambda at external_test.py:213>), assert_that}) -> FlatMap (FlatMap at ExtractOutput[0]) (1/2)] INFO org.apache.flink.runtime.taskmanager.Task - CHAIN MapPartition (MapPartition at [6]{Map(<lambda at external_test.py:212>), Map(<lambda at external_test.py:213>), assert_that}) -> FlatMap (FlatMap at ExtractOutput[0]) (1/2) (f6d7ed59d32bc52a02869e34e9873cb1) switched from RUNNING to FINISHED.
[CHAIN MapPartition (MapPartition at [6]{Map(<lambda at external_test.py:212>), Map(<lambda at external_test.py:213>), assert_that}) -> FlatMap (FlatMap at ExtractOutput[0]) (1/2)] INFO org.apache.flink.runtime.taskmanager.Task - Freeing task resources for CHAIN MapPartition (MapPartition at [6]{Map(<lambda at external_test.py:212>), Map(<lambda at external_test.py:213>), assert_that}) -> FlatMap (FlatMap at ExtractOutput[0]) (1/2) (f6d7ed59d32bc52a02869e34e9873cb1).
[CHAIN MapPartition (MapPartition at [6]{Map(<lambda at external_test.py:212>), Map(<lambda at external_test.py:213>), assert_that}) -> FlatMap (FlatMap at ExtractOutput[0]) (1/2)] INFO org.apache.flink.runtime.taskmanager.Task - Ensuring all FileSystem streams are closed for task CHAIN MapPartition (MapPartition at [6]{Map(<lambda at external_test.py:212>), Map(<lambda at external_test.py:213>), assert_that}) -> FlatMap (FlatMap at ExtractOutput[0]) (1/2) (f6d7ed59d32bc52a02869e34e9873cb1) [FINISHED]
[flink-akka.actor.default-dispatcher-7] INFO org.apache.flink.runtime.taskexecutor.TaskExecutor - Un-registering task and sending final execution state FINISHED to JobManager for task CHAIN MapPartition (MapPartition at [6]{Map(<lambda at external_test.py:212>), Map(<lambda at external_test.py:213>), assert_that}) -> FlatMap (FlatMap at ExtractOutput[0]) f6d7ed59d32bc52a02869e34e9873cb1.
[jobmanager-future-thread-8] INFO org.apache.flink.runtime.executiongraph.ExecutionGraph - GroupReduce (GroupReduce at assert_that/Group/GroupByKey) (1/2) (0d3cc2bf662f7f134a27038e217aa112) switched from CREATED to SCHEDULED.
[jobmanager-future-thread-6] INFO org.apache.flink.runtime.executiongraph.ExecutionGraph - GroupReduce (GroupReduce at assert_that/Group/GroupByKey) (2/2) (45e83947930008d1f7b0a05fc21feb02) switched from CREATED to SCHEDULED.
[flink-akka.actor.default-dispatcher-9] INFO org.apache.flink.runtime.executiongraph.ExecutionGraph - GroupReduce (GroupReduce at assert_that/Group/GroupByKey) (1/2) (0d3cc2bf662f7f134a27038e217aa112) switched from SCHEDULED to DEPLOYING.
[flink-akka.actor.default-dispatcher-2] INFO org.apache.flink.runtime.executiongraph.ExecutionGraph - GroupReduce (GroupReduce at assert_that/Group/GroupByKey) (2/2) (45e83947930008d1f7b0a05fc21feb02) switched from SCHEDULED to DEPLOYING.
[flink-akka.actor.default-dispatcher-9] INFO org.apache.flink.runtime.executiongraph.ExecutionGraph - Deploying GroupReduce (GroupReduce at assert_that/Group/GroupByKey) (1/2) (attempt #0) to localhost
[flink-akka.actor.default-dispatcher-2] INFO org.apache.flink.runtime.executiongraph.ExecutionGraph - Deploying GroupReduce (GroupReduce at assert_that/Group/GroupByKey) (2/2) (attempt #0) to localhost
[flink-akka.actor.default-dispatcher-7] INFO org.apache.flink.runtime.executiongraph.ExecutionGraph - CHAIN MapPartition (MapPartition at [6]{Map(<lambda at external_test.py:212>), Map(<lambda at external_test.py:213>), assert_that}) -> FlatMap (FlatMap at ExtractOutput[0]) (1/2) (f6d7ed59d32bc52a02869e34e9873cb1) switched from RUNNING to FINISHED.
[flink-akka.actor.default-dispatcher-8] INFO org.apache.flink.runtime.taskexecutor.TaskExecutor - Received task GroupReduce (GroupReduce at assert_that/Group/GroupByKey) (1/2).
[GroupReduce (GroupReduce at assert_that/Group/GroupByKey) (1/2)] INFO org.apache.flink.runtime.taskmanager.Task - GroupReduce (GroupReduce at assert_that/Group/GroupByKey) (1/2) (0d3cc2bf662f7f134a27038e217aa112) switched from CREATED to DEPLOYING.
[GroupReduce (GroupReduce at assert_that/Group/GroupByKey) (1/2)] INFO org.apache.flink.runtime.taskmanager.Task - Creating FileSystem stream leak safety net for task GroupReduce (GroupReduce at assert_that/Group/GroupByKey) (1/2) (0d3cc2bf662f7f134a27038e217aa112) [DEPLOYING]
[GroupReduce (GroupReduce at assert_that/Group/GroupByKey) (1/2)] INFO org.apache.flink.runtime.taskmanager.Task - Loading JAR files for task GroupReduce (GroupReduce at assert_that/Group/GroupByKey) (1/2) (0d3cc2bf662f7f134a27038e217aa112) [DEPLOYING].
[GroupReduce (GroupReduce at assert_that/Group/GroupByKey) (1/2)] INFO org.apache.flink.runtime.taskmanager.Task - Registering task at network: GroupReduce (GroupReduce at assert_that/Group/GroupByKey) (1/2) (0d3cc2bf662f7f134a27038e217aa112) [DEPLOYING].
[GroupReduce (GroupReduce at assert_that/Group/GroupByKey) (1/2)] INFO org.apache.flink.runtime.taskmanager.Task - GroupReduce (GroupReduce at assert_that/Group/GroupByKey) (1/2) (0d3cc2bf662f7f134a27038e217aa112) switched from DEPLOYING to RUNNING.
[flink-akka.actor.default-dispatcher-9] INFO org.apache.flink.runtime.executiongraph.ExecutionGraph - GroupReduce (GroupReduce at assert_that/Group/GroupByKey) (1/2) (0d3cc2bf662f7f134a27038e217aa112) switched from DEPLOYING to RUNNING.
[flink-akka.actor.default-dispatcher-8] INFO org.apache.flink.runtime.taskexecutor.TaskExecutor - Received task GroupReduce (GroupReduce at assert_that/Group/GroupByKey) (2/2).
[GroupReduce (GroupReduce at assert_that/Group/GroupByKey) (2/2)] INFO org.apache.flink.runtime.taskmanager.Task - GroupReduce (GroupReduce at assert_that/Group/GroupByKey) (2/2) (45e83947930008d1f7b0a05fc21feb02) switched from CREATED to DEPLOYING.
[GroupReduce (GroupReduce at assert_that/Group/GroupByKey) (2/2)] INFO org.apache.flink.runtime.taskmanager.Task - Creating FileSystem stream leak safety net for task GroupReduce (GroupReduce at assert_that/Group/GroupByKey) (2/2) (45e83947930008d1f7b0a05fc21feb02) [DEPLOYING]
[GroupReduce (GroupReduce at assert_that/Group/GroupByKey) (2/2)] INFO org.apache.flink.runtime.taskmanager.Task - Loading JAR files for task GroupReduce (GroupReduce at assert_that/Group/GroupByKey) (2/2) (45e83947930008d1f7b0a05fc21feb02) [DEPLOYING].
[GroupReduce (GroupReduce at assert_that/Group/GroupByKey) (2/2)] INFO org.apache.flink.runtime.taskmanager.Task - Registering task at network: GroupReduce (GroupReduce at assert_that/Group/GroupByKey) (2/2) (45e83947930008d1f7b0a05fc21feb02) [DEPLOYING].
[GroupReduce (GroupReduce at assert_that/Group/GroupByKey) (2/2)] INFO org.apache.flink.runtime.taskmanager.Task - GroupReduce (GroupReduce at assert_that/Group/GroupByKey) (2/2) (45e83947930008d1f7b0a05fc21feb02) switched from DEPLOYING to RUNNING.
[flink-akka.actor.default-dispatcher-9] INFO org.apache.flink.runtime.executiongraph.ExecutionGraph - GroupReduce (GroupReduce at assert_that/Group/GroupByKey) (2/2) (45e83947930008d1f7b0a05fc21feb02) switched from DEPLOYING to RUNNING.
[CHAIN MapPartition (MapPartition at [6]{Map(<lambda at external_test.py:212>), Map(<lambda at external_test.py:213>), assert_that}) -> FlatMap (FlatMap at ExtractOutput[0]) (2/2)] INFO org.apache.flink.runtime.taskmanager.Task - CHAIN MapPartition (MapPartition at [6]{Map(<lambda at external_test.py:212>), Map(<lambda at external_test.py:213>), assert_that}) -> FlatMap (FlatMap at ExtractOutput[0]) (2/2) (a7dd83e7d4b6766e321b4ce15bbab8ab) switched from RUNNING to FINISHED.
[CHAIN MapPartition (MapPartition at [6]{Map(<lambda at external_test.py:212>), Map(<lambda at external_test.py:213>), assert_that}) -> FlatMap (FlatMap at ExtractOutput[0]) (2/2)] INFO org.apache.flink.runtime.taskmanager.Task - Freeing task resources for CHAIN MapPartition (MapPartition at [6]{Map(<lambda at external_test.py:212>), Map(<lambda at external_test.py:213>), assert_that}) -> FlatMap (FlatMap at ExtractOutput[0]) (2/2) (a7dd83e7d4b6766e321b4ce15bbab8ab).
[CHAIN Filter (UnionFixFilter) -> Map (Key Extractor) -> GroupCombine (GroupCombine at GroupCombine: assert_that/Group/GroupByKey) -> Map (Key Extractor) (1/2)] INFO org.apache.flink.runtime.taskmanager.Task - CHAIN Filter (UnionFixFilter) -> Map (Key Extractor) -> GroupCombine (GroupCombine at GroupCombine: assert_that/Group/GroupByKey) -> Map (Key Extractor) (1/2) (611acec66121f58e8c4d1385e458d018) switched from RUNNING to FINISHED.
[CHAIN Filter (UnionFixFilter) -> Map (Key Extractor) -> GroupCombine (GroupCombine at GroupCombine: assert_that/Group/GroupByKey) -> Map (Key Extractor) (1/2)] INFO org.apache.flink.runtime.taskmanager.Task - Freeing task resources for CHAIN Filter (UnionFixFilter) -> Map (Key Extractor) -> GroupCombine (GroupCombine at GroupCombine: assert_that/Group/GroupByKey) -> Map (Key Extractor) (1/2) (611acec66121f58e8c4d1385e458d018).
[CHAIN Filter (UnionFixFilter) -> Map (Key Extractor) -> GroupCombine (GroupCombine at GroupCombine: assert_that/Group/GroupByKey) -> Map (Key Extractor) (2/2)] INFO org.apache.flink.runtime.taskmanager.Task - CHAIN Filter (UnionFixFilter) -> Map (Key Extractor) -> GroupCombine (GroupCombine at GroupCombine: assert_that/Group/GroupByKey) -> Map (Key Extractor) (2/2) (6942249d36027284cd1f97cefed154b3) switched from RUNNING to FINISHED.
[CHAIN Filter (UnionFixFilter) -> Map (Key Extractor) -> GroupCombine (GroupCombine at GroupCombine: assert_that/Group/GroupByKey) -> Map (Key Extractor) (2/2)] INFO org.apache.flink.runtime.taskmanager.Task - Freeing task resources for CHAIN Filter (UnionFixFilter) -> Map (Key Extractor) -> GroupCombine (GroupCombine at GroupCombine: assert_that/Group/GroupByKey) -> Map (Key Extractor) (2/2) (6942249d36027284cd1f97cefed154b3).
[CHAIN MapPartition (MapPartition at [6]{Map(<lambda at external_test.py:212>), Map(<lambda at external_test.py:213>), assert_that}) -> FlatMap (FlatMap at ExtractOutput[0]) (2/2)] INFO org.apache.flink.runtime.taskmanager.Task - Ensuring all FileSystem streams are closed for task CHAIN MapPartition (MapPartition at [6]{Map(<lambda at external_test.py:212>), Map(<lambda at external_test.py:213>), assert_that}) -> FlatMap (FlatMap at ExtractOutput[0]) (2/2) (a7dd83e7d4b6766e321b4ce15bbab8ab) [FINISHED]
[flink-akka.actor.default-dispatcher-7] INFO org.apache.flink.runtime.taskexecutor.TaskExecutor - Un-registering task and sending final execution state FINISHED to JobManager for task CHAIN MapPartition (MapPartition at [6]{Map(<lambda at external_test.py:212>), Map(<lambda at external_test.py:213>), assert_that}) -> FlatMap (FlatMap at ExtractOutput[0]) a7dd83e7d4b6766e321b4ce15bbab8ab.
[flink-akka.actor.default-dispatcher-2] INFO org.apache.flink.runtime.executiongraph.ExecutionGraph - CHAIN MapPartition (MapPartition at [6]{Map(<lambda at external_test.py:212>), Map(<lambda at external_test.py:213>), assert_that}) -> FlatMap (FlatMap at ExtractOutput[0]) (2/2) (a7dd83e7d4b6766e321b4ce15bbab8ab) switched from RUNNING to FINISHED.
[CHAIN Filter (UnionFixFilter) -> Map (Key Extractor) -> GroupCombine (GroupCombine at GroupCombine: assert_that/Group/GroupByKey) -> Map (Key Extractor) (2/2)] INFO org.apache.flink.runtime.taskmanager.Task - Ensuring all FileSystem streams are closed for task CHAIN Filter (UnionFixFilter) -> Map (Key Extractor) -> GroupCombine (GroupCombine at GroupCombine: assert_that/Group/GroupByKey) -> Map (Key Extractor) (2/2) (6942249d36027284cd1f97cefed154b3) [FINISHED]
[CHAIN Filter (UnionFixFilter) -> Map (Key Extractor) -> GroupCombine (GroupCombine at GroupCombine: assert_that/Group/GroupByKey) -> Map (Key Extractor) (1/2)] INFO org.apache.flink.runtime.taskmanager.Task - Ensuring all FileSystem streams are closed for task CHAIN Filter (UnionFixFilter) -> Map (Key Extractor) -> GroupCombine (GroupCombine at GroupCombine: assert_that/Group/GroupByKey) -> Map (Key Extractor) (1/2) (611acec66121f58e8c4d1385e458d018) [FINISHED]
[flink-akka.actor.default-dispatcher-2] INFO org.apache.flink.runtime.taskexecutor.TaskExecutor - Un-registering task and sending final execution state FINISHED to JobManager for task CHAIN Filter (UnionFixFilter) -> Map (Key Extractor) -> GroupCombine (GroupCombine at GroupCombine: assert_that/Group/GroupByKey) -> Map (Key Extractor) 6942249d36027284cd1f97cefed154b3.
[flink-akka.actor.default-dispatcher-2] INFO org.apache.flink.runtime.taskexecutor.TaskExecutor - Un-registering task and sending final execution state FINISHED to JobManager for task CHAIN Filter (UnionFixFilter) -> Map (Key Extractor) -> GroupCombine (GroupCombine at GroupCombine: assert_that/Group/GroupByKey) -> Map (Key Extractor) 611acec66121f58e8c4d1385e458d018.
[flink-akka.actor.default-dispatcher-7] INFO org.apache.flink.runtime.executiongraph.ExecutionGraph - CHAIN Filter (UnionFixFilter) -> Map (Key Extractor) -> GroupCombine (GroupCombine at GroupCombine: assert_that/Group/GroupByKey) -> Map (Key Extractor) (2/2) (6942249d36027284cd1f97cefed154b3) switched from RUNNING to FINISHED.
[jobmanager-future-thread-13] INFO org.apache.flink.runtime.executiongraph.ExecutionGraph - MapPartition (MapPartition at [3]assert_that/{Group, Unkey, Match}) (2/2) (ec40c0be3bc9dec6bdb4357a23c8ae08) switched from CREATED to SCHEDULED.
[flink-akka.actor.default-dispatcher-7] INFO org.apache.flink.runtime.executiongraph.ExecutionGraph - CHAIN Filter (UnionFixFilter) -> Map (Key Extractor) -> GroupCombine (GroupCombine at GroupCombine: assert_that/Group/GroupByKey) -> Map (Key Extractor) (1/2) (611acec66121f58e8c4d1385e458d018) switched from RUNNING to FINISHED.
[flink-akka.actor.default-dispatcher-9] INFO org.apache.flink.runtime.executiongraph.ExecutionGraph - MapPartition (MapPartition at [3]assert_that/{Group, Unkey, Match}) (2/2) (ec40c0be3bc9dec6bdb4357a23c8ae08) switched from SCHEDULED to DEPLOYING.
[flink-akka.actor.default-dispatcher-9] INFO org.apache.flink.runtime.executiongraph.ExecutionGraph - Deploying MapPartition (MapPartition at [3]assert_that/{Group, Unkey, Match}) (2/2) (attempt #0) to localhost
[flink-akka.actor.default-dispatcher-8] INFO org.apache.flink.runtime.taskexecutor.TaskExecutor - Received task MapPartition (MapPartition at [3]assert_that/{Group, Unkey, Match}) (2/2).
[MapPartition (MapPartition at [3]assert_that/{Group, Unkey, Match}) (2/2)] INFO org.apache.flink.runtime.taskmanager.Task - MapPartition (MapPartition at [3]assert_that/{Group, Unkey, Match}) (2/2) (ec40c0be3bc9dec6bdb4357a23c8ae08) switched from CREATED to DEPLOYING.
[MapPartition (MapPartition at [3]assert_that/{Group, Unkey, Match}) (2/2)] INFO org.apache.flink.runtime.taskmanager.Task - Creating FileSystem stream leak safety net for task MapPartition (MapPartition at [3]assert_that/{Group, Unkey, Match}) (2/2) (ec40c0be3bc9dec6bdb4357a23c8ae08) [DEPLOYING]
[MapPartition (MapPartition at [3]assert_that/{Group, Unkey, Match}) (2/2)] INFO org.apache.flink.runtime.taskmanager.Task - Loading JAR files for task MapPartition (MapPartition at [3]assert_that/{Group, Unkey, Match}) (2/2) (ec40c0be3bc9dec6bdb4357a23c8ae08) [DEPLOYING].
[MapPartition (MapPartition at [3]assert_that/{Group, Unkey, Match}) (2/2)] INFO org.apache.flink.runtime.taskmanager.Task - Registering task at network: MapPartition (MapPartition at [3]assert_that/{Group, Unkey, Match}) (2/2) (ec40c0be3bc9dec6bdb4357a23c8ae08) [DEPLOYING].
[MapPartition (MapPartition at [3]assert_that/{Group, Unkey, Match}) (2/2)] INFO org.apache.flink.runtime.taskmanager.Task - MapPartition (MapPartition at [3]assert_that/{Group, Unkey, Match}) (2/2) (ec40c0be3bc9dec6bdb4357a23c8ae08) switched from DEPLOYING to RUNNING.
[flink-akka.actor.default-dispatcher-8] INFO org.apache.flink.runtime.executiongraph.ExecutionGraph - MapPartition (MapPartition at [3]assert_that/{Group, Unkey, Match}) (2/2) (ec40c0be3bc9dec6bdb4357a23c8ae08) switched from DEPLOYING to RUNNING.
[grpc-default-executor-1] WARN bundle_processor.create_operation - No unique name set for transform fn/read/ref_PCollection_PCollection_27:0 
[GroupReduce (GroupReduce at assert_that/Group/GroupByKey) (2/2)] INFO org.apache.flink.runtime.taskmanager.Task - GroupReduce (GroupReduce at assert_that/Group/GroupByKey) (2/2) (45e83947930008d1f7b0a05fc21feb02) switched from RUNNING to FINISHED.
[GroupReduce (GroupReduce at assert_that/Group/GroupByKey) (2/2)] INFO org.apache.flink.runtime.taskmanager.Task - Freeing task resources for GroupReduce (GroupReduce at assert_that/Group/GroupByKey) (2/2) (45e83947930008d1f7b0a05fc21feb02).
[GroupReduce (GroupReduce at assert_that/Group/GroupByKey) (2/2)] INFO org.apache.flink.runtime.taskmanager.Task - Ensuring all FileSystem streams are closed for task GroupReduce (GroupReduce at assert_that/Group/GroupByKey) (2/2) (45e83947930008d1f7b0a05fc21feb02) [FINISHED]
[GroupReduce (GroupReduce at assert_that/Group/GroupByKey) (1/2)] INFO org.apache.flink.runtime.taskmanager.Task - GroupReduce (GroupReduce at assert_that/Group/GroupByKey) (1/2) (0d3cc2bf662f7f134a27038e217aa112) switched from RUNNING to FINISHED.
[GroupReduce (GroupReduce at assert_that/Group/GroupByKey) (1/2)] INFO org.apache.flink.runtime.taskmanager.Task - Freeing task resources for GroupReduce (GroupReduce at assert_that/Group/GroupByKey) (1/2) (0d3cc2bf662f7f134a27038e217aa112).
[flink-akka.actor.default-dispatcher-2] INFO org.apache.flink.runtime.taskexecutor.TaskExecutor - Un-registering task and sending final execution state FINISHED to JobManager for task GroupReduce (GroupReduce at assert_that/Group/GroupByKey) 45e83947930008d1f7b0a05fc21feb02.
[GroupReduce (GroupReduce at assert_that/Group/GroupByKey) (1/2)] INFO org.apache.flink.runtime.taskmanager.Task - Ensuring all FileSystem streams are closed for task GroupReduce (GroupReduce at assert_that/Group/GroupByKey) (1/2) (0d3cc2bf662f7f134a27038e217aa112) [FINISHED]
[jobmanager-future-thread-4] INFO org.apache.flink.runtime.executiongraph.ExecutionGraph - MapPartition (MapPartition at [3]assert_that/{Group, Unkey, Match}) (1/2) (4e9171fa8ced802350b5e42324505942) switched from CREATED to SCHEDULED.
[flink-akka.actor.default-dispatcher-2] INFO org.apache.flink.runtime.taskexecutor.TaskExecutor - Un-registering task and sending final execution state FINISHED to JobManager for task GroupReduce (GroupReduce at assert_that/Group/GroupByKey) 0d3cc2bf662f7f134a27038e217aa112.
[flink-akka.actor.default-dispatcher-9] INFO org.apache.flink.runtime.executiongraph.ExecutionGraph - GroupReduce (GroupReduce at assert_that/Group/GroupByKey) (2/2) (45e83947930008d1f7b0a05fc21feb02) switched from RUNNING to FINISHED.
[flink-akka.actor.default-dispatcher-2] INFO org.apache.flink.runtime.executiongraph.ExecutionGraph - MapPartition (MapPartition at [3]assert_that/{Group, Unkey, Match}) (1/2) (4e9171fa8ced802350b5e42324505942) switched from SCHEDULED to DEPLOYING.
[flink-akka.actor.default-dispatcher-2] INFO org.apache.flink.runtime.executiongraph.ExecutionGraph - Deploying MapPartition (MapPartition at [3]assert_that/{Group, Unkey, Match}) (1/2) (attempt #0) to localhost
[flink-akka.actor.default-dispatcher-9] INFO org.apache.flink.runtime.executiongraph.ExecutionGraph - GroupReduce (GroupReduce at assert_that/Group/GroupByKey) (1/2) (0d3cc2bf662f7f134a27038e217aa112) switched from RUNNING to FINISHED.
[flink-akka.actor.default-dispatcher-7] INFO org.apache.flink.runtime.taskexecutor.TaskExecutor - Received task MapPartition (MapPartition at [3]assert_that/{Group, Unkey, Match}) (1/2).
[MapPartition (MapPartition at [3]assert_that/{Group, Unkey, Match}) (1/2)] INFO org.apache.flink.runtime.taskmanager.Task - MapPartition (MapPartition at [3]assert_that/{Group, Unkey, Match}) (1/2) (4e9171fa8ced802350b5e42324505942) switched from CREATED to DEPLOYING.
[MapPartition (MapPartition at [3]assert_that/{Group, Unkey, Match}) (1/2)] INFO org.apache.flink.runtime.taskmanager.Task - Creating FileSystem stream leak safety net for task MapPartition (MapPartition at [3]assert_that/{Group, Unkey, Match}) (1/2) (4e9171fa8ced802350b5e42324505942) [DEPLOYING]
[MapPartition (MapPartition at [3]assert_that/{Group, Unkey, Match}) (1/2)] INFO org.apache.flink.runtime.taskmanager.Task - Loading JAR files for task MapPartition (MapPartition at [3]assert_that/{Group, Unkey, Match}) (1/2) (4e9171fa8ced802350b5e42324505942) [DEPLOYING].
[MapPartition (MapPartition at [3]assert_that/{Group, Unkey, Match}) (1/2)] INFO org.apache.flink.runtime.taskmanager.Task - Registering task at network: MapPartition (MapPartition at [3]assert_that/{Group, Unkey, Match}) (1/2) (4e9171fa8ced802350b5e42324505942) [DEPLOYING].
[MapPartition (MapPartition at [3]assert_that/{Group, Unkey, Match}) (1/2)] INFO org.apache.flink.runtime.taskmanager.Task - MapPartition (MapPartition at [3]assert_that/{Group, Unkey, Match}) (1/2) (4e9171fa8ced802350b5e42324505942) switched from DEPLOYING to RUNNING.
[flink-akka.actor.default-dispatcher-7] INFO org.apache.flink.runtime.executiongraph.ExecutionGraph - MapPartition (MapPartition at [3]assert_that/{Group, Unkey, Match}) (1/2) (4e9171fa8ced802350b5e42324505942) switched from DEPLOYING to RUNNING.
[MapPartition (MapPartition at [3]assert_that/{Group, Unkey, Match}) (2/2)] INFO org.apache.flink.runtime.taskmanager.Task - MapPartition (MapPartition at [3]assert_that/{Group, Unkey, Match}) (2/2) (ec40c0be3bc9dec6bdb4357a23c8ae08) switched from RUNNING to FINISHED.
[MapPartition (MapPartition at [3]assert_that/{Group, Unkey, Match}) (2/2)] INFO org.apache.flink.runtime.taskmanager.Task - Freeing task resources for MapPartition (MapPartition at [3]assert_that/{Group, Unkey, Match}) (2/2) (ec40c0be3bc9dec6bdb4357a23c8ae08).
[MapPartition (MapPartition at [3]assert_that/{Group, Unkey, Match}) (2/2)] INFO org.apache.flink.runtime.taskmanager.Task - Ensuring all FileSystem streams are closed for task MapPartition (MapPartition at [3]assert_that/{Group, Unkey, Match}) (2/2) (ec40c0be3bc9dec6bdb4357a23c8ae08) [FINISHED]
[jobmanager-future-thread-14] INFO org.apache.flink.runtime.executiongraph.ExecutionGraph - DataSink (DiscardingOutput) (2/2) (bf47841b8c3ffe49c008c04d1177c17d) switched from CREATED to SCHEDULED.
[flink-akka.actor.default-dispatcher-8] INFO org.apache.flink.runtime.taskexecutor.TaskExecutor - Un-registering task and sending final execution state FINISHED to JobManager for task MapPartition (MapPartition at [3]assert_that/{Group, Unkey, Match}) ec40c0be3bc9dec6bdb4357a23c8ae08.
[flink-akka.actor.default-dispatcher-9] INFO org.apache.flink.runtime.executiongraph.ExecutionGraph - DataSink (DiscardingOutput) (2/2) (bf47841b8c3ffe49c008c04d1177c17d) switched from SCHEDULED to DEPLOYING.
[flink-akka.actor.default-dispatcher-9] INFO org.apache.flink.runtime.executiongraph.ExecutionGraph - Deploying DataSink (DiscardingOutput) (2/2) (attempt #0) to localhost
[flink-akka.actor.default-dispatcher-8] INFO org.apache.flink.runtime.taskexecutor.TaskExecutor - Received task DataSink (DiscardingOutput) (2/2).
[flink-akka.actor.default-dispatcher-9] INFO org.apache.flink.runtime.executiongraph.ExecutionGraph - MapPartition (MapPartition at [3]assert_that/{Group, Unkey, Match}) (2/2) (ec40c0be3bc9dec6bdb4357a23c8ae08) switched from RUNNING to FINISHED.
[DataSink (DiscardingOutput) (2/2)] INFO org.apache.flink.runtime.taskmanager.Task - DataSink (DiscardingOutput) (2/2) (bf47841b8c3ffe49c008c04d1177c17d) switched from CREATED to DEPLOYING.
[DataSink (DiscardingOutput) (2/2)] INFO org.apache.flink.runtime.taskmanager.Task - Creating FileSystem stream leak safety net for task DataSink (DiscardingOutput) (2/2) (bf47841b8c3ffe49c008c04d1177c17d) [DEPLOYING]
[DataSink (DiscardingOutput) (2/2)] INFO org.apache.flink.runtime.taskmanager.Task - Loading JAR files for task DataSink (DiscardingOutput) (2/2) (bf47841b8c3ffe49c008c04d1177c17d) [DEPLOYING].
[DataSink (DiscardingOutput) (2/2)] INFO org.apache.flink.runtime.taskmanager.Task - Registering task at network: DataSink (DiscardingOutput) (2/2) (bf47841b8c3ffe49c008c04d1177c17d) [DEPLOYING].
[DataSink (DiscardingOutput) (2/2)] INFO org.apache.flink.runtime.taskmanager.Task - DataSink (DiscardingOutput) (2/2) (bf47841b8c3ffe49c008c04d1177c17d) switched from DEPLOYING to RUNNING.
[flink-akka.actor.default-dispatcher-9] INFO org.apache.flink.runtime.executiongraph.ExecutionGraph - DataSink (DiscardingOutput) (2/2) (bf47841b8c3ffe49c008c04d1177c17d) switched from DEPLOYING to RUNNING.
[DataSink (DiscardingOutput) (2/2)] INFO org.apache.flink.runtime.taskmanager.Task - DataSink (DiscardingOutput) (2/2) (bf47841b8c3ffe49c008c04d1177c17d) switched from RUNNING to FINISHED.
[DataSink (DiscardingOutput) (2/2)] INFO org.apache.flink.runtime.taskmanager.Task - Freeing task resources for DataSink (DiscardingOutput) (2/2) (bf47841b8c3ffe49c008c04d1177c17d).
[DataSink (DiscardingOutput) (2/2)] INFO org.apache.flink.runtime.taskmanager.Task - Ensuring all FileSystem streams are closed for task DataSink (DiscardingOutput) (2/2) (bf47841b8c3ffe49c008c04d1177c17d) [FINISHED]
[flink-akka.actor.default-dispatcher-7] INFO org.apache.flink.runtime.taskexecutor.TaskExecutor - Un-registering task and sending final execution state FINISHED to JobManager for task DataSink (DiscardingOutput) bf47841b8c3ffe49c008c04d1177c17d.
[flink-akka.actor.default-dispatcher-7] INFO org.apache.flink.runtime.executiongraph.ExecutionGraph - DataSink (DiscardingOutput) (2/2) (bf47841b8c3ffe49c008c04d1177c17d) switched from RUNNING to FINISHED.
[grpc-default-executor-1] WARN bundle_processor.create_operation - No unique name set for transform fn/read/ref_PCollection_PCollection_27:0 
[MapPartition (MapPartition at [3]assert_that/{Group, Unkey, Match}) (1/2)] INFO org.apache.flink.runtime.taskmanager.Task - MapPartition (MapPartition at [3]assert_that/{Group, Unkey, Match}) (1/2) (4e9171fa8ced802350b5e42324505942) switched from RUNNING to FINISHED.
[MapPartition (MapPartition at [3]assert_that/{Group, Unkey, Match}) (1/2)] INFO org.apache.flink.runtime.taskmanager.Task - Freeing task resources for MapPartition (MapPartition at [3]assert_that/{Group, Unkey, Match}) (1/2) (4e9171fa8ced802350b5e42324505942).
[jobmanager-future-thread-8] INFO org.apache.flink.runtime.executiongraph.ExecutionGraph - DataSink (DiscardingOutput) (1/2) (ae67552edb2577d30790f65ce610fbb1) switched from CREATED to SCHEDULED.
[MapPartition (MapPartition at [3]assert_that/{Group, Unkey, Match}) (1/2)] INFO org.apache.flink.runtime.taskmanager.Task - Ensuring all FileSystem streams are closed for task MapPartition (MapPartition at [3]assert_that/{Group, Unkey, Match}) (1/2) (4e9171fa8ced802350b5e42324505942) [FINISHED]
[flink-akka.actor.default-dispatcher-7] INFO org.apache.flink.runtime.taskexecutor.TaskExecutor - Un-registering task and sending final execution state FINISHED to JobManager for task MapPartition (MapPartition at [3]assert_that/{Group, Unkey, Match}) 4e9171fa8ced802350b5e42324505942.
[flink-akka.actor.default-dispatcher-2] INFO org.apache.flink.runtime.executiongraph.ExecutionGraph - DataSink (DiscardingOutput) (1/2) (ae67552edb2577d30790f65ce610fbb1) switched from SCHEDULED to DEPLOYING.
[flink-akka.actor.default-dispatcher-2] INFO org.apache.flink.runtime.executiongraph.ExecutionGraph - Deploying DataSink (DiscardingOutput) (1/2) (attempt #0) to localhost
[flink-akka.actor.default-dispatcher-7] INFO org.apache.flink.runtime.taskexecutor.TaskExecutor - Received task DataSink (DiscardingOutput) (1/2).
[flink-akka.actor.default-dispatcher-2] INFO org.apache.flink.runtime.executiongraph.ExecutionGraph - MapPartition (MapPartition at [3]assert_that/{Group, Unkey, Match}) (1/2) (4e9171fa8ced802350b5e42324505942) switched from RUNNING to FINISHED.
[DataSink (DiscardingOutput) (1/2)] INFO org.apache.flink.runtime.taskmanager.Task - DataSink (DiscardingOutput) (1/2) (ae67552edb2577d30790f65ce610fbb1) switched from CREATED to DEPLOYING.
[DataSink (DiscardingOutput) (1/2)] INFO org.apache.flink.runtime.taskmanager.Task - Creating FileSystem stream leak safety net for task DataSink (DiscardingOutput) (1/2) (ae67552edb2577d30790f65ce610fbb1) [DEPLOYING]
[DataSink (DiscardingOutput) (1/2)] INFO org.apache.flink.runtime.taskmanager.Task - Loading JAR files for task DataSink (DiscardingOutput) (1/2) (ae67552edb2577d30790f65ce610fbb1) [DEPLOYING].
[DataSink (DiscardingOutput) (1/2)] INFO org.apache.flink.runtime.taskmanager.Task - Registering task at network: DataSink (DiscardingOutput) (1/2) (ae67552edb2577d30790f65ce610fbb1) [DEPLOYING].
[DataSink (DiscardingOutput) (1/2)] INFO org.apache.flink.runtime.taskmanager.Task - DataSink (DiscardingOutput) (1/2) (ae67552edb2577d30790f65ce610fbb1) switched from DEPLOYING to RUNNING.
[flink-akka.actor.default-dispatcher-7] INFO org.apache.flink.runtime.executiongraph.ExecutionGraph - DataSink (DiscardingOutput) (1/2) (ae67552edb2577d30790f65ce610fbb1) switched from DEPLOYING to RUNNING.
[DataSink (DiscardingOutput) (1/2)] INFO org.apache.flink.runtime.taskmanager.Task - DataSink (DiscardingOutput) (1/2) (ae67552edb2577d30790f65ce610fbb1) switched from RUNNING to FINISHED.
[DataSink (DiscardingOutput) (1/2)] INFO org.apache.flink.runtime.taskmanager.Task - Freeing task resources for DataSink (DiscardingOutput) (1/2) (ae67552edb2577d30790f65ce610fbb1).
[DataSink (DiscardingOutput) (1/2)] INFO org.apache.flink.runtime.taskmanager.Task - Ensuring all FileSystem streams are closed for task DataSink (DiscardingOutput) (1/2) (ae67552edb2577d30790f65ce610fbb1) [FINISHED]
[flink-akka.actor.default-dispatcher-9] INFO org.apache.flink.runtime.taskexecutor.TaskExecutor - Un-registering task and sending final execution state FINISHED to JobManager for task DataSink (DiscardingOutput) ae67552edb2577d30790f65ce610fbb1.
[flink-akka.actor.default-dispatcher-9] INFO org.apache.flink.runtime.executiongraph.ExecutionGraph - DataSink (DiscardingOutput) (1/2) (ae67552edb2577d30790f65ce610fbb1) switched from RUNNING to FINISHED.
[flink-akka.actor.default-dispatcher-9] INFO org.apache.flink.runtime.executiongraph.ExecutionGraph - Job BeamApp-root-0703004831-e86ee2e7 (6e8b0416cd060da174eab9ab645bcd98) switched from state RUNNING to FINISHED.
[flink-akka.actor.default-dispatcher-7] INFO org.apache.flink.runtime.dispatcher.StandaloneDispatcher - Job 6e8b0416cd060da174eab9ab645bcd98 reached globally terminal state FINISHED.
[flink-akka.actor.default-dispatcher-9] INFO org.apache.flink.runtime.jobmaster.JobMaster - Stopping the JobMaster for job BeamApp-root-0703004831-e86ee2e7(6e8b0416cd060da174eab9ab645bcd98).
[flink-runner-job-invoker] INFO org.apache.flink.runtime.minicluster.MiniCluster - Shutting down Flink Mini Cluster
[flink-runner-job-invoker] INFO org.apache.flink.runtime.dispatcher.DispatcherRestEndpoint - Shutting down rest endpoint.
[flink-akka.actor.default-dispatcher-8] INFO org.apache.flink.runtime.taskexecutor.TaskExecutor - Stopping TaskExecutor akka://flink/user/taskmanager_0.
[flink-akka.actor.default-dispatcher-8] INFO org.apache.flink.runtime.state.TaskExecutorLocalStateStoresManager - Shutting down TaskExecutorLocalStateStoresManager.
[flink-akka.actor.default-dispatcher-9] INFO org.apache.flink.runtime.jobmaster.JobMaster - Close ResourceManager connection d91857f3998ebc5ecddc8ba5a4fb232f: JobManager is shutting down..
[flink-akka.actor.default-dispatcher-2] INFO org.apache.flink.runtime.jobmaster.slotpool.SlotPool - Suspending SlotPool.
[flink-akka.actor.default-dispatcher-2] INFO org.apache.flink.runtime.jobmaster.slotpool.SlotPool - Stopping SlotPool.
[flink-akka.actor.default-dispatcher-7] INFO org.apache.flink.runtime.dispatcher.StandaloneDispatcher - Stopping dispatcher akka://flink/user/dispatcher3bdc68b2-ac65-44f2-8165-dfa6f504b8c1.
[flink-akka.actor.default-dispatcher-7] INFO org.apache.flink.runtime.dispatcher.StandaloneDispatcher - Stopping all currently running jobs of dispatcher akka://flink/user/dispatcher3bdc68b2-ac65-44f2-8165-dfa6f504b8c1.
[flink-akka.actor.default-dispatcher-2] INFO org.apache.flink.runtime.taskexecutor.TaskExecutor - JobManager for job 6e8b0416cd060da174eab9ab645bcd98 with leader id 8a148abf4420292916cafbcc8a1c4beb lost leadership.
[flink-akka.actor.default-dispatcher-7] INFO org.apache.flink.runtime.resourcemanager.StandaloneResourceManager - Disconnect job manager 8a148abf4420292916cafbcc8a1c4beb@akka://flink/user/jobmanager_1 for job 6e8b0416cd060da174eab9ab645bcd98 from the resource manager.
[flink-akka.actor.default-dispatcher-8] INFO org.apache.flink.runtime.io.disk.iomanager.IOManager - I/O manager removed spill file directory /tmp/flink-io-53b42137-70ce-4873-a46f-8f54b19813c8
[flink-akka.actor.default-dispatcher-8] INFO org.apache.flink.runtime.io.network.NetworkEnvironment - Shutting down the network environment and its components.
[flink-akka.actor.default-dispatcher-7] INFO org.apache.flink.runtime.rest.handler.legacy.backpressure.StackTraceSampleCoordinator - Shutting down stack trace sample coordinator.
[flink-akka.actor.default-dispatcher-7] INFO org.apache.flink.runtime.dispatcher.StandaloneDispatcher - Stopped dispatcher akka://flink/user/dispatcher3bdc68b2-ac65-44f2-8165-dfa6f504b8c1.
[flink-akka.actor.default-dispatcher-2] INFO org.apache.flink.runtime.resourcemanager.slotmanager.SlotManager - Closing the SlotManager.
[flink-akka.actor.default-dispatcher-2] INFO org.apache.flink.runtime.resourcemanager.slotmanager.SlotManager - Suspending the SlotManager.
[ForkJoinPool.commonPool-worker-11] INFO org.apache.flink.runtime.dispatcher.DispatcherRestEndpoint - Removing cache directory /tmp/flink-web-ui
[ForkJoinPool.commonPool-worker-11] INFO org.apache.flink.runtime.dispatcher.DispatcherRestEndpoint - Shut down complete.
[flink-akka.actor.default-dispatcher-8] INFO org.apache.flink.runtime.taskexecutor.JobLeaderService - Stop job leader service.
[flink-akka.actor.default-dispatcher-8] INFO org.apache.flink.runtime.taskexecutor.TaskExecutor - Stopped TaskExecutor akka://flink/user/taskmanager_0.
[flink-akka.actor.default-dispatcher-8] INFO org.apache.flink.runtime.rpc.akka.AkkaRpcService - Stopping Akka RPC service.
[flink-akka.actor.default-dispatcher-8] INFO org.apache.flink.runtime.blob.PermanentBlobCache - Shutting down BLOB cache
[flink-akka.actor.default-dispatcher-8] INFO org.apache.flink.runtime.blob.TransientBlobCache - Shutting down BLOB cache
[flink-akka.actor.default-dispatcher-8] INFO org.apache.flink.runtime.blob.BlobServer - Stopped BLOB server at 0.0.0.0:38429
[flink-akka.actor.default-dispatcher-8] INFO org.apache.flink.runtime.rpc.akka.AkkaRpcService - Stopped Akka RPC service.
[flink-runner-job-invoker] INFO org.apache.beam.runners.flink.FlinkRunner - Execution finished in 16015 msecs
[flink-runner-job-invoker] INFO org.apache.beam.runners.flink.FlinkRunner - Final accumulator values:
[flink-runner-job-invoker] INFO org.apache.beam.runners.flink.FlinkRunner - __metricscontainers : MetricQueryResults(Counters(ref_PCollection_PCollection_14:beam:metric:pardo_execution_time:start_bundle_msecs:v1 {PTRANSFORM=ref_AppliedPTransform_assert_that/Group/Flatten_34}: 0, ref_PCollection_PCollection_27:beam:metric:pardo_execution_time:start_bundle_msecs:v1 {PTRANSFORM=fn/read/ref_PCollection_PCollection_27:0}: 0, ref_PCollection_PCollection_12:beam:metric:pardo_execution_time:finish_bundle_msecs:v1 {PTRANSFORM=ExternalTransform(pytest:beam:transforms:count)/Combine.perKey(Count)/Precombine}: 0, ref_PCollection_PCollection_9:beam:metric:pardo_execution_time:finish_bundle_msecs:v1 {PTRANSFORM=fn/read/ref_PCollection_PCollection_9:0}: 0, ref_PCollection_PCollection_9:beam:metric:pardo_execution_time:start_bundle_msecs:v1 {PTRANSFORM=fn/read/ref_PCollection_PCollection_9:0}: 0, ref_PCollection_PCollection_27:beam:metric:pardo_execution_time:finish_bundle_msecs:v1 {PTRANSFORM=fn/read/ref_PCollection_PCollection_27:0}: 0, ref_PCollection_PCollection_9:beam:metric:pardo_execution_time:process_bundle_msecs:v1 {PTRANSFORM=fn/read/ref_PCollection_PCollection_9:0}: 0, ref_PCollection_PCollection_14:beam:metric:pardo_execution_time:finish_bundle_msecs:v1 {PTRANSFORM=ref_AppliedPTransform_assert_that/ToVoidKey_30}: 0, ref_PCollection_PCollection_12:beam:metric:pardo_execution_time:process_bundle_msecs:v1 {PTRANSFORM=external_2root/Init/Map/ParMultiDo(Anonymous)}: 0, ref_PCollection_PCollection_14:beam:metric:ptransform_execution_time:total_msecs:v1 {PTRANSFORM=fn/write/ref_PCollection_PCollection_24:0:0}: 0, ref_PCollection_PCollection_9:beam:metric:pardo_execution_time:finish_bundle_msecs:v1 {PTRANSFORM=fn/write/ref_PCollection_PCollection_12:0}: 0, ref_PCollection_PCollection_12:beam:metric:element_count:v1 {PCOLLECTION=pcollection}: 5, ref_PCollection_PCollection_12:beam:metric:pardo_execution_time:process_bundle_msecs:v1 {PTRANSFORM=ExternalTransform(pytest:beam:transforms:count)/Combine.perKey(Count)/Precombine}: 0, ref_PCollection_PCollection_1:beam:metric:ptransform_execution_time:total_msecs:v1 {PTRANSFORM=fn/read/ref_PCollection_PCollection_1:0}: 0, ref_PCollection_PCollection_14:beam:metric:pardo_execution_time:process_bundle_msecs:v1 {PTRANSFORM=ref_AppliedPTransform_assert_that/ToVoidKey_30}: 0, ref_PCollection_PCollection_14:beam:metric:pardo_execution_time:start_bundle_msecs:v1 {PTRANSFORM=fn/read/ref_PCollection_PCollection_14:0}: 0, ref_PCollection_PCollection_14:beam:metric:pardo_execution_time:finish_bundle_msecs:v1 {PTRANSFORM=fn/read/ref_PCollection_PCollection_14:0}: 0, ref_PCollection_PCollection_9:beam:metric:pardo_execution_time:start_bundle_msecs:v1 {PTRANSFORM=fn/write/ref_PCollection_PCollection_12:0}: 0, ref_PCollection_PCollection_14:beam:metric:pardo_execution_time:finish_bundle_msecs:v1 {PTRANSFORM=ref_AppliedPTransform_assert_that/Group/Flatten_34}: 0, ref_PCollection_PCollection_12:beam:metric:pardo_execution_time:start_bundle_msecs:v1 {PTRANSFORM=ExternalTransform(pytest:beam:transforms:count)/Combine.perKey(Count)/Precombine}: 0, ref_PCollection_PCollection_14:beam:metric:pardo_execution_time:start_bundle_msecs:v1 {PTRANSFORM=ref_AppliedPTransform_Map(<lambda at external_test.py:213>)_22}: 0, ref_PCollection_PCollection_9:beam:metric:ptransform_execution_time:total_msecs:v1 {PTRANSFORM=ref_AppliedPTransform_Create/Map(decode)_16}: 0, ref_PCollection_PCollection_17:beam:metric:element_count:v1 {PCOLLECTION=ref_PCollection_PCollection_18}: 1, ref_PCollection_PCollection_14:beam:metric:pardo_execution_time:finish_bundle_msecs:v1 {PTRANSFORM=fn/write/ref_PCollection_PCollection_24:0:0}: 0, ref_PCollection_PCollection_17:beam:metric:element_count:v1 {PCOLLECTION=ref_PCollection_PCollection_19}: 1, ref_PCollection_PCollection_17:beam:metric:ptransform_execution_time:total_msecs:v1 {PTRANSFORM=ref_AppliedPTransform_assert_that/Create/Map(decode)_28}: 0, ref_PCollection_PCollection_17:beam:metric:element_count:v1 {PCOLLECTION=ref_PCollection_PCollection_17}: 1, ref_PCollection_PCollection_14:beam:metric:pardo_execution_time:process_bundle_msecs:v1 {PTRANSFORM=fn/write/ref_PCollection_PCollection_24:0:0}: 0, ref_PCollection_PCollection_12:beam:metric:pardo_execution_time:finish_bundle_msecs:v1 {PTRANSFORM=external_2root/Init/Map/ParMultiDo(Anonymous)}: 0, ref_PCollection_PCollection_17:beam:metric:pardo_execution_time:process_bundle_msecs:v1 {PTRANSFORM=ref_AppliedPTransform_assert_that/Create/FlatMap(<lambda at core.py:2257>)_26}: 0, pcollection_1:beam:metric:pardo_execution_time:start_bundle_msecs:v1 {PTRANSFORM=fn/write/ref_PCollection_PCollection_14:0}: 0, pcollection_1:beam:metric:pardo_execution_time:finish_bundle_msecs:v1 {PTRANSFORM=fn/write/ref_PCollection_PCollection_14:0}: 0, ref_PCollection_PCollection_27:beam:metric:pardo_execution_time:start_bundle_msecs:v1 {PTRANSFORM=ref_AppliedPTransform_assert_that/Match_41}: 0, pcollection_1:beam:metric:element_count:v1 {PCOLLECTION=pcollection_1}: 3, ref_PCollection_PCollection_14:beam:metric:pardo_execution_time:process_bundle_msecs:v1 {PTRANSFORM=fn/read/ref_PCollection_PCollection_14:0}: 0, ref_PCollection_PCollection_17:beam:metric:element_count:v1 {PCOLLECTION=ref_PCollection_PCollection_24:1}: 1, ref_PCollection_PCollection_1:beam:metric:pardo_execution_time:process_bundle_msecs:v1 {PTRANSFORM=fn/write/ref_PCollection_PCollection_2:0}: 0, ref_PCollection_PCollection_27:beam:metric:pardo_execution_time:finish_bundle_msecs:v1 {PTRANSFORM=ref_AppliedPTransform_assert_that/Match_41}: 0, ref_PCollection_PCollection_1:beam:metric:element_count:v1 {PCOLLECTION=ref_PCollection_PCollection_1}: 1, ref_PCollection_PCollection_14:beam:metric:ptransform_execution_time:total_msecs:v1 {PTRANSFORM=ref_AppliedPTransform_assert_that/Group/Flatten_34}: 0, ref_PCollection_PCollection_14:beam:metric:pardo_execution_time:start_bundle_msecs:v1 {PTRANSFORM=ref_AppliedPTransform_assert_that/WindowInto(WindowIntoFn)_29}: 0, ref_PCollection_PCollection_14:beam:metric:pardo_execution_time:start_bundle_msecs:v1 {PTRANSFORM=ref_AppliedPTransform_assert_that/ToVoidKey_30}: 0, ref_PCollection_PCollection_1:beam:metric:element_count:v1 {PCOLLECTION=ref_PCollection_PCollection_2}: 12, pcollection_1:beam:metric:element_count:v1 {PCOLLECTION=pcollection_2}: 3, ref_PCollection_PCollection_17:beam:metric:ptransform_execution_time:total_msecs:v1 {PTRANSFORM=ref_AppliedPTransform_assert_that/Create/FlatMap(<lambda at core.py:2257>)_26}: 0, ref_PCollection_PCollection_27:beam:metric:element_count:v1 {PCOLLECTION=ref_PCollection_PCollection_30}: 1, ref_PCollection_PCollection_14:beam:metric:pardo_execution_time:finish_bundle_msecs:v1 {PTRANSFORM=ref_AppliedPTransform_Map(<lambda at external_test.py:213>)_22}: 0, ref_PCollection_PCollection_14:beam:metric:pardo_execution_time:process_bundle_msecs:v1 {PTRANSFORM=ref_AppliedPTransform_Map(<lambda at external_test.py:213>)_22}: 0, ref_PCollection_PCollection_14:beam:metric:pardo_execution_time:process_bundle_msecs:v1 {PTRANSFORM=ref_AppliedPTransform_assert_that/Group/Flatten_34}: 0, ref_PCollection_PCollection_14:beam:metric:ptransform_execution_time:total_msecs:v1 {PTRANSFORM=fn/read/ref_PCollection_PCollection_14:0}: 0, ref_PCollection_PCollection_14:beam:metric:pardo_execution_time:process_bundle_msecs:v1 {PTRANSFORM=ref_AppliedPTransform_assert_that/WindowInto(WindowIntoFn)_29}: 0, pcollection_1:beam:metric:pardo_execution_time:finish_bundle_msecs:v1 {PTRANSFORM=fn/read/pcollection_1:0}: 0, ref_PCollection_PCollection_17:beam:metric:ptransform_execution_time:total_msecs:v1 {PTRANSFORM=ref_AppliedPTransform_assert_that/Group/pair_with_0_32}: 0, ref_PCollection_PCollection_17:beam:metric:ptransform_execution_time:total_msecs:v1 {PTRANSFORM=fn/write/ref_PCollection_PCollection_24:1:0}: 0, ref_PCollection_PCollection_9:beam:metric:pardo_execution_time:process_bundle_msecs:v1 {PTRANSFORM=ref_AppliedPTransform_Map(unicode)_17}: 0, ref_PCollection_PCollection_27:beam:metric:pardo_execution_time:finish_bundle_msecs:v1 {PTRANSFORM=ref_AppliedPTransform_assert_that/Unkey_40}: 0, ref_PCollection_PCollection_14:beam:metric:ptransform_execution_time:total_msecs:v1 {PTRANSFORM=ref_AppliedPTransform_Map(<lambda at external_test.py:213>)_22}: 0, pcollection_1:beam:metric:pardo_execution_time:process_bundle_msecs:v1 {PTRANSFORM=ExternalTransform(pytest:beam:transforms:count)/Combine.perKey(Count)/Merge}: 0, ref_PCollection_PCollection_12:beam:metric:pardo_execution_time:start_bundle_msecs:v1 {PTRANSFORM=external_2root/Init/Map/ParMultiDo(Anonymous)}: 0, ref_PCollection_PCollection_1:beam:metric:ptransform_execution_time:total_msecs:v1 {PTRANSFORM=ref_AppliedPTransform_Create/FlatMap(<lambda at core.py:2257>)_4}: 11, ref_PCollection_PCollection_27:beam:metric:pardo_execution_time:start_bundle_msecs:v1 {PTRANSFORM=ref_AppliedPTransform_assert_that/Group/Map(_merge_tagged_vals_under_key)_39}: 0, ref_PCollection_PCollection_9:beam:metric:ptransform_execution_time:total_msecs:v1 {PTRANSFORM=ref_AppliedPTransform_Map(unicode)_17}: 0, ref_PCollection_PCollection_14:beam:metric:pardo_execution_time:finish_bundle_msecs:v1 {PTRANSFORM=ref_AppliedPTransform_assert_that/WindowInto(WindowIntoFn)_29}: 0, ref_PCollection_PCollection_27:beam:metric:ptransform_execution_time:total_msecs:v1 {PTRANSFORM=fn/read/ref_PCollection_PCollection_27:0}: 0, ref_PCollection_PCollection_14:beam:metric:ptransform_execution_time:total_msecs:v1 {PTRANSFORM=ref_AppliedPTransform_assert_that/ToVoidKey_30}: 0, ref_PCollection_PCollection_27:beam:metric:ptransform_execution_time:total_msecs:v1 {PTRANSFORM=ref_AppliedPTransform_assert_that/Unkey_40}: 0, pcollection_1:beam:metric:element_count:v1 {PCOLLECTION=ref_PCollection_PCollection_14}: 3, ref_PCollection_PCollection_27:beam:metric:pardo_execution_time:process_bundle_msecs:v1 {PTRANSFORM=fn/read/ref_PCollection_PCollection_27:0}: 0, ref_PCollection_PCollection_17:beam:metric:pardo_execution_time:finish_bundle_msecs:v1 {PTRANSFORM=ref_AppliedPTransform_assert_that/Create/FlatMap(<lambda at core.py:2257>)_26}: 0, ref_PCollection_PCollection_14:beam:metric:ptransform_execution_time:total_msecs:v1 {PTRANSFORM=ref_AppliedPTransform_assert_that/Group/pair_with_1_33}: 2, ref_PCollection_PCollection_17:beam:metric:element_count:v1 {PCOLLECTION=ref_PCollection_PCollection_22}: 1, ref_PCollection_PCollection_14:beam:metric:pardo_execution_time:start_bundle_msecs:v1 {PTRANSFORM=ref_AppliedPTransform_Map(<lambda at external_test.py:212>)_21}: 0, ref_PCollection_PCollection_27:beam:metric:element_count:v1 {PCOLLECTION=ref_PCollection_PCollection_28}: 1, ref_PCollection_PCollection_17:beam:metric:ptransform_execution_time:total_msecs:v1 {PTRANSFORM=fn/read/ref_PCollection_PCollection_17:0}: 0, ref_PCollection_PCollection_27:beam:metric:element_count:v1 {PCOLLECTION=ref_PCollection_PCollection_29}: 1, ref_PCollection_PCollection_12:beam:metric:element_count:v1 {PCOLLECTION=external_2root/Init/Map/ParMultiDo(Anonymous).output}: 6, ref_PCollection_PCollection_27:beam:metric:element_count:v1 {PCOLLECTION=ref_PCollection_PCollection_27}: 1, pcollection_1:beam:metric:pardo_execution_time:start_bundle_msecs:v1 {PTRANSFORM=fn/read/pcollection_1:0}: 0, ref_PCollection_PCollection_17:beam:metric:pardo_execution_time:start_bundle_msecs:v1 {PTRANSFORM=ref_AppliedPTransform_assert_that/Create/FlatMap(<lambda at core.py:2257>)_26}: 0, pcollection_1:beam:metric:pardo_execution_time:process_bundle_msecs:v1 {PTRANSFORM=ExternalTransform(pytest:beam:transforms:count)/Combine.perKey(Count)/ExtractOutputs}: 0, ref_PCollection_PCollection_9:beam:metric:pardo_execution_time:finish_bundle_msecs:v1 {PTRANSFORM=ref_AppliedPTransform_Map(unicode)_17}: 0, ref_PCollection_PCollection_9:beam:metric:pardo_execution_time:finish_bundle_msecs:v1 {PTRANSFORM=ref_AppliedPTransform_Map(<lambda at external_test.py:208>)_18}: 0, ref_PCollection_PCollection_9:beam:metric:pardo_execution_time:finish_bundle_msecs:v1 {PTRANSFORM=ref_AppliedPTransform_Create/Map(decode)_16}: 0, ref_PCollection_PCollection_27:beam:metric:pardo_execution_time:process_bundle_msecs:v1 {PTRANSFORM=ref_AppliedPTransform_assert_that/Group/Map(_merge_tagged_vals_under_key)_39}: 0, ref_PCollection_PCollection_17:beam:metric:pardo_execution_time:start_bundle_msecs:v1 {PTRANSFORM=ref_AppliedPTransform_assert_that/Group/Flatten_34}: 0, ref_PCollection_PCollection_27:beam:metric:pardo_execution_time:finish_bundle_msecs:v1 {PTRANSFORM=ref_AppliedPTransform_assert_that/Group/Map(_merge_tagged_vals_under_key)_39}: 0, ref_PCollection_PCollection_17:beam:metric:pardo_execution_time:finish_bundle_msecs:v1 {PTRANSFORM=ref_AppliedPTransform_assert_that/Group/Flatten_34}: 0, ref_PCollection_PCollection_17:beam:metric:pardo_execution_time:start_bundle_msecs:v1 {PTRANSFORM=fn/write/ref_PCollection_PCollection_24:1:0}: 0, ref_PCollection_PCollection_12:beam:metric:pardo_execution_time:finish_bundle_msecs:v1 {PTRANSFORM=fn/write/pcollection:0}: 0, ref_PCollection_PCollection_12:beam:metric:pardo_execution_time:finish_bundle_msecs:v1 {PTRANSFORM=fn/read/ref_PCollection_PCollection_12:0}: 0, ref_PCollection_PCollection_17:beam:metric:pardo_execution_time:finish_bundle_msecs:v1 {PTRANSFORM=fn/write/ref_PCollection_PCollection_24:1:0}: 0, ref_PCollection_PCollection_12:beam:metric:pardo_execution_time:start_bundle_msecs:v1 {PTRANSFORM=fn/write/pcollection:0}: 0, ref_PCollection_PCollection_12:beam:metric:element_count:v1 {PCOLLECTION=ref_PCollection_PCollection_13}: 6, ref_PCollection_PCollection_14:beam:metric:pardo_execution_time:process_bundle_msecs:v1 {PTRANSFORM=ref_AppliedPTransform_Map(<lambda at external_test.py:212>)_21}: 0, ref_PCollection_PCollection_9:beam:metric:pardo_execution_time:process_bundle_msecs:v1 {PTRANSFORM=ref_AppliedPTransform_Create/Map(decode)_16}: 0, ref_PCollection_PCollection_14:beam:metric:pardo_execution_time:finish_bundle_msecs:v1 {PTRANSFORM=ref_AppliedPTransform_Map(<lambda at external_test.py:212>)_21}: 0, ref_PCollection_PCollection_12:beam:metric:pardo_execution_time:process_bundle_msecs:v1 {PTRANSFORM=fn/write/pcollection:0}: 0, ref_PCollection_PCollection_9:beam:metric:pardo_execution_time:start_bundle_msecs:v1 {PTRANSFORM=ref_AppliedPTransform_Map(unicode)_17}: 0, ref_PCollection_PCollection_9:beam:metric:pardo_execution_time:start_bundle_msecs:v1 {PTRANSFORM=ref_AppliedPTransform_Map(<lambda at external_test.py:208>)_18}: 0, ref_PCollection_PCollection_27:beam:metric:pardo_execution_time:start_bundle_msecs:v1 {PTRANSFORM=ref_AppliedPTransform_assert_that/Unkey_40}: 0, ref_PCollection_PCollection_17:beam:metric:pardo_execution_time:finish_bundle_msecs:v1 {PTRANSFORM=ref_AppliedPTransform_assert_that/Group/pair_with_0_32}: 0, ref_PCollection_PCollection_1:beam:metric:pardo_execution_time:process_bundle_msecs:v1 {PTRANSFORM=fn/read/ref_PCollection_PCollection_1:0}: 0, ref_PCollection_PCollection_17:beam:metric:pardo_execution_time:process_bundle_msecs:v1 {PTRANSFORM=ref_AppliedPTransform_assert_that/Group/pair_with_0_32}: 0, ref_PCollection_PCollection_14:beam:metric:element_count:v1 {PCOLLECTION=ref_PCollection_PCollection_14}: 3, ref_PCollection_PCollection_12:beam:metric:pardo_execution_time:start_bundle_msecs:v1 {PTRANSFORM=fn/read/ref_PCollection_PCollection_12:0}: 0, ref_PCollection_PCollection_9:beam:metric:element_count:v1 {PCOLLECTION=ref_PCollection_PCollection_9}: 12, ref_PCollection_PCollection_14:beam:metric:element_count:v1 {PCOLLECTION=ref_PCollection_PCollection_16}: 3, ref_PCollection_PCollection_1:beam:metric:pardo_execution_time:start_bundle_msecs:v1 {PTRANSFORM=fn/read/ref_PCollection_PCollection_1:0}: 0, ref_PCollection_PCollection_14:beam:metric:element_count:v1 {PCOLLECTION=ref_PCollection_PCollection_15}: 3, ref_PCollection_PCollection_17:beam:metric:pardo_execution_time:process_bundle_msecs:v1 {PTRANSFORM=ref_AppliedPTransform_assert_that/Group/Flatten_34}: 0, ref_PCollection_PCollection_1:beam:metric:ptransform_execution_time:total_msecs:v1 {PTRANSFORM=fn/write/ref_PCollection_PCollection_2:0}: 0, ref_PCollection_PCollection_17:beam:metric:ptransform_execution_time:total_msecs:v1 {PTRANSFORM=ref_AppliedPTransform_assert_that/Group/Flatten_34}: 0, ref_PCollection_PCollection_12:beam:metric:element_count:v1 {PCOLLECTION=ref_PCollection_PCollection_12}: 12, ref_PCollection_PCollection_14:beam:metric:ptransform_execution_time:total_msecs:v1 {PTRANSFORM=ref_AppliedPTransform_Map(<lambda at external_test.py:212>)_21}: 0, ref_PCollection_PCollection_1:beam:metric:pardo_execution_time:finish_bundle_msecs:v1 {PTRANSFORM=fn/read/ref_PCollection_PCollection_1:0}: 0, ref_PCollection_PCollection_9:beam:metric:ptransform_execution_time:total_msecs:v1 {PTRANSFORM=fn/read/ref_PCollection_PCollection_9:0}: 0, ref_PCollection_PCollection_1:beam:metric:pardo_execution_time:process_bundle_msecs:v1 {PTRANSFORM=ref_AppliedPTransform_Create/FlatMap(<lambda at core.py:2257>)_4}: 0, ref_PCollection_PCollection_27:beam:metric:pardo_execution_time:process_bundle_msecs:v1 {PTRANSFORM=ref_AppliedPTransform_assert_that/Unkey_40}: 0, ref_PCollection_PCollection_14:beam:metric:element_count:v1 {PCOLLECTION=ref_PCollection_PCollection_24:0}: 3, ref_PCollection_PCollection_9:beam:metric:pardo_execution_time:process_bundle_msecs:v1 {PTRANSFORM=ref_AppliedPTransform_Map(<lambda at external_test.py:208>)_18}: 0, ref_PCollection_PCollection_14:beam:metric:pardo_execution_time:finish_bundle_msecs:v1 {PTRANSFORM=ref_AppliedPTransform_assert_that/Group/pair_with_1_33}: 0, ref_PCollection_PCollection_14:beam:metric:pardo_execution_time:process_bundle_msecs:v1 {PTRANSFORM=ref_AppliedPTransform_assert_that/Group/pair_with_1_33}: 0, ref_PCollection_PCollection_17:beam:metric:pardo_execution_time:start_bundle_msecs:v1 {PTRANSFORM=ref_AppliedPTransform_assert_that/Create/Map(decode)_28}: 0, ref_PCollection_PCollection_17:beam:metric:pardo_execution_time:process_bundle_msecs:v1 {PTRANSFORM=ref_AppliedPTransform_assert_that/Create/Map(decode)_28}: 0, ref_PCollection_PCollection_9:beam:metric:pardo_execution_time:process_bundle_msecs:v1 {PTRANSFORM=fn/write/ref_PCollection_PCollection_12:0}: 0, ref_PCollection_PCollection_14:beam:metric:pardo_execution_time:start_bundle_msecs:v1 {PTRANSFORM=ref_AppliedPTransform_assert_that/Group/pair_with_1_33}: 2, ref_PCollection_PCollection_17:beam:metric:pardo_execution_time:start_bundle_msecs:v1 {PTRANSFORM=fn/read/ref_PCollection_PCollection_17:0}: 0, ref_PCollection_PCollection_27:beam:metric:pardo_execution_time:process_bundle_msecs:v1 {PTRANSFORM=ref_AppliedPTransform_assert_that/Match_41}: 0, ref_PCollection_PCollection_1:beam:metric:pardo_execution_time:start_bundle_msecs:v1 {PTRANSFORM=ref_AppliedPTransform_Create/FlatMap(<lambda at core.py:2257>)_4}: 11, ref_PCollection_PCollection_9:beam:metric:ptransform_execution_time:total_msecs:v1 {PTRANSFORM=ref_AppliedPTransform_Map(<lambda at external_test.py:208>)_18}: 0, ref_PCollection_PCollection_14:beam:metric:pardo_execution_time:start_bundle_msecs:v1 {PTRANSFORM=fn/write/ref_PCollection_PCollection_24:0:0}: 0, ref_PCollection_PCollection_1:beam:metric:pardo_execution_time:finish_bundle_msecs:v1 {PTRANSFORM=ref_AppliedPTransform_Create/FlatMap(<lambda at core.py:2257>)_4}: 0, ref_PCollection_PCollection_1:beam:metric:pardo_execution_time:finish_bundle_msecs:v1 {PTRANSFORM=fn/write/ref_PCollection_PCollection_2:0}: 0, ref_PCollection_PCollection_9:beam:metric:ptransform_execution_time:total_msecs:v1 {PTRANSFORM=fn/write/ref_PCollection_PCollection_12:0}: 0, ref_PCollection_PCollection_17:beam:metric:pardo_execution_time:finish_bundle_msecs:v1 {PTRANSFORM=fn/read/ref_PCollection_PCollection_17:0}: 0, ref_PCollection_PCollection_17:beam:metric:pardo_execution_time:finish_bundle_msecs:v1 {PTRANSFORM=ref_AppliedPTransform_assert_that/Create/Map(decode)_28}: 0, ref_PCollection_PCollection_17:beam:metric:pardo_execution_time:start_bundle_msecs:v1 {PTRANSFORM=ref_AppliedPTransform_assert_that/Group/pair_with_0_32}: 0, ref_PCollection_PCollection_14:beam:metric:element_count:v1 {PCOLLECTION=ref_PCollection_PCollection_23}: 3, ref_PCollection_PCollection_27:beam:metric:ptransform_execution_time:total_msecs:v1 {PTRANSFORM=ref_AppliedPTransform_assert_that/Match_41}: 0, ref_PCollection_PCollection_14:beam:metric:element_count:v1 {PCOLLECTION=ref_PCollection_PCollection_20}: 3, pcollection_1:beam:metric:pardo_execution_time:process_bundle_msecs:v1 {PTRANSFORM=fn/write/ref_PCollection_PCollection_14:0}: 0, ref_PCollection_PCollection_14:beam:metric:element_count:v1 {PCOLLECTION=ref_PCollection_PCollection_21}: 3, ref_PCollection_PCollection_9:beam:metric:element_count:v1 {PCOLLECTION=ref_PCollection_PCollection_11}: 12, ref_PCollection_PCollection_9:beam:metric:element_count:v1 {PCOLLECTION=ref_PCollection_PCollection_12}: 12, ref_PCollection_PCollection_9:beam:metric:element_count:v1 {PCOLLECTION=ref_PCollection_PCollection_10}: 12, ref_PCollection_PCollection_27:beam:metric:ptransform_execution_time:total_msecs:v1 {PTRANSFORM=ref_AppliedPTransform_assert_that/Group/Map(_merge_tagged_vals_under_key)_39}: 0, ref_PCollection_PCollection_1:beam:metric:pardo_execution_time:start_bundle_msecs:v1 {PTRANSFORM=fn/write/ref_PCollection_PCollection_2:0}: 0, ref_PCollection_PCollection_14:beam:metric:ptransform_execution_time:total_msecs:v1 {PTRANSFORM=ref_AppliedPTransform_assert_that/WindowInto(WindowIntoFn)_29}: 0, ref_PCollection_PCollection_12:beam:metric:pardo_execution_time:finish_bundle_msecs:v1 {PTRANSFORM=external_1root/ParDo(Anonymous)/ParMultiDo(Anonymous)}: 0, ref_PCollection_PCollection_17:beam:metric:pardo_execution_time:process_bundle_msecs:v1 {PTRANSFORM=fn/read/ref_PCollection_PCollection_17:0}: 0, ref_PCollection_PCollection_12:beam:metric:pardo_execution_time:process_bundle_msecs:v1 {PTRANSFORM=external_1root/ParDo(Anonymous)/ParMultiDo(Anonymous)}: 0, ref_PCollection_PCollection_12:beam:metric:pardo_execution_time:start_bundle_msecs:v1 {PTRANSFORM=external_1root/ParDo(Anonymous)/ParMultiDo(Anonymous)}: 0, ref_PCollection_PCollection_9:beam:metric:pardo_execution_time:start_bundle_msecs:v1 {PTRANSFORM=ref_AppliedPTransform_Create/Map(decode)_16}: 0, ref_PCollection_PCollection_17:beam:metric:pardo_execution_time:process_bundle_msecs:v1 {PTRANSFORM=fn/write/ref_PCollection_PCollection_24:1:0}: 0)Distributions(ref_PCollection_PCollection_14:beam:metric:sampled_byte_size:v1 {PCOLLECTION=ref_PCollection_PCollection_16}: DistributionResult{sum=54, count=3, min=18, max=18}, ref_PCollection_PCollection_14:beam:metric:sampled_byte_size:v1 {PCOLLECTION=ref_PCollection_PCollection_15}: DistributionResult{sum=51, count=3, min=17, max=17}, ref_PCollection_PCollection_14:beam:metric:sampled_byte_size:v1 {PCOLLECTION=ref_PCollection_PCollection_14}: DistributionResult{sum=45, count=3, min=15, max=15}, ref_PCollection_PCollection_27:beam:metric:sampled_byte_size:v1 {PCOLLECTION=ref_PCollection_PCollection_30}: DistributionResult{sum=14, count=1, min=14, max=14}, ref_PCollection_PCollection_17:beam:metric:sampled_byte_size:v1 {PCOLLECTION=ref_PCollection_PCollection_24:1}: DistributionResult{sum=19, count=1, min=19, max=19}, ref_PCollection_PCollection_17:beam:metric:sampled_byte_size:v1 {PCOLLECTION=ref_PCollection_PCollection_17}: DistributionResult{sum=13, count=1, min=13, max=13}, ref_PCollection_PCollection_17:beam:metric:sampled_byte_size:v1 {PCOLLECTION=ref_PCollection_PCollection_18}: DistributionResult{sum=16, count=1, min=16, max=16}, ref_PCollection_PCollection_14:beam:metric:sampled_byte_size:v1 {PCOLLECTION=ref_PCollection_PCollection_24:0}: DistributionResult{sum=72, count=3, min=24, max=24}, ref_PCollection_PCollection_17:beam:metric:sampled_byte_size:v1 {PCOLLECTION=ref_PCollection_PCollection_19}: DistributionResult{sum=15, count=1, min=15, max=15}, ref_PCollection_PCollection_9:beam:metric:sampled_byte_size:v1 {PCOLLECTION=ref_PCollection_PCollection_9}: DistributionResult{sum=192, count=12, min=16, max=16}, ref_PCollection_PCollection_17:beam:metric:sampled_byte_size:v1 {PCOLLECTION=ref_PCollection_PCollection_22}: DistributionResult{sum=17, count=1, min=17, max=17}, ref_PCollection_PCollection_9:beam:metric:sampled_byte_size:v1 {PCOLLECTION=ref_PCollection_PCollection_10}: DistributionResult{sum=168, count=12, min=14, max=14}, ref_PCollection_PCollection_9:beam:metric:sampled_byte_size:v1 {PCOLLECTION=ref_PCollection_PCollection_12}: DistributionResult{sum=168, count=12, min=14, max=14}, ref_PCollection_PCollection_9:beam:metric:sampled_byte_size:v1 {PCOLLECTION=ref_PCollection_PCollection_11}: DistributionResult{sum=168, count=12, min=14, max=14}, ref_PCollection_PCollection_1:beam:metric:sampled_byte_size:v1 {PCOLLECTION=ref_PCollection_PCollection_1}: DistributionResult{sum=13, count=1, min=13, max=13}, ref_PCollection_PCollection_27:beam:metric:sampled_byte_size:v1 {PCOLLECTION=ref_PCollection_PCollection_27}: DistributionResult{sum=58, count=1, min=58, max=58}, ref_PCollection_PCollection_27:beam:metric:sampled_byte_size:v1 {PCOLLECTION=ref_PCollection_PCollection_28}: DistributionResult{sum=41, count=1, min=41, max=41}, ref_PCollection_PCollection_14:beam:metric:sampled_byte_size:v1 {PCOLLECTION=ref_PCollection_PCollection_23}: DistributionResult{sum=63, count=3, min=21, max=21}, ref_PCollection_PCollection_27:beam:metric:sampled_byte_size:v1 {PCOLLECTION=ref_PCollection_PCollection_29}: DistributionResult{sum=33, count=1, min=33, max=33}, ref_PCollection_PCollection_1:beam:metric:sampled_byte_size:v1 {PCOLLECTION=ref_PCollection_PCollection_2}: DistributionResult{sum=180, count=12, min=15, max=15}, ref_PCollection_PCollection_14:beam:metric:sampled_byte_size:v1 {PCOLLECTION=ref_PCollection_PCollection_21}: DistributionResult{sum=57, count=3, min=19, max=19}, ref_PCollection_PCollection_14:beam:metric:sampled_byte_size:v1 {PCOLLECTION=ref_PCollection_PCollection_20}: DistributionResult{sum=54, count=3, min=18, max=18}))
[flink-runner-job-invoker] INFO org.apache.beam.runners.fnexecution.artifact.BeamFileSystemArtifactRetrievalService - Manifest at /tmp/beam-artifact-staging/job_2deb53b4-a548-4dc1-b47c-b3a9104e1c07/MANIFEST has 0 artifact locations
[flink-runner-job-invoker] INFO org.apache.beam.runners.fnexecution.artifact.BeamFileSystemArtifactStagingService - Removed dir /tmp/beam-artifact-staging/job_2deb53b4-a548-4dc1-b47c-b3a9104e1c07/

> Task :sdks:python:crossLanguageTests

FAILURE: Build failed with an exception.

* Where:
Build file '<https://builds.apache.org/job/beam_PostCommit_Python_Verify/ws/src/sdks/python/build.gradle'> line: 181

* What went wrong:
Execution failed for task ':sdks:python:postCommitIT'.
> Process 'command 'sh'' finished with non-zero exit value 1

* Try:
Run with --stacktrace option to get the stack trace. Run with --info or --debug option to get more log output. Run with --scan to get full insights.

* Get more help at https://help.gradle.org

Deprecated Gradle features were used in this build, making it incompatible with Gradle 6.0.
Use '--warning-mode all' to show the individual deprecation warnings.
See https://docs.gradle.org/5.2.1/userguide/command_line_interface.html#sec:command_line_warnings

BUILD FAILED in 47m 19s
105 actionable tasks: 81 executed, 21 from cache, 3 up-to-date

Publishing build scan...
https://gradle.com/s/gj4j7ifltg3dw

Build step 'Invoke Gradle script' changed build result to FAILURE
Build step 'Invoke Gradle script' marked build as failure

---------------------------------------------------------------------
To unsubscribe, e-mail: builds-unsubscribe@beam.apache.org
For additional commands, e-mail: builds-help@beam.apache.org


Mime
View raw message