beam-builds mailing list archives

Site index · List index
Message view « Date » · « Thread »
Top « Date » · « Thread »
From Apache Jenkins Server <jenk...@builds.apache.org>
Subject Build failed in Jenkins: beam_PostCommit_Py_VR_Dataflow #4024
Date Mon, 15 Jul 2019 18:52:08 GMT
See <https://builds.apache.org/job/beam_PostCommit_Py_VR_Dataflow/4024/display/redirect>

------------------------------------------
[...truncated 589.20 KB...]
            "encoding": {
              "@type": "kind:windowed_value", 
              "component_encodings": [
                {
                  "@type": "FastPrimitivesCoder$eNprYEpOLEhMzkiNT0pNzNVLzk9JLSqGUlxuicUlAUWZuZklmWWpxc4gQa5CBs3GQsbaQqZQ/vi0xJycpMTk7Hiw+kJmPEYFZCZn56RCjWABGsFaW8iWVJykBwDlGS3/",

                  "component_encodings": [
                    {
                      "@type": "FastPrimitivesCoder$eNprYEpOLEhMzkiNT0pNzNVLzk9JLSqGUlxuicUlAUWZuZklmWWpxc4gQa5CBs3GQsbaQqZQ/vi0xJycpMTk7Hiw+kJmPEYFZCZn56RCjWABGsFaW8iWVJykBwDlGS3/",

                      "component_encodings": [], 
                      "pipeline_proto_coder_id": "ref_Coder_FastPrimitivesCoder_3"
                    }, 
                    {
                      "@type": "FastPrimitivesCoder$eNprYEpOLEhMzkiNT0pNzNVLzk9JLSqGUlxuicUlAUWZuZklmWWpxc4gQa5CBs3GQsbaQqZQ/vi0xJycpMTk7Hiw+kJmPEYFZCZn56RCjWABGsFaW8iWVJykBwDlGS3/",

                      "component_encodings": [], 
                      "pipeline_proto_coder_id": "ref_Coder_FastPrimitivesCoder_3"
                    }
                  ], 
                  "is_pair_like": true, 
                  "pipeline_proto_coder_id": "ref_Coder_FastPrimitivesCoder_3"
                }, 
                {
                  "@type": "kind:global_window"
                }
              ], 
              "is_wrapper": true
            }, 
            "output_name": "out", 
            "user_name": "Do.out"
          }
        ], 
        "parallel_input": {
          "@type": "OutputReference", 
          "output_name": "out", 
          "step_name": "s2"
        }, 
        "serialized_fn": "ref_AppliedPTransform_Do_5", 
        "user_name": "Do"
      }
    }
  ], 
  "type": "JOB_TYPE_STREAMING"
}
root: INFO: Create job: <Job
 createTime: u'2019-07-15T18:28:13.650700Z'
 currentStateTime: u'1970-01-01T00:00:00Z'
 id: u'2019-07-15_11_28_12-10858675631966532537'
 location: u'us-central1'
 name: u'beamapp-jenkins-0715182805-039106'
 projectId: u'apache-beam-testing'
 stageStates: []
 startTime: u'2019-07-15T18:28:13.650700Z'
 steps: []
 tempFiles: []
 type: TypeValueValuesEnum(JOB_TYPE_STREAMING, 2)>
root: INFO: Created job with id: [2019-07-15_11_28_12-10858675631966532537]
root: INFO: To access the Dataflow monitoring console, please navigate to https://console.cloud.google.com/dataflow/jobsDetail/locations/us-central1/jobs/2019-07-15_11_28_12-10858675631966532537?project=apache-beam-testing
root: WARNING: Waiting indefinitely for streaming job.
root: INFO: Job 2019-07-15_11_28_12-10858675631966532537 is in state JOB_STATE_RUNNING
root: INFO: 2019-07-15T18:28:16.637Z: JOB_MESSAGE_DETAILED: Checking permissions granted to
controller Service Account.
root: INFO: 2019-07-15T18:28:17.243Z: JOB_MESSAGE_BASIC: Worker configuration: n1-standard-4
in us-central1-a.
root: INFO: 2019-07-15T18:28:17.704Z: JOB_MESSAGE_DETAILED: Expanding SplittableParDo operations
into optimizable parts.
root: INFO: 2019-07-15T18:28:17.710Z: JOB_MESSAGE_DETAILED: Expanding CollectionToSingleton
operations into optimizable parts.
root: INFO: 2019-07-15T18:28:17.725Z: JOB_MESSAGE_DETAILED: Expanding CoGroupByKey operations
into optimizable parts.
root: INFO: 2019-07-15T18:28:17.733Z: JOB_MESSAGE_DETAILED: Expanding SplittableProcessKeyed
operations into optimizable parts.
root: INFO: 2019-07-15T18:28:17.739Z: JOB_MESSAGE_DETAILED: Expanding GroupByKey operations
into streaming Read/Write steps
root: INFO: 2019-07-15T18:28:17.744Z: JOB_MESSAGE_DEBUG: Annotating graph with Autotuner information.
root: INFO: 2019-07-15T18:28:17.771Z: JOB_MESSAGE_DETAILED: Fusing adjacent ParDo, Read, Write,
and Flatten operations
root: INFO: 2019-07-15T18:28:17.774Z: JOB_MESSAGE_DETAILED: Fusing consumer Start/Decode Values
into Start/Impulse
root: INFO: 2019-07-15T18:28:17.778Z: JOB_MESSAGE_DETAILED: Fusing consumer Do into Start/Decode
Values
root: INFO: 2019-07-15T18:28:17.803Z: JOB_MESSAGE_DEBUG: Adding StepResource setup and teardown
to workflow graph.
root: INFO: 2019-07-15T18:28:17.839Z: JOB_MESSAGE_DEBUG: Adding workflow start and stop steps.
root: INFO: 2019-07-15T18:28:17.880Z: JOB_MESSAGE_DEBUG: Assigning stage ids.
root: INFO: 2019-07-15T18:28:18.156Z: JOB_MESSAGE_DEBUG: Executing wait step start2
root: INFO: 2019-07-15T18:28:18.194Z: JOB_MESSAGE_DEBUG: Starting worker pool setup.
root: INFO: 2019-07-15T18:28:18.210Z: JOB_MESSAGE_BASIC: Starting 1 workers...
root: INFO: 2019-07-15T18:28:21.677Z: JOB_MESSAGE_BASIC: Executing operation Start/Impulse+Start/Decode
Values+Do
root: INFO: 2019-07-15T18:29:09.957Z: JOB_MESSAGE_DETAILED: Workers have started successfully.
root: INFO: 2019-07-15T18:29:19.330Z: JOB_MESSAGE_DEBUG: Executing input step topology_init_attach_disk_input_step
root: INFO: 2019-07-15T18:29:19.637Z: JOB_MESSAGE_DETAILED: Checking permissions granted to
controller Service Account.
root: INFO: 2019-07-15T18:29:20.260Z: JOB_MESSAGE_BASIC: Worker configuration: n1-standard-4
in us-central1-a.
--------------------- >> end captured logging << ---------------------

----------------------------------------------------------------------
XML: <https://builds.apache.org/job/beam_PostCommit_Py_VR_Dataflow/ws/src/sdks/python/nosetests.xml>
----------------------------------------------------------------------
Ran 15 tests in 1136.555s

FAILED (failures=2)
Found: https://console.cloud.google.com/dataflow/jobsDetail/locations/us-central1/jobs/2019-07-15_11_28_12-10858675631966532537?project=apache-beam-testing.
Found: https://console.cloud.google.com/dataflow/jobsDetail/locations/us-central1/jobs/2019-07-15_11_35_29-11397645880379694268?project=apache-beam-testing.
Found: https://console.cloud.google.com/dataflow/jobsDetail/locations/us-central1/jobs/2019-07-15_11_28_13-5031816518950818749?project=apache-beam-testing.
Found: https://console.cloud.google.com/dataflow/jobsDetail/locations/us-central1/jobs/2019-07-15_11_34_54-1337746789977885781?project=apache-beam-testing.
Found: https://console.cloud.google.com/dataflow/jobsDetail/locations/us-central1/jobs/2019-07-15_11_28_13-2997384641450356909?project=apache-beam-testing.
Found: https://console.cloud.google.com/dataflow/jobsDetail/locations/us-central1/jobs/2019-07-15_11_28_13-12045521648054714560?project=apache-beam-testing.
Found: https://console.cloud.google.com/dataflow/jobsDetail/locations/us-central1/jobs/2019-07-15_11_37_28-13518098183706641814?project=apache-beam-testing.
Found: https://console.cloud.google.com/dataflow/jobsDetail/locations/us-central1/jobs/2019-07-15_11_28_13-8003666369764630760?project=apache-beam-testing.
Found: https://console.cloud.google.com/dataflow/jobsDetail/locations/us-central1/jobs/2019-07-15_11_37_03-16881163660091870460?project=apache-beam-testing.
Found: https://console.cloud.google.com/dataflow/jobsDetail/locations/us-central1/jobs/2019-07-15_11_28_13-2370988195214440286?project=apache-beam-testing.
Found: https://console.cloud.google.com/dataflow/jobsDetail/locations/us-central1/jobs/2019-07-15_11_36_58-1621883337687496325?project=apache-beam-testing.
Found: https://console.cloud.google.com/dataflow/jobsDetail/locations/us-central1/jobs/2019-07-15_11_28_13-14279884304493692072?project=apache-beam-testing.
Found: https://console.cloud.google.com/dataflow/jobsDetail/locations/us-central1/jobs/2019-07-15_11_36_53-16249114032214665667?project=apache-beam-testing.
Found: https://console.cloud.google.com/dataflow/jobsDetail/locations/us-central1/jobs/2019-07-15_11_28_13-6943732339735586196?project=apache-beam-testing.
Found: https://console.cloud.google.com/dataflow/jobsDetail/locations/us-central1/jobs/2019-07-15_11_36_52-16894450233896653685?project=apache-beam-testing.

> Task :sdks:python:validatesRunnerStreamingTests FAILED

> Task :sdks:python:test-suites:dataflow:py36:validatesRunnerStreamingTests
Found: https://console.cloud.google.com/dataflow/jobsDetail/locations/us-central1/jobs/2019-07-15_11_30_54-3085073873541477771?project=apache-beam-testing.
Found: https://console.cloud.google.com/dataflow/jobsDetail/locations/us-central1/jobs/2019-07-15_11_40_24-12459860217060145050?project=apache-beam-testing.
Found: https://console.cloud.google.com/dataflow/jobsDetail/locations/us-central1/jobs/2019-07-15_11_30_56-5338512374146129231?project=apache-beam-testing.
Found: https://console.cloud.google.com/dataflow/jobsDetail/locations/us-central1/jobs/2019-07-15_11_40_20-11396412340519700545?project=apache-beam-testing.
Found: https://console.cloud.google.com/dataflow/jobsDetail/locations/us-central1/jobs/2019-07-15_11_30_56-15295141773793231049?project=apache-beam-testing.
Found: https://console.cloud.google.com/dataflow/jobsDetail/locations/us-central1/jobs/2019-07-15_11_40_11-16920062642226509003?project=apache-beam-testing.
Found: https://console.cloud.google.com/dataflow/jobsDetail/locations/us-central1/jobs/2019-07-15_11_30_56-10274881311188830983?project=apache-beam-testing.
Found: https://console.cloud.google.com/dataflow/jobsDetail/locations/us-central1/jobs/2019-07-15_11_30_56-9565358513676398473?project=apache-beam-testing.
Found: https://console.cloud.google.com/dataflow/jobsDetail/locations/us-central1/jobs/2019-07-15_11_39_41-5626923731782193204?project=apache-beam-testing.
Found: https://console.cloud.google.com/dataflow/jobsDetail/locations/us-central1/jobs/2019-07-15_11_30_56-2809806476645618544?project=apache-beam-testing.
Found: https://console.cloud.google.com/dataflow/jobsDetail/locations/us-central1/jobs/2019-07-15_11_39_51-11776355537515252080?project=apache-beam-testing.
Found: https://console.cloud.google.com/dataflow/jobsDetail/locations/us-central1/jobs/2019-07-15_11_30_55-18348571050178394253?project=apache-beam-testing.
Found: https://console.cloud.google.com/dataflow/jobsDetail/locations/us-central1/jobs/2019-07-15_11_40_30-3787980425285690923?project=apache-beam-testing.
Found: https://console.cloud.google.com/dataflow/jobsDetail/locations/us-central1/jobs/2019-07-15_11_30_56-9044989116407237772?project=apache-beam-testing.
Found: https://console.cloud.google.com/dataflow/jobsDetail/locations/us-central1/jobs/2019-07-15_11_40_30-2216982722979945134?project=apache-beam-testing.
test_par_do_with_multiple_outputs_and_using_yield (apache_beam.transforms.ptransform_test.PTransformTest)
... ok
test_undeclared_outputs (apache_beam.transforms.ptransform_test.PTransformTest) ... ok
test_multiple_empty_outputs (apache_beam.transforms.ptransform_test.PTransformTest) ... ok
test_flatten_multiple_pcollections_having_multiple_consumers (apache_beam.transforms.ptransform_test.PTransformTest)
... ok
test_dofn_lifecycle (apache_beam.transforms.dofn_lifecycle_test.DoFnLifecycleTest) ... ok
test_as_dict_twice (apache_beam.transforms.sideinputs_test.SideInputsTest) ... ok
test_as_list_and_as_dict_side_inputs (apache_beam.transforms.sideinputs_test.SideInputsTest)
... ok
test_par_do_with_multiple_outputs_and_using_return (apache_beam.transforms.ptransform_test.PTransformTest)
... ok
test_empty_singleton_side_input (apache_beam.transforms.sideinputs_test.SideInputsTest) ...
ok
test_as_list_twice (apache_beam.transforms.sideinputs_test.SideInputsTest) ... ok
test_as_singleton_with_different_defaults (apache_beam.transforms.sideinputs_test.SideInputsTest)
... ok
test_as_singleton_without_unique_labels (apache_beam.transforms.sideinputs_test.SideInputsTest)
... ok
test_default_value_singleton_side_input (apache_beam.transforms.sideinputs_test.SideInputsTest)
... ok
test_flattened_side_input (apache_beam.transforms.sideinputs_test.SideInputsTest) ... ok
test_iterable_side_input (apache_beam.transforms.sideinputs_test.SideInputsTest) ... ok

----------------------------------------------------------------------
XML: <https://builds.apache.org/job/beam_PostCommit_Py_VR_Dataflow/ws/src/sdks/python/nosetests.xml>
----------------------------------------------------------------------
Ran 15 tests in 1177.431s

OK

> Task :sdks:python:test-suites:dataflow:py35:validatesRunnerStreamingTests
Found: https://console.cloud.google.com/dataflow/jobsDetail/locations/us-central1/jobs/2019-07-15_11_32_57-3826050678771785757?project=apache-beam-testing.
Found: https://console.cloud.google.com/dataflow/jobsDetail/locations/us-central1/jobs/2019-07-15_11_41_47-3358490326198490165?project=apache-beam-testing.
Found: https://console.cloud.google.com/dataflow/jobsDetail/locations/us-central1/jobs/2019-07-15_11_32_58-16530285771876455149?project=apache-beam-testing.
Found: https://console.cloud.google.com/dataflow/jobsDetail/locations/us-central1/jobs/2019-07-15_11_41_43-892525355879167266?project=apache-beam-testing.
Found: https://console.cloud.google.com/dataflow/jobsDetail/locations/us-central1/jobs/2019-07-15_11_32_58-4318957183477731432?project=apache-beam-testing.
Found: https://console.cloud.google.com/dataflow/jobsDetail/locations/us-central1/jobs/2019-07-15_11_42_18-10268391036287951718?project=apache-beam-testing.
Found: https://console.cloud.google.com/dataflow/jobsDetail/locations/us-central1/jobs/2019-07-15_11_32_58-8104285103388523851?project=apache-beam-testing.
Found: https://console.cloud.google.com/dataflow/jobsDetail/locations/us-central1/jobs/2019-07-15_11_32_58-5659138392452276860?project=apache-beam-testing.
Found: https://console.cloud.google.com/dataflow/jobsDetail/locations/us-central1/jobs/2019-07-15_11_41_48-1332085782685591603?project=apache-beam-testing.
Found: https://console.cloud.google.com/dataflow/jobsDetail/locations/us-central1/jobs/2019-07-15_11_32_57-10416719239740553301?project=apache-beam-testing.
Found: https://console.cloud.google.com/dataflow/jobsDetail/locations/us-central1/jobs/2019-07-15_11_42_23-13481477692355499424?project=apache-beam-testing.
Found: https://console.cloud.google.com/dataflow/jobsDetail/locations/us-central1/jobs/2019-07-15_11_32_57-7498417719992184434?project=apache-beam-testing.
Found: https://console.cloud.google.com/dataflow/jobsDetail/locations/us-central1/jobs/2019-07-15_11_42_18-18275334300383163327?project=apache-beam-testing.
Found: https://console.cloud.google.com/dataflow/jobsDetail/locations/us-central1/jobs/2019-07-15_11_32_58-1837427600237765433?project=apache-beam-testing.
Found: https://console.cloud.google.com/dataflow/jobsDetail/locations/us-central1/jobs/2019-07-15_11_41_48-17127614923409957866?project=apache-beam-testing.
test_flatten_multiple_pcollections_having_multiple_consumers (apache_beam.transforms.ptransform_test.PTransformTest)
... ok
test_dofn_lifecycle (apache_beam.transforms.dofn_lifecycle_test.DoFnLifecycleTest) ... ok
test_undeclared_outputs (apache_beam.transforms.ptransform_test.PTransformTest) ... ok
test_as_list_and_as_dict_side_inputs (apache_beam.transforms.sideinputs_test.SideInputsTest)
... ok
test_as_dict_twice (apache_beam.transforms.sideinputs_test.SideInputsTest) ... ok
test_multiple_empty_outputs (apache_beam.transforms.ptransform_test.PTransformTest) ... ok
test_par_do_with_multiple_outputs_and_using_yield (apache_beam.transforms.ptransform_test.PTransformTest)
... ok
test_par_do_with_multiple_outputs_and_using_return (apache_beam.transforms.ptransform_test.PTransformTest)
... ok
test_as_singleton_without_unique_labels (apache_beam.transforms.sideinputs_test.SideInputsTest)
... ok
test_as_list_twice (apache_beam.transforms.sideinputs_test.SideInputsTest) ... ok
test_as_singleton_with_different_defaults (apache_beam.transforms.sideinputs_test.SideInputsTest)
... ok
test_empty_singleton_side_input (apache_beam.transforms.sideinputs_test.SideInputsTest) ...
ok
test_default_value_singleton_side_input (apache_beam.transforms.sideinputs_test.SideInputsTest)
... ok
test_flattened_side_input (apache_beam.transforms.sideinputs_test.SideInputsTest) ... ok
test_iterable_side_input (apache_beam.transforms.sideinputs_test.SideInputsTest) ... ok

----------------------------------------------------------------------
XML: <https://builds.apache.org/job/beam_PostCommit_Py_VR_Dataflow/ws/src/sdks/python/nosetests.xml>
----------------------------------------------------------------------
Ran 15 tests in 1174.365s

OK

FAILURE: Build completed with 4 failures.

1: Task failed with an exception.
-----------
* What went wrong:
Execution failed for task ':sdks:python:test-suites:dataflow:py37:setupVirtualenv'.
> Process 'command 'sh'' finished with non-zero exit value 1

* Try:
Run with --stacktrace option to get the stack trace. Run with --info or --debug option to
get more log output. Run with --scan to get full insights.
==============================================================================

2: Task failed with an exception.
-----------
* Where:
Build file '<https://builds.apache.org/job/beam_PostCommit_Py_VR_Dataflow/ws/src/sdks/python/test-suites/dataflow/py36/build.gradle'>
line: 67

* What went wrong:
Execution failed for task ':sdks:python:test-suites:dataflow:py36:validatesRunnerBatchTests'.
> Process 'command 'sh'' finished with non-zero exit value 1

* Try:
Run with --stacktrace option to get the stack trace. Run with --info or --debug option to
get more log output. Run with --scan to get full insights.
==============================================================================

3: Task failed with an exception.
-----------
* Where:
Build file '<https://builds.apache.org/job/beam_PostCommit_Py_VR_Dataflow/ws/src/sdks/python/test-suites/dataflow/py35/build.gradle'>
line: 67

* What went wrong:
Execution failed for task ':sdks:python:test-suites:dataflow:py35:validatesRunnerBatchTests'.
> Process 'command 'sh'' finished with non-zero exit value 1

* Try:
Run with --stacktrace option to get the stack trace. Run with --info or --debug option to
get more log output. Run with --scan to get full insights.
==============================================================================

4: Task failed with an exception.
-----------
* Where:
Build file '<https://builds.apache.org/job/beam_PostCommit_Py_VR_Dataflow/ws/src/sdks/python/build.gradle'>
line: 216

* What went wrong:
Execution failed for task ':sdks:python:validatesRunnerStreamingTests'.
> Process 'command 'sh'' finished with non-zero exit value 1

* Try:
Run with --stacktrace option to get the stack trace. Run with --info or --debug option to
get more log output. Run with --scan to get full insights.
==============================================================================

* Get more help at https://help.gradle.org

Deprecated Gradle features were used in this build, making it incompatible with Gradle 6.0.
Use '--warning-mode all' to show the individual deprecation warnings.
See https://docs.gradle.org/5.2.1/userguide/command_line_interface.html#sec:command_line_warnings

BUILD FAILED in 50m 1s
72 actionable tasks: 57 executed, 15 from cache

Publishing build scan...
https://gradle.com/s/kun7lkhjxu7zw

Build step 'Invoke Gradle script' changed build result to FAILURE
Build step 'Invoke Gradle script' marked build as failure

---------------------------------------------------------------------
To unsubscribe, e-mail: builds-unsubscribe@beam.apache.org
For additional commands, e-mail: builds-help@beam.apache.org


Mime
View raw message