beam-builds mailing list archives

Site index · List index
Message view « Date » · « Thread »
Top « Date » · « Thread »
From Apache Jenkins Server <jenk...@builds.apache.org>
Subject Build failed in Jenkins: beam_PostCommit_Python3_Verify #1367
Date Tue, 16 Jul 2019 05:13:33 GMT
See <https://builds.apache.org/job/beam_PostCommit_Python3_Verify/1367/display/redirect?page=changes>

Changes:

[rezarokni] Edit of Looping Timer Blog to fix issue with Timer State

------------------------------------------
[...truncated 371.19 KB...]
                    {
                      "@type": "FastPrimitivesCoder$eNprYE5OLEhMzkiNT0pNzNVLzk9JLSqGUlxuicUlAUWZuZklmWWpxc4gQa5CBs3GQsbaQqYIfgYGhvi0xJycpMTk7HiwlkJ8pgVkJmfnpEJNYQGawlpbyJZUnKQHACYlLgM=",
                      "component_encodings": [
                        {
                          "@type": "FastPrimitivesCoder$eNprYE5OLEhMzkiNT0pNzNVLzk9JLSqGUlxuicUlAUWZuZklmWWpxc4gQa5CBs3GQsbaQqYIfgYGhvi0xJycpMTk7HiwlkJ8pgVkJmfnpEJNYQGawlpbyJZUnKQHACYlLgM=",
                          "component_encodings": [],
                          "pipeline_proto_coder_id": "ref_Coder_FastPrimitivesCoder_3"
                        },
                        {
                          "@type": "FastPrimitivesCoder$eNprYE5OLEhMzkiNT0pNzNVLzk9JLSqGUlxuicUlAUWZuZklmWWpxc4gQa5CBs3GQsbaQqYIfgYGhvi0xJycpMTk7HiwlkJ8pgVkJmfnpEJNYQGawlpbyJZUnKQHACYlLgM=",
                          "component_encodings": [],
                          "pipeline_proto_coder_id": "ref_Coder_FastPrimitivesCoder_3"
                        }
                      ],
                      "is_pair_like": true,
                      "pipeline_proto_coder_id": "ref_Coder_FastPrimitivesCoder_3"
                    }
                  ],
                  "is_pair_like": true
                },
                {
                  "@type": "kind:interval_window"
                }
              ],
              "is_wrapper": true
            },
            "output_name": "out",
            "user_name": "FilterOutSpammers/MapToVoidKey0.out"
          }
        ],
        "parallel_input": {
          "@type": "OutputReference",
          "output_name": "out",
          "step_name": "s21"
        },
        "serialized_fn": "ref_AppliedPTransform_FilterOutSpammers/MapToVoidKey0_61",
        "user_name": "FilterOutSpammers/MapToVoidKey0"
      }
    }
  ],
  "type": "JOB_TYPE_STREAMING"
}
root: DEBUG: Response returned status 429, retrying
root: DEBUG: Retrying request to url https://dataflow.googleapis.com/v1b3/projects/apache-beam-testing/locations/us-central1/jobs?alt=json
after exception HttpError accessing <https://dataflow.googleapis.com/v1b3/projects/apache-beam-testing/locations/us-central1/jobs?alt=json>:
response: <{'vary': 'Origin, X-Origin, Referer', 'content-type': 'application/json; charset=UTF-8',
'date': 'Tue, 16 Jul 2019 04:17:32 GMT', 'server': 'ESF', 'cache-control': 'private', 'x-xss-protection':
'0', 'x-frame-options': 'SAMEORIGIN', 'x-content-type-options': 'nosniff', 'transfer-encoding':
'chunked', 'status': '429', 'content-length': '598', '-content-encoding': 'gzip'}>, content
<{
  "error": {
    "code": 429,
    "message": "Quota exceeded for quota metric 'dataflow.googleapis.com/create_requests'
and limit 'CreateRequestsPerMinutePerUser' of service 'dataflow.googleapis.com' for consumer
'project_number:844138762903'.",
    "status": "RESOURCE_EXHAUSTED",
    "details": [
      {
        "@type": "type.googleapis.com/google.rpc.Help",
        "links": [
          {
            "description": "Google developer console API key",
            "url": "https://console.developers.google.com/project/844138762903/apiui/credential"
          }
        ]
      }
    ]
  }
}
>
root: DEBUG: Response returned status 429, retrying
root: DEBUG: Retrying request to url https://dataflow.googleapis.com/v1b3/projects/apache-beam-testing/locations/us-central1/jobs?alt=json
after exception HttpError accessing <https://dataflow.googleapis.com/v1b3/projects/apache-beam-testing/locations/us-central1/jobs?alt=json>:
response: <{'vary': 'Origin, X-Origin, Referer', 'content-type': 'application/json; charset=UTF-8',
'date': 'Tue, 16 Jul 2019 04:17:34 GMT', 'server': 'ESF', 'cache-control': 'private', 'x-xss-protection':
'0', 'x-frame-options': 'SAMEORIGIN', 'x-content-type-options': 'nosniff', 'transfer-encoding':
'chunked', 'status': '429', 'content-length': '598', '-content-encoding': 'gzip'}>, content
<{
  "error": {
    "code": 429,
    "message": "Quota exceeded for quota metric 'dataflow.googleapis.com/create_requests'
and limit 'CreateRequestsPerMinutePerUser' of service 'dataflow.googleapis.com' for consumer
'project_number:844138762903'.",
    "status": "RESOURCE_EXHAUSTED",
    "details": [
      {
        "@type": "type.googleapis.com/google.rpc.Help",
        "links": [
          {
            "description": "Google developer console API key",
            "url": "https://console.developers.google.com/project/844138762903/apiui/credential"
          }
        ]
      }
    ]
  }
}
>
root: DEBUG: Response returned status 429, retrying
root: DEBUG: Retrying request to url https://dataflow.googleapis.com/v1b3/projects/apache-beam-testing/locations/us-central1/jobs?alt=json
after exception HttpError accessing <https://dataflow.googleapis.com/v1b3/projects/apache-beam-testing/locations/us-central1/jobs?alt=json>:
response: <{'vary': 'Origin, X-Origin, Referer', 'content-type': 'application/json; charset=UTF-8',
'date': 'Tue, 16 Jul 2019 04:17:38 GMT', 'server': 'ESF', 'cache-control': 'private', 'x-xss-protection':
'0', 'x-frame-options': 'SAMEORIGIN', 'x-content-type-options': 'nosniff', 'transfer-encoding':
'chunked', 'status': '429', 'content-length': '598', '-content-encoding': 'gzip'}>, content
<{
  "error": {
    "code": 429,
    "message": "Quota exceeded for quota metric 'dataflow.googleapis.com/create_requests'
and limit 'CreateRequestsPerMinutePerUser' of service 'dataflow.googleapis.com' for consumer
'project_number:844138762903'.",
    "status": "RESOURCE_EXHAUSTED",
    "details": [
      {
        "@type": "type.googleapis.com/google.rpc.Help",
        "links": [
          {
            "description": "Google developer console API key",
            "url": "https://console.developers.google.com/project/844138762903/apiui/credential"
          }
        ]
      }
    ]
  }
}
>
root: DEBUG: Response returned status 429, retrying
root: DEBUG: Retrying request to url https://dataflow.googleapis.com/v1b3/projects/apache-beam-testing/locations/us-central1/jobs?alt=json
after exception HttpError accessing <https://dataflow.googleapis.com/v1b3/projects/apache-beam-testing/locations/us-central1/jobs?alt=json>:
response: <{'vary': 'Origin, X-Origin, Referer', 'content-type': 'application/json; charset=UTF-8',
'date': 'Tue, 16 Jul 2019 04:17:48 GMT', 'server': 'ESF', 'cache-control': 'private', 'x-xss-protection':
'0', 'x-frame-options': 'SAMEORIGIN', 'x-content-type-options': 'nosniff', 'transfer-encoding':
'chunked', 'status': '429', 'content-length': '598', '-content-encoding': 'gzip'}>, content
<{
  "error": {
    "code": 429,
    "message": "Quota exceeded for quota metric 'dataflow.googleapis.com/create_requests'
and limit 'CreateRequestsPerMinutePerUser' of service 'dataflow.googleapis.com' for consumer
'project_number:844138762903'.",
    "status": "RESOURCE_EXHAUSTED",
    "details": [
      {
        "@type": "type.googleapis.com/google.rpc.Help",
        "links": [
          {
            "description": "Google developer console API key",
            "url": "https://console.developers.google.com/project/844138762903/apiui/credential"
          }
        ]
      }
    ]
  }
}
>
root: ERROR: HTTP status 429 trying to create job at dataflow service endpoint https://dataflow.googleapis.com
root: CRITICAL: details of server error: HttpError accessing <https://dataflow.googleapis.com/v1b3/projects/apache-beam-testing/locations/us-central1/jobs?alt=json>:
response: <{'vary': 'Origin, X-Origin, Referer', 'content-type': 'application/json; charset=UTF-8',
'date': 'Tue, 16 Jul 2019 04:18:05 GMT', 'server': 'ESF', 'cache-control': 'private', 'x-xss-protection':
'0', 'x-frame-options': 'SAMEORIGIN', 'x-content-type-options': 'nosniff', 'transfer-encoding':
'chunked', 'status': '429', 'content-length': '598', '-content-encoding': 'gzip'}>, content
<{
  "error": {
    "code": 429,
    "message": "Quota exceeded for quota metric 'dataflow.googleapis.com/create_requests'
and limit 'CreateRequestsPerMinutePerUser' of service 'dataflow.googleapis.com' for consumer
'project_number:844138762903'.",
    "status": "RESOURCE_EXHAUSTED",
    "details": [
      {
        "@type": "type.googleapis.com/google.rpc.Help",
        "links": [
          {
            "description": "Google developer console API key",
            "url": "https://console.developers.google.com/project/844138762903/apiui/credential"
          }
        ]
      }
    ]
  }
}
>
google.auth.transport._http_client: DEBUG: Making request: GET http://169.254.169.254
google.auth.transport._http_client: DEBUG: Making request: GET http://metadata.google.internal/computeMetadata/v1/project/project-id
urllib3.util.retry: DEBUG: Converted retries value: 3 -> Retry(total=3, connect=None, read=None,
redirect=None, status=None)
google.auth.transport.requests: DEBUG: Making request: GET http://metadata.google.internal/computeMetadata/v1/instance/service-accounts/default/?recursive=true
urllib3.connectionpool: DEBUG: Starting new HTTP connection (1): metadata.google.internal:80
urllib3.connectionpool: DEBUG: http://metadata.google.internal:80 "GET /computeMetadata/v1/instance/service-accounts/default/?recursive=true
HTTP/1.1" 200 144
google.auth.transport.requests: DEBUG: Making request: GET http://metadata.google.internal/computeMetadata/v1/instance/service-accounts/844138762903-compute@developer.gserviceaccount.com/token
urllib3.connectionpool: DEBUG: http://metadata.google.internal:80 "GET /computeMetadata/v1/instance/service-accounts/844138762903-compute@developer.gserviceaccount.com/token
HTTP/1.1" 200 176
urllib3.connectionpool: DEBUG: Starting new HTTPS connection (1): www.googleapis.com:443
urllib3.connectionpool: DEBUG: https://www.googleapis.com:443 "DELETE /bigquery/v2/projects/apache-beam-testing/datasets/game_stats_it_dataset1563250635?deleteContents=true
HTTP/1.1" 204 0
--------------------- >> end captured logging << ---------------------
<https://builds.apache.org/job/beam_PostCommit_Python3_Verify/ws/src/sdks/python/apache_beam/io/gcp/bigquery.py>:1140:
BeamDeprecationWarning: options is deprecated since First stable release. References to <pipeline>.options
will not be supported
  method_to_use = self._compute_method(p, p.options)
Found: https://console.cloud.google.com/dataflow/jobsDetail/locations/us-central1/jobs/2019-07-15_21_18_17-6186726751427846044?project=apache-beam-testing.
Found: https://console.cloud.google.com/dataflow/jobsDetail/locations/us-central1/jobs/2019-07-15_21_28_35-13979488480379234482?project=apache-beam-testing.
Found: https://console.cloud.google.com/dataflow/jobsDetail/locations/us-central1/jobs/2019-07-15_21_38_06-5334962156302733796?project=apache-beam-testing.
Found: https://console.cloud.google.com/dataflow/jobsDetail/locations/us-central1/jobs/2019-07-15_21_46_07-1486733599291317002?project=apache-beam-testing.
Found: https://console.cloud.google.com/dataflow/jobsDetail/locations/us-central1/jobs/2019-07-15_21_17_28-716456918282318109?project=apache-beam-testing.
<https://builds.apache.org/job/beam_PostCommit_Python3_Verify/ws/src/sdks/python/apache_beam/runners/dataflow/dataflow_runner.py>:686:
BeamDeprecationWarning: BigQuerySink is deprecated since 2.11.0. Use WriteToBigQuery instead.
  kms_key=transform.kms_key))
Found: https://console.cloud.google.com/dataflow/jobsDetail/locations/us-central1/jobs/2019-07-15_21_41_46-4329413455203579965?project=apache-beam-testing.
<https://builds.apache.org/job/beam_PostCommit_Python3_Verify/ws/src/sdks/python/apache_beam/io/fileio_test.py>:232:
FutureWarning: MatchAll is experimental.
  | 'GetPath' >> beam.Map(lambda metadata: metadata.path))
<https://builds.apache.org/job/beam_PostCommit_Python3_Verify/ws/src/sdks/python/apache_beam/io/fileio_test.py>:243:
FutureWarning: MatchAll is experimental.
  | 'Checksums' >> beam.Map(compute_hash))
<https://builds.apache.org/job/beam_PostCommit_Python3_Verify/ws/src/sdks/python/apache_beam/io/fileio_test.py>:243:
FutureWarning: ReadMatches is experimental.
  | 'Checksums' >> beam.Map(compute_hash))
Found: https://console.cloud.google.com/dataflow/jobsDetail/locations/us-central1/jobs/2019-07-15_21_17_37-12645820518937143065?project=apache-beam-testing.
Found: https://console.cloud.google.com/dataflow/jobsDetail/locations/us-central1/jobs/2019-07-15_21_30_21-5627222011912446785?project=apache-beam-testing.
<https://builds.apache.org/job/beam_PostCommit_Python3_Verify/ws/src/sdks/python/apache_beam/io/gcp/bigquery.py>:1140:
BeamDeprecationWarning: options is deprecated since First stable release. References to <pipeline>.options
will not be supported
Found: https://console.cloud.google.com/dataflow/jobsDetail/locations/us-central1/jobs/2019-07-15_21_39_51-17860202596227362837?project=apache-beam-testing.
  method_to_use = self._compute_method(p, p.options)
Found: https://console.cloud.google.com/dataflow/jobsDetail/locations/us-central1/jobs/2019-07-15_21_49_29-4959860874834458039?project=apache-beam-testing.
<https://builds.apache.org/job/beam_PostCommit_Python3_Verify/ws/src/sdks/python/apache_beam/io/gcp/bigquery_file_loads.py>:557:
BeamDeprecationWarning: options is deprecated since First stable release. References to <pipeline>.options
will not be supported
  temp_location = p.options.view_as(GoogleCloudOptions).temp_location
Found: https://console.cloud.google.com/dataflow/jobsDetail/locations/us-central1/jobs/2019-07-15_21_17_29-12678841152789572845?project=apache-beam-testing.
Found: https://console.cloud.google.com/dataflow/jobsDetail/locations/us-central1/jobs/2019-07-15_21_39_32-2952888061014175921?project=apache-beam-testing.
Found: https://console.cloud.google.com/dataflow/jobsDetail/locations/us-central1/jobs/2019-07-15_21_48_19-1890221685033632252?project=apache-beam-testing.
Found: https://console.cloud.google.com/dataflow/jobsDetail/locations/us-central1/jobs/2019-07-15_21_17_32-17377158759681375568?project=apache-beam-testing.
<https://builds.apache.org/job/beam_PostCommit_Python3_Verify/ws/src/sdks/python/apache_beam/io/gcp/bigquery.py>:1140:
BeamDeprecationWarning: options is deprecated since First stable release. References to <pipeline>.options
will not be supported
Found: https://console.cloud.google.com/dataflow/jobsDetail/locations/us-central1/jobs/2019-07-15_21_26_23-13218063131190342264?project=apache-beam-testing.
  method_to_use = self._compute_method(p, p.options)
Found: https://console.cloud.google.com/dataflow/jobsDetail/locations/us-central1/jobs/2019-07-15_21_37_19-7750547774230802938?project=apache-beam-testing.
<https://builds.apache.org/job/beam_PostCommit_Python3_Verify/ws/src/sdks/python/apache_beam/io/gcp/bigquery_file_loads.py>:557:
BeamDeprecationWarning: options is deprecated since First stable release. References to <pipeline>.options
will not be supported
Found: https://console.cloud.google.com/dataflow/jobsDetail/locations/us-central1/jobs/2019-07-15_21_47_47-3704824859826271568?project=apache-beam-testing.
  temp_location = p.options.view_as(GoogleCloudOptions).temp_location
Found: https://console.cloud.google.com/dataflow/jobsDetail/locations/us-central1/jobs/2019-07-15_21_56_48-11982131543175109928?project=apache-beam-testing.
Found: https://console.cloud.google.com/dataflow/jobsDetail/locations/us-central1/jobs/2019-07-15_21_17_27-3223256434106732310?project=apache-beam-testing.
<https://builds.apache.org/job/beam_PostCommit_Python3_Verify/ws/src/sdks/python/apache_beam/runners/dataflow/dataflow_runner.py>:686:
BeamDeprecationWarning: BigQuerySink is deprecated since 2.11.0. Use WriteToBigQuery instead.
  kms_key=transform.kms_key))
Found: https://console.cloud.google.com/dataflow/jobsDetail/locations/us-central1/jobs/2019-07-15_21_25_05-7286005445936673204?project=apache-beam-testing.
Found: https://console.cloud.google.com/dataflow/jobsDetail/locations/us-central1/jobs/2019-07-15_21_34_01-18264214151514242814?project=apache-beam-testing.
Found: https://console.cloud.google.com/dataflow/jobsDetail/locations/us-central1/jobs/2019-07-15_21_44_17-7414169268417247156?project=apache-beam-testing.
Found: https://console.cloud.google.com/dataflow/jobsDetail/locations/us-central1/jobs/2019-07-15_21_54_57-10832049479291243760?project=apache-beam-testing.
Found: https://console.cloud.google.com/dataflow/jobsDetail/locations/us-central1/jobs/2019-07-15_22_04_03-18410411583113877868?project=apache-beam-testing.
Found: https://console.cloud.google.com/dataflow/jobsDetail/locations/us-central1/jobs/2019-07-15_21_17_38-18411864917882685219?project=apache-beam-testing.
<https://builds.apache.org/job/beam_PostCommit_Python3_Verify/ws/src/sdks/python/apache_beam/runners/dataflow/dataflow_runner.py>:686:
BeamDeprecationWarning: BigQuerySink is deprecated since 2.11.0. Use WriteToBigQuery instead.
  kms_key=transform.kms_key))
Found: https://console.cloud.google.com/dataflow/jobsDetail/locations/us-central1/jobs/2019-07-15_21_26_21-14807111498267104730?project=apache-beam-testing.
<https://builds.apache.org/job/beam_PostCommit_Python3_Verify/ws/src/sdks/python/apache_beam/io/gcp/big_query_query_to_table_pipeline.py>:73:
BeamDeprecationWarning: BigQuerySink is deprecated since 2.11.0. Use WriteToBigQuery instead.
  kms_key=kms_key))
Found: https://console.cloud.google.com/dataflow/jobsDetail/locations/us-central1/jobs/2019-07-15_21_35_03-8708079093877770064?project=apache-beam-testing.
Found: https://console.cloud.google.com/dataflow/jobsDetail/locations/us-central1/jobs/2019-07-15_21_43_19-13565929707281087401?project=apache-beam-testing.
Found: https://console.cloud.google.com/dataflow/jobsDetail/locations/us-central1/jobs/2019-07-15_21_52_15-4168895684092381347?project=apache-beam-testing.
Found: https://console.cloud.google.com/dataflow/jobsDetail/locations/us-central1/jobs/2019-07-15_21_17_36-8858783098484328687?project=apache-beam-testing.
<https://builds.apache.org/job/beam_PostCommit_Python3_Verify/ws/src/sdks/python/apache_beam/runners/dataflow/dataflow_runner.py>:686:
BeamDeprecationWarning: BigQuerySink is deprecated since 2.11.0. Use WriteToBigQuery instead.
  kms_key=transform.kms_key))
Found: https://console.cloud.google.com/dataflow/jobsDetail/locations/us-central1/jobs/2019-07-15_21_26_43-5477301537804588874?project=apache-beam-testing.
Found: https://console.cloud.google.com/dataflow/jobsDetail/locations/us-central1/jobs/2019-07-15_21_36_03-8708126355621810471?project=apache-beam-testing.
Found: https://console.cloud.google.com/dataflow/jobsDetail/locations/us-central1/jobs/2019-07-15_21_45_34-13203760289986641514?project=apache-beam-testing.
Found: https://console.cloud.google.com/dataflow/jobsDetail/locations/us-central1/jobs/2019-07-15_21_54_27-16193999258040630983?project=apache-beam-testing.

----------------------------------------------------------------------
XML: <https://builds.apache.org/job/beam_PostCommit_Python3_Verify/ws/src/sdks/python/nosetests.xml>
----------------------------------------------------------------------
Ran 42 tests in 3379.511s

FAILED (SKIP=5, errors=1)

> Task :sdks:python:test-suites:dataflow:py37:postCommitIT FAILED

FAILURE: Build failed with an exception.

* Where:
Build file '<https://builds.apache.org/job/beam_PostCommit_Python3_Verify/ws/src/sdks/python/test-suites/dataflow/py37/build.gradle'>
line: 78

* What went wrong:
Execution failed for task ':sdks:python:test-suites:dataflow:py37:postCommitIT'.
> Process 'command 'sh'' finished with non-zero exit value 1

* Try:
Run with --stacktrace option to get the stack trace. Run with --info or --debug option to
get more log output. Run with --scan to get full insights.

* Get more help at https://help.gradle.org

Deprecated Gradle features were used in this build, making it incompatible with Gradle 6.0.
Use '--warning-mode all' to show the individual deprecation warnings.
See https://docs.gradle.org/5.2.1/userguide/command_line_interface.html#sec:command_line_warnings

BUILD FAILED in 57m 21s
77 actionable tasks: 60 executed, 17 from cache

Publishing build scan...
https://gradle.com/s/knl4ydcdumwfi

Build step 'Invoke Gradle script' changed build result to FAILURE
Build step 'Invoke Gradle script' marked build as failure

---------------------------------------------------------------------
To unsubscribe, e-mail: builds-unsubscribe@beam.apache.org
For additional commands, e-mail: builds-help@beam.apache.org


Mime
View raw message