beam-builds mailing list archives

Site index · List index
Message view « Date » · « Thread »
Top « Date » · « Thread »
From Apache Jenkins Server <jenk...@builds.apache.org>
Subject Build failed in Jenkins: beam_PreCommit_Java_Cron #1555
Date Tue, 16 Jul 2019 12:25:05 GMT
See <https://builds.apache.org/job/beam_PreCommit_Java_Cron/1555/display/redirect?page=changes>

Changes:

[lgajowy] [BEAM-6675] Generate JDBC statement and preparedStatementSetter

------------------------------------------
[...truncated 476.10 KB...]
> Task :sdks:java:io:elasticsearch:assemble
> Task :sdks:java:io:elasticsearch:analyzeClassesDependencies SKIPPED
> Task :sdks:java:io:elasticsearch:compileTestJava NO-SOURCE
> Task :sdks:java:io:elasticsearch:testClasses UP-TO-DATE
> Task :sdks:java:io:elasticsearch:analyzeTestClassesDependencies SKIPPED
> Task :sdks:java:io:elasticsearch:analyzeDependencies SKIPPED
> Task :sdks:java:io:elasticsearch:checkstyleMain
> Task :runners:samza:job-server:startShadowScripts
> Task :runners:samza:job-server:shadowDistTar
> Task :runners:extensions-java:metrics:compileTestJava
> Task :runners:extensions-java:metrics:testClasses
> Task :runners:extensions-java:metrics:analyzeTestClassesDependencies SKIPPED
> Task :runners:extensions-java:metrics:analyzeDependencies SKIPPED
> Task :runners:extensions-java:metrics:checkstyleMain
> Task :runners:extensions-java:metrics:checkstyleTest
> Task :sdks:java:core:checkstyleTest
> Task :runners:extensions-java:metrics:javadoc
> Task :sdks:java:extensions:google-cloud-platform-core:test
> Task :sdks:java:extensions:google-cloud-platform-core:spotbugsMain
> Task :sdks:java:extensions:google-cloud-platform-core:check
> Task :sdks:java:extensions:google-cloud-platform-core:build
> Task :sdks:java:io:elasticsearch:checkstyleTest NO-SOURCE
> Task :runners:samza:job-server:shadowDistZip
> Task :runners:samza:job-server:assemble
> Task :runners:samza:job-server:analyzeClassesDependencies SKIPPED
> Task :runners:samza:job-server:analyzeTestClassesDependencies SKIPPED
> Task :runners:samza:job-server:analyzeDependencies SKIPPED
> Task :runners:samza:job-server:checkstyleMain NO-SOURCE
> Task :runners:samza:job-server:checkstyleTest NO-SOURCE
> Task :runners:samza:job-server:javadoc NO-SOURCE
> Task :runners:samza:job-server:spotbugsMain NO-SOURCE

> Task :sdks:java:extensions:protobuf:compileTestJava
Note: Some input files use or override a deprecated API.
Note: Recompile with -Xlint:deprecation for details.

> Task :runners:samza:job-server:test NO-SOURCE
> Task :runners:samza:job-server:check UP-TO-DATE
> Task :runners:samza:job-server:build
> Task :runners:samza:job-server:buildDependents
> Task :sdks:java:io:hadoop-common:assemble
> Task :sdks:java:io:hadoop-common:analyzeClassesDependencies SKIPPED
> Task :sdks:java:extensions:protobuf:testClasses

> Task :sdks:java:fn-execution:compileTestJava
Note: Some input files use or override a deprecated API.
Note: Recompile with -Xlint:deprecation for details.
Note: Some input files use unchecked or unsafe operations.
Note: Recompile with -Xlint:unchecked for details.

> Task :sdks:java:extensions:protobuf:analyzeTestClassesDependencies SKIPPED
> Task :sdks:java:extensions:protobuf:analyzeDependencies SKIPPED
> Task :sdks:java:fn-execution:testClasses
> Task :sdks:java:fn-execution:analyzeTestClassesDependencies SKIPPED
> Task :sdks:java:fn-execution:analyzeDependencies SKIPPED
> Task :sdks:java:extensions:protobuf:checkstyleMain
> Task :sdks:java:fn-execution:checkstyleMain

> Task :sdks:java:core:javadoc
<https://builds.apache.org/job/beam_PreCommit_Java_Cron/ws/src/sdks/java/core/src/main/java/org/apache/beam/sdk/transforms/Watch.java>:169:
error: cannot find symbol
      extends PTransform<PCollection<InputT>, PCollection<KV<InputT, OutputT>>>
{
                         ^
  symbol:   class PCollection
  location: class Watch
<https://builds.apache.org/job/beam_PreCommit_Java_Cron/ws/src/sdks/java/core/src/main/java/org/apache/beam/sdk/transforms/Watch.java>:169:
error: cannot find symbol
      extends PTransform<PCollection<InputT>, PCollection<KV<InputT, OutputT>>>
{
                                              ^
  symbol:   class PCollection
  location: class Watch
<https://builds.apache.org/job/beam_PreCommit_Java_Cron/ws/src/sdks/java/core/src/main/java/org/apache/beam/sdk/transforms/Watch.java>:169:
error: cannot find symbol
      extends PTransform<PCollection<InputT>, PCollection<KV<InputT, OutputT>>>
{
                                                          ^
  symbol:   class KV
  location: class Watch

> Task :sdks:java:extensions:protobuf:checkstyleTest
> Task :sdks:java:fn-execution:checkstyleTest
> Task :sdks:java:io:elasticsearch:javadoc
> Task :sdks:java:extensions:protobuf:javadoc

> Task :sdks:java:core:javadoc
<https://builds.apache.org/job/beam_PreCommit_Java_Cron/ws/src/sdks/java/core/src/main/java/org/apache/beam/sdk/transforms/CombineFns.java>:118:
warning - Tag @link: can't find with(SimpleFunction, CombineFn, TupleTag) in org.apache.beam.sdk.transforms.CombineFns.ComposeCombineFnBuilder
<https://builds.apache.org/job/beam_PreCommit_Java_Cron/ws/src/sdks/java/core/src/main/java/org/apache/beam/sdk/transforms/CombineFns.java>:144:
warning - Tag @link: can't find with(SimpleFunction, CombineFnWithContext, TupleTag) in org.apache.beam.sdk.transforms.CombineFns.ComposeCombineFnBuilder

> Task :sdks:java:io:elasticsearch:spotbugsMain
The following classes needed for analysis were missing:
  com.google.auto.value.AutoValue$Builder
  com.google.auto.value.AutoValue

> Task :sdks:java:io:elasticsearch:test NO-SOURCE
> Task :sdks:java:io:elasticsearch:check
> Task :sdks:java:io:elasticsearch:build
> Task :runners:extensions-java:metrics:test
> Task :runners:extensions-java:metrics:spotbugsMain
> Task :runners:extensions-java:metrics:check
> Task :runners:extensions-java:metrics:build
> Task :runners:extensions-java:metrics:buildDependents

> Task :sdks:java:core:javadoc
<https://builds.apache.org/job/beam_PreCommit_Java_Cron/ws/src/sdks/java/core/src/main/java/org/apache/beam/sdk/io/AvroIO.java>:283:
warning - Tag @link: can't find continuously(Duration, TerminationCondition) in org.apache.beam.sdk.io.FileIO.Match
<https://builds.apache.org/job/beam_PreCommit_Java_Cron/ws/src/sdks/java/core/src/main/java/org/apache/beam/sdk/io/AvroIO.java>:936:
warning - Tag @link: can't find watchForNewFiles in org.apache.beam.sdk.io.Read
<https://builds.apache.org/job/beam_PreCommit_Java_Cron/ws/src/sdks/java/core/src/main/java/org/apache/beam/sdk/io/AvroIO.java>:930:
warning - Tag @link: can't find withEmptyMatchTreatment in org.apache.beam.sdk.io.Read
<https://builds.apache.org/job/beam_PreCommit_Java_Cron/ws/src/sdks/java/core/src/main/java/org/apache/beam/sdk/io/AvroIO.java>:948:
warning - Tag @link: can't find withHintMatchesManyFiles() in org.apache.beam.sdk.io.Read
<https://builds.apache.org/job/beam_PreCommit_Java_Cron/ws/src/sdks/java/core/src/main/java/org/apache/beam/sdk/io/AvroIO.java>:1118:
warning - Tag @link: can't find watchForNewFiles in org.apache.beam.sdk.io.Read
<https://builds.apache.org/job/beam_PreCommit_Java_Cron/ws/src/sdks/java/core/src/main/java/org/apache/beam/sdk/io/AvroIO.java>:1112:
warning - Tag @link: can't find withEmptyMatchTreatment in org.apache.beam.sdk.io.Read
<https://builds.apache.org/job/beam_PreCommit_Java_Cron/ws/src/sdks/java/core/src/main/java/org/apache/beam/sdk/io/AvroIO.java>:816:
warning - Tag @link: can't find watchForNewFiles in org.apache.beam.sdk.io.Read
<https://builds.apache.org/job/beam_PreCommit_Java_Cron/ws/src/sdks/java/core/src/main/java/org/apache/beam/sdk/io/AvroIO.java>:810:
warning - Tag @link: can't find withEmptyMatchTreatment in org.apache.beam.sdk.io.Read
<https://builds.apache.org/job/beam_PreCommit_Java_Cron/ws/src/sdks/java/core/src/main/java/org/apache/beam/sdk/io/AvroIO.java>:1280:
warning - Tag @link: can't find to(FilenamePolicy) in org.apache.beam.sdk.io.AvroIO.TypedWrite
<https://builds.apache.org/job/beam_PreCommit_Java_Cron/ws/src/sdks/java/core/src/main/java/org/apache/beam/sdk/io/AvroIO.java>:1280:
warning - Tag @link: can't find to(FilenamePolicy) in org.apache.beam.sdk.io.AvroIO.TypedWrite
<https://builds.apache.org/job/beam_PreCommit_Java_Cron/ws/src/sdks/java/core/src/main/java/org/apache/beam/sdk/io/AvroIO.java>:1257:
warning - Tag @link: can't find to(FilenamePolicy) in org.apache.beam.sdk.io.AvroIO.TypedWrite
<https://builds.apache.org/job/beam_PreCommit_Java_Cron/ws/src/sdks/java/core/src/main/java/org/apache/beam/sdk/io/AvroIO.java>:1578:
warning - Tag @link: can't find to(FilenamePolicy) in org.apache.beam.sdk.io.AvroIO.TypedWrite
<https://builds.apache.org/job/beam_PreCommit_Java_Cron/ws/src/sdks/java/core/src/main/java/org/apache/beam/sdk/io/DynamicFileDestinations.java>:137:
warning - Tag @link: can't find constant(FilenamePolicy, SerializableFunction) in org.apache.beam.sdk.io.DynamicFileDestinations

> Task :sdks:java:fn-execution:javadoc

> Task :sdks:java:io:hadoop-common:compileTestJava
Note: Some input files use or override a deprecated API.
Note: Recompile with -Xlint:deprecation for details.

> Task :sdks:java:core:javadoc
<https://builds.apache.org/job/beam_PreCommit_Java_Cron/ws/src/sdks/java/core/src/main/java/org/apache/beam/sdk/io/FileBasedSource.java>:204:
warning - Tag @link: can't find FileBasedSource(Metadata, long, long, long) in org.apache.beam.sdk.io.FileBasedSource
<https://builds.apache.org/job/beam_PreCommit_Java_Cron/ws/src/sdks/java/core/src/main/java/org/apache/beam/sdk/io/FileIO.java>:304:
warning - Tag @link: can't find withNaming(Write.FileNaming) in org.apache.beam.sdk.io.FileIO.Write
<https://builds.apache.org/job/beam_PreCommit_Java_Cron/ws/src/sdks/java/core/src/main/java/org/apache/beam/sdk/io/FileIO.java>:304:
warning - Tag @link: can't find via(Contextful, Sink) in org.apache.beam.sdk.io.FileIO.Write
<https://builds.apache.org/job/beam_PreCommit_Java_Cron/ws/src/sdks/java/core/src/main/java/org/apache/beam/sdk/io/FileIO.java>:324:
warning - Tag @link: can't find continuously(Duration,
 TerminationCondition) in org.apache.beam.sdk.io.FileIO.MatchAll
<https://builds.apache.org/job/beam_PreCommit_Java_Cron/ws/src/sdks/java/core/src/main/java/org/apache/beam/sdk/io/TextIO.java>:182:
warning - Tag @link: can't find continuously(Duration, TerminationCondition) in org.apache.beam.sdk.io.FileIO.Match
<https://builds.apache.org/job/beam_PreCommit_Java_Cron/ws/src/sdks/java/core/src/main/java/org/apache/beam/sdk/io/TextIO.java>:182:
warning - Tag @link: can't find to(FilenamePolicy) in org.apache.beam.sdk.io.TextIO.Write
<https://builds.apache.org/job/beam_PreCommit_Java_Cron/ws/src/sdks/java/core/src/main/java/org/apache/beam/sdk/io/TextIO.java>:182:
warning - Tag @link: can't find to(DynamicDestinations) in org.apache.beam.sdk.io.TextIO.Write
<https://builds.apache.org/job/beam_PreCommit_Java_Cron/ws/src/sdks/java/core/src/main/java/org/apache/beam/sdk/io/TextIO.java>:257:
warning - Tag @link: can't find to(DynamicDestinations) in org.apache.beam.sdk.io.TextIO.Write
<https://builds.apache.org/job/beam_PreCommit_Java_Cron/ws/src/sdks/java/core/src/main/java/org/apache/beam/sdk/io/TextIO.java>:500:
warning - Tag @link: can't find watchForNewFiles(Duration, TerminationCondition) in org.apache.beam.sdk.io.Read
<https://builds.apache.org/job/beam_PreCommit_Java_Cron/ws/src/sdks/java/core/src/main/java/org/apache/beam/sdk/io/TextIO.java>:494:
warning - Tag @link: can't find withEmptyMatchTreatment in org.apache.beam.sdk.io.Read
<https://builds.apache.org/job/beam_PreCommit_Java_Cron/ws/src/sdks/java/core/src/main/java/org/apache/beam/sdk/io/TextIO.java>:562:
warning - Tag @link: can't find withDelimiter in org.apache.beam.sdk.io.Read
<https://builds.apache.org/job/beam_PreCommit_Java_Cron/ws/src/sdks/java/core/src/main/java/org/apache/beam/sdk/io/TextIO.java>:733:
warning - Tag @link: can't find to(FilenamePolicy) in org.apache.beam.sdk.io.TextIO.TypedWrite
<https://builds.apache.org/job/beam_PreCommit_Java_Cron/ws/src/sdks/java/core/src/main/java/org/apache/beam/sdk/io/TextIO.java>:807:
warning - Tag @link: can't find to(DynamicDestinations) in org.apache.beam.sdk.io.TextIO.TypedWrite
<https://builds.apache.org/job/beam_PreCommit_Java_Cron/ws/src/sdks/java/core/src/main/java/org/apache/beam/sdk/io/TextIO.java>:833:
warning - Tag @link: can't find to(FilenamePolicy) in org.apache.beam.sdk.io.TextIO.TypedWrite
<https://builds.apache.org/job/beam_PreCommit_Java_Cron/ws/src/sdks/java/core/src/main/java/org/apache/beam/sdk/io/TextIO.java>:833:
warning - Tag @link: can't find to(DynamicDestinations) in org.apache.beam.sdk.io.TextIO.TypedWrite
<https://builds.apache.org/job/beam_PreCommit_Java_Cron/ws/src/sdks/java/core/src/main/java/org/apache/beam/sdk/io/TextIO.java>:845:
warning - Tag @link: can't find to(FilenamePolicy) in org.apache.beam.sdk.io.TextIO.TypedWrite
<https://builds.apache.org/job/beam_PreCommit_Java_Cron/ws/src/sdks/java/core/src/main/java/org/apache/beam/sdk/io/TextIO.java>:845:
warning - Tag @link: can't find to(DynamicDestinations) in org.apache.beam.sdk.io.TextIO.TypedWrite
<https://builds.apache.org/job/beam_PreCommit_Java_Cron/ws/src/sdks/java/core/src/main/java/org/apache/beam/sdk/io/TextIO.java>:1106:
warning - Tag @link: can't find to(DynamicDestinations) in org.apache.beam.sdk.io.TextIO.TypedWrite
<https://builds.apache.org/job/beam_PreCommit_Java_Cron/ws/src/sdks/java/core/src/main/java/org/apache/beam/sdk/io/TextIO.java>:1093:
warning - Tag @link: can't find to(FilenamePolicy) in org.apache.beam.sdk.io.TextIO.TypedWrite
<https://builds.apache.org/job/beam_PreCommit_Java_Cron/ws/src/sdks/java/core/src/main/java/org/apache/beam/sdk/io/TextIO.java>:1119:
warning - Tag @link: can't find to(SerializableFunction, Params) in org.apache.beam.sdk.io.TextIO.TypedWrite
<https://builds.apache.org/job/beam_PreCommit_Java_Cron/ws/src/sdks/java/core/src/main/java/org/apache/beam/sdk/io/TextIO.java>:1207:
warning - Tag @link: can't find to(DynamicDestinations) in org.apache.beam.sdk.io.TextIO.Write
<https://builds.apache.org/job/beam_PreCommit_Java_Cron/ws/src/sdks/java/core/src/main/java/org/apache/beam/sdk/io/TextIO.java>:1207:
warning - Tag @link: can't find to(SerializableFunction, Params) in org.apache.beam.sdk.io.TextIO.Write
<https://builds.apache.org/job/beam_PreCommit_Java_Cron/ws/src/sdks/java/core/src/main/java/org/apache/beam/sdk/io/TextIO.java>:1175:
warning - Tag @link: can't find withWritableByteChannelFactory(WritableByteChannelFactory)
in org.apache.beam.sdk.io.TextIO.TypedWrite

> Task :sdks:java:extensions:protobuf:test
> Task :sdks:java:extensions:protobuf:spotbugsMain
> Task :sdks:java:extensions:protobuf:check
> Task :sdks:java:extensions:protobuf:build
> Task :sdks:java:io:hadoop-common:testClasses
> Task :sdks:java:io:hadoop-common:analyzeTestClassesDependencies SKIPPED
> Task :sdks:java:io:hadoop-common:analyzeDependencies SKIPPED
> Task :sdks:java:io:common:test
> Task :sdks:java:io:common:check
> Task :sdks:java:io:common:build
> Task :sdks:java:io:hadoop-common:checkstyleMain
> Task :sdks:java:io:hadoop-common:checkstyleTest

> Task :sdks:java:core:javadoc
<https://builds.apache.org/job/beam_PreCommit_Java_Cron/ws/src/sdks/java/core/src/main/java/org/apache/beam/sdk/options/SdkHarnessOptions.java>:112:
warning - Tag @link: can't find addOverrideForName(String, LogLevel) in org.apache.beam.sdk.options.SdkHarnessOptions.SdkHarnessLogLevelOverrides
<https://builds.apache.org/job/beam_PreCommit_Java_Cron/ws/src/sdks/java/core/src/main/java/org/apache/beam/sdk/options/SdkHarnessOptions.java>:124:
warning - Tag @link: can't find addOverrideForName(String, LogLevel) in org.apache.beam.sdk.options.SdkHarnessOptions.SdkHarnessLogLevelOverrides
<https://builds.apache.org/job/beam_PreCommit_Java_Cron/ws/src/sdks/java/core/src/main/java/org/apache/beam/sdk/state/StateSpecs.java>:73:
warning - Tag @see: can't find combining(Coder, CombineFn) in org.apache.beam.sdk.state.StateSpecs
<https://builds.apache.org/job/beam_PreCommit_Java_Cron/ws/src/sdks/java/core/src/main/java/org/apache/beam/sdk/state/StateSpecs.java>:91:
warning - Tag @see: can't find combining(Coder, CombineFnWithContext) in org.apache.beam.sdk.state.StateSpecs
<https://builds.apache.org/job/beam_PreCommit_Java_Cron/ws/src/sdks/java/core/src/main/java/org/apache/beam/sdk/state/StateSpecs.java>:102:
warning - Tag @link: can't find combining(CombineFn) in org.apache.beam.sdk.state.StateSpecs
<https://builds.apache.org/job/beam_PreCommit_Java_Cron/ws/src/sdks/java/core/src/main/java/org/apache/beam/sdk/state/StateSpecs.java>:121:
warning - Tag @link: can't find combining(CombineFnWithContext) in org.apache.beam.sdk.state.StateSpecs
47 warnings

> Task :sdks:java:io:hadoop-common:javadoc
> Task :sdks:java:extensions:sql:hcatalog:compileJava
> Task :sdks:java:extensions:sql:datacatalog:compileJava
> Task :sdks:java:extensions:sql:datacatalog:classes
> Task :sdks:java:io:hadoop-common:test
> Task :sdks:java:extensions:sql:hcatalog:classes
> Task :sdks:java:io:hadoop-common:spotbugsMain
> Task :sdks:java:io:hadoop-common:check
> Task :sdks:java:io:hadoop-common:build
> Task :sdks:java:io:hadoop-common:buildDependents

> Task :sdks:java:extensions:sql:datacatalog:javadoc
javadoc: warning - Multiple sources of package comments found for package "javax.annotation"
1 warning

> Task :sdks:java:extensions:sql:hcatalog:javadoc
> Task :sdks:java:javadoc:allJavadoc
> Task :sdks:java:io:elasticsearch-tests:elasticsearch-tests-2:check
> Task :sdks:java:io:elasticsearch-tests:elasticsearch-tests-2:build
> Task :sdks:java:io:elasticsearch-tests:elasticsearch-tests-2:buildDependents
> Task :sdks:java:fn-execution:test
> Task :sdks:java:fn-execution:spotbugsMain
> Task :sdks:java:fn-execution:check
> Task :sdks:java:fn-execution:build
> Task :sdks:java:extensions:sql:jdbc:shadowJarTest
> Task :sdks:java:extensions:sql:jdbc:preCommit
> Task :sdks:java:io:elasticsearch-tests:elasticsearch-tests-6:check
> Task :sdks:java:io:elasticsearch-tests:elasticsearch-tests-6:build
> Task :sdks:java:io:elasticsearch-tests:elasticsearch-tests-6:buildDependents
> Task :sdks:java:io:elasticsearch-tests:elasticsearch-tests-5:check
> Task :sdks:java:io:elasticsearch-tests:elasticsearch-tests-5:build
> Task :sdks:java:io:elasticsearch-tests:elasticsearch-tests-5:buildDependents
> Task :sdks:java:io:elasticsearch-tests:elasticsearch-tests-common:buildDependents
> Task :sdks:java:io:elasticsearch:buildDependents

> Task :sdks:java:core:spotbugsMain
The following classes needed for analysis were missing:
  com.google.auto.value.AutoValue$Builder
  com.google.auto.value.AutoValue

> Task :sdks:java:core:test
> Task :sdks:java:core:validateShadedJarDoesntLeakNonProjectClasses
> Task :sdks:java:core:check
> Task :sdks:java:core:build
> Task :sdks:java:core:buildNeeded
> Task :sdks:java:testing:nexmark:check
> Task :sdks:java:testing:nexmark:build
> Task :sdks:java:testing:nexmark:buildDependents
> Task :sdks:java:extensions:sql:buildDependents
> Task :sdks:java:extensions:join-library:buildDependents
> Task :sdks:java:io:google-cloud-platform:buildDependents
> Task :sdks:java:io:kafka:buildDependents
> Task :sdks:java:testing:test-utils:buildDependents
> Task :sdks:java:extensions:protobuf:buildDependents
> Task :sdks:java:io:synthetic:buildDependents
> Task :sdks:java:io:common:buildDependents
> Task :runners:direct-java:buildDependents
> Task :runners:local-java:buildDependents

FAILURE: Build failed with an exception.

* What went wrong:
Execution failed for task ':runners:samza:test'.
> There were failing tests. See the report at: file://<https://builds.apache.org/job/beam_PreCommit_Java_Cron/ws/src/runners/samza/build/reports/tests/test/index.html>

* Try:
Run with --stacktrace option to get the stack trace. Run with --info or --debug option to
get more log output. Run with --scan to get full insights.

* Get more help at https://help.gradle.org

Deprecated Gradle features were used in this build, making it incompatible with Gradle 6.0.
Use '--warning-mode all' to show the individual deprecation warnings.
See https://docs.gradle.org/5.2.1/userguide/command_line_interface.html#sec:command_line_warnings

BUILD FAILED in 20m 37s
789 actionable tasks: 754 executed, 35 from cache

Publishing build scan...
https://gradle.com/s/q7wbxkutwf2bc

Build step 'Invoke Gradle script' changed build result to FAILURE
Build step 'Invoke Gradle script' marked build as failure

---------------------------------------------------------------------
To unsubscribe, e-mail: builds-unsubscribe@beam.apache.org
For additional commands, e-mail: builds-help@beam.apache.org


Mime
View raw message