beam-builds mailing list archives

Site index · List index
Message view « Date » · « Thread »
Top « Date » · « Thread »
From Apache Jenkins Server <jenk...@builds.apache.org>
Subject Build failed in Jenkins: beam_PostCommit_Python2 #20
Date Mon, 22 Jul 2019 16:34:22 GMT
See <https://builds.apache.org/job/beam_PostCommit_Python2/20/display/redirect?page=changes>

Changes:

[ehudm] [BEAM-7679] Add randomness to ITs' BQ dataset name

------------------------------------------
[...truncated 408.18 KB...]
[CHAIN MapPartition (MapPartition at [2]ExternalTransform(pytest:beam:transforms:count)/Combine.perKey(Count)/{Merge, ExtractOutputs}) -> FlatMap (FlatMap at ExtractOutput[0]) (2/2)] INFO org.apache.flink.runtime.taskmanager.Task - CHAIN MapPartition (MapPartition at [2]ExternalTransform(pytest:beam:transforms:count)/Combine.perKey(Count)/{Merge, ExtractOutputs}) -> FlatMap (FlatMap at ExtractOutput[0]) (2/2) (0fc009512bb26888422fbbbfb4cb2c2f) switched from DEPLOYING to RUNNING.
[flink-akka.actor.default-dispatcher-11] INFO org.apache.flink.runtime.executiongraph.ExecutionGraph - CHAIN MapPartition (MapPartition at [2]ExternalTransform(pytest:beam:transforms:count)/Combine.perKey(Count)/{Merge, ExtractOutputs}) -> FlatMap (FlatMap at ExtractOutput[0]) (2/2) (0fc009512bb26888422fbbbfb4cb2c2f) switched from DEPLOYING to RUNNING.
[CHAIN MapPartition (MapPartition at [2]ExternalTransform(pytest:beam:transforms:count)/Combine.perKey(Count)/{Merge, ExtractOutputs}) -> FlatMap (FlatMap at ExtractOutput[0]) (2/2)] WARN org.apache.flink.metrics.MetricGroup - The operator name MapPartition (MapPartition at [2]ExternalTransform(pytest:beam:transforms:count)/Combine.perKey(Count)/{Merge, ExtractOutputs}) exceeded the 80 characters length limit and was truncated.
[jobmanager-future-thread-7] INFO org.apache.flink.runtime.executiongraph.ExecutionGraph - CHAIN MapPartition (MapPartition at [2]ExternalTransform(pytest:beam:transforms:count)/Combine.perKey(Count)/{Merge, ExtractOutputs}) -> FlatMap (FlatMap at ExtractOutput[0]) (1/2) (4319d69a3ef3de9d81e65ef906712302) switched from CREATED to SCHEDULED.
[flink-akka.actor.default-dispatcher-6] INFO org.apache.flink.runtime.executiongraph.ExecutionGraph - CHAIN MapPartition (MapPartition at [2]ExternalTransform(pytest:beam:transforms:count)/Combine.perKey(Count)/{Merge, ExtractOutputs}) -> FlatMap (FlatMap at ExtractOutput[0]) (1/2) (4319d69a3ef3de9d81e65ef906712302) switched from SCHEDULED to DEPLOYING.
[flink-akka.actor.default-dispatcher-6] INFO org.apache.flink.runtime.executiongraph.ExecutionGraph - Deploying CHAIN MapPartition (MapPartition at [2]ExternalTransform(pytest:beam:transforms:count)/Combine.perKey(Count)/{Merge, ExtractOutputs}) -> FlatMap (FlatMap at ExtractOutput[0]) (1/2) (attempt #0) to localhost
[flink-akka.actor.default-dispatcher-10] INFO org.apache.flink.runtime.taskexecutor.TaskExecutor - Received task CHAIN MapPartition (MapPartition at [2]ExternalTransform(pytest:beam:transforms:count)/Combine.perKey(Count)/{Merge, ExtractOutputs}) -> FlatMap (FlatMap at ExtractOutput[0]) (1/2).
[CHAIN MapPartition (MapPartition at [2]ExternalTransform(pytest:beam:transforms:count)/Combine.perKey(Count)/{Merge, ExtractOutputs}) -> FlatMap (FlatMap at ExtractOutput[0]) (1/2)] INFO org.apache.flink.runtime.taskmanager.Task - CHAIN MapPartition (MapPartition at [2]ExternalTransform(pytest:beam:transforms:count)/Combine.perKey(Count)/{Merge, ExtractOutputs}) -> FlatMap (FlatMap at ExtractOutput[0]) (1/2) (4319d69a3ef3de9d81e65ef906712302) switched from CREATED to DEPLOYING.
[CHAIN MapPartition (MapPartition at [2]ExternalTransform(pytest:beam:transforms:count)/Combine.perKey(Count)/{Merge, ExtractOutputs}) -> FlatMap (FlatMap at ExtractOutput[0]) (1/2)] INFO org.apache.flink.runtime.taskmanager.Task - Creating FileSystem stream leak safety net for task CHAIN MapPartition (MapPartition at [2]ExternalTransform(pytest:beam:transforms:count)/Combine.perKey(Count)/{Merge, ExtractOutputs}) -> FlatMap (FlatMap at ExtractOutput[0]) (1/2) (4319d69a3ef3de9d81e65ef906712302) [DEPLOYING]
[CHAIN MapPartition (MapPartition at [2]ExternalTransform(pytest:beam:transforms:count)/Combine.perKey(Count)/{Merge, ExtractOutputs}) -> FlatMap (FlatMap at ExtractOutput[0]) (1/2)] INFO org.apache.flink.runtime.taskmanager.Task - Loading JAR files for task CHAIN MapPartition (MapPartition at [2]ExternalTransform(pytest:beam:transforms:count)/Combine.perKey(Count)/{Merge, ExtractOutputs}) -> FlatMap (FlatMap at ExtractOutput[0]) (1/2) (4319d69a3ef3de9d81e65ef906712302) [DEPLOYING].
[CHAIN MapPartition (MapPartition at [2]ExternalTransform(pytest:beam:transforms:count)/Combine.perKey(Count)/{Merge, ExtractOutputs}) -> FlatMap (FlatMap at ExtractOutput[0]) (1/2)] INFO org.apache.flink.runtime.taskmanager.Task - Registering task at network: CHAIN MapPartition (MapPartition at [2]ExternalTransform(pytest:beam:transforms:count)/Combine.perKey(Count)/{Merge, ExtractOutputs}) -> FlatMap (FlatMap at ExtractOutput[0]) (1/2) (4319d69a3ef3de9d81e65ef906712302) [DEPLOYING].
[CHAIN MapPartition (MapPartition at [2]ExternalTransform(pytest:beam:transforms:count)/Combine.perKey(Count)/{Merge, ExtractOutputs}) -> FlatMap (FlatMap at ExtractOutput[0]) (1/2)] INFO org.apache.flink.runtime.taskmanager.Task - CHAIN MapPartition (MapPartition at [2]ExternalTransform(pytest:beam:transforms:count)/Combine.perKey(Count)/{Merge, ExtractOutputs}) -> FlatMap (FlatMap at ExtractOutput[0]) (1/2) (4319d69a3ef3de9d81e65ef906712302) switched from DEPLOYING to RUNNING.
[flink-akka.actor.default-dispatcher-10] INFO org.apache.flink.runtime.executiongraph.ExecutionGraph - CHAIN MapPartition (MapPartition at [2]ExternalTransform(pytest:beam:transforms:count)/Combine.perKey(Count)/{Merge, ExtractOutputs}) -> FlatMap (FlatMap at ExtractOutput[0]) (1/2) (4319d69a3ef3de9d81e65ef906712302) switched from DEPLOYING to RUNNING.
[CHAIN MapPartition (MapPartition at [2]ExternalTransform(pytest:beam:transforms:count)/Combine.perKey(Count)/{Merge, ExtractOutputs}) -> FlatMap (FlatMap at ExtractOutput[0]) (1/2)] WARN org.apache.flink.metrics.MetricGroup - The operator name MapPartition (MapPartition at [2]ExternalTransform(pytest:beam:transforms:count)/Combine.perKey(Count)/{Merge, ExtractOutputs}) exceeded the 80 characters length limit and was truncated.
[GroupReduce (GroupReduce at ExternalTransform(pytest:beam:transforms:count)/Combine.perKey(Count)/Group) (2/2)] INFO org.apache.flink.runtime.taskmanager.Task - GroupReduce (GroupReduce at ExternalTransform(pytest:beam:transforms:count)/Combine.perKey(Count)/Group) (2/2) (4e906db38deb5b8e1130c861d6dde996) switched from RUNNING to FINISHED.
[GroupReduce (GroupReduce at ExternalTransform(pytest:beam:transforms:count)/Combine.perKey(Count)/Group) (2/2)] INFO org.apache.flink.runtime.taskmanager.Task - Freeing task resources for GroupReduce (GroupReduce at ExternalTransform(pytest:beam:transforms:count)/Combine.perKey(Count)/Group) (2/2) (4e906db38deb5b8e1130c861d6dde996).
[GroupReduce (GroupReduce at ExternalTransform(pytest:beam:transforms:count)/Combine.perKey(Count)/Group) (1/2)] INFO org.apache.flink.runtime.taskmanager.Task - GroupReduce (GroupReduce at ExternalTransform(pytest:beam:transforms:count)/Combine.perKey(Count)/Group) (1/2) (9508e8af02d51501710f56dd528ffbb4) switched from RUNNING to FINISHED.
[GroupReduce (GroupReduce at ExternalTransform(pytest:beam:transforms:count)/Combine.perKey(Count)/Group) (2/2)] INFO org.apache.flink.runtime.taskmanager.Task - Ensuring all FileSystem streams are closed for task GroupReduce (GroupReduce at ExternalTransform(pytest:beam:transforms:count)/Combine.perKey(Count)/Group) (2/2) (4e906db38deb5b8e1130c861d6dde996) [FINISHED]
[GroupReduce (GroupReduce at ExternalTransform(pytest:beam:transforms:count)/Combine.perKey(Count)/Group) (1/2)] INFO org.apache.flink.runtime.taskmanager.Task - Freeing task resources for GroupReduce (GroupReduce at ExternalTransform(pytest:beam:transforms:count)/Combine.perKey(Count)/Group) (1/2) (9508e8af02d51501710f56dd528ffbb4).
[GroupReduce (GroupReduce at ExternalTransform(pytest:beam:transforms:count)/Combine.perKey(Count)/Group) (1/2)] INFO org.apache.flink.runtime.taskmanager.Task - Ensuring all FileSystem streams are closed for task GroupReduce (GroupReduce at ExternalTransform(pytest:beam:transforms:count)/Combine.perKey(Count)/Group) (1/2) (9508e8af02d51501710f56dd528ffbb4) [FINISHED]
[flink-akka.actor.default-dispatcher-9] INFO org.apache.flink.runtime.taskexecutor.TaskExecutor - Un-registering task and sending final execution state FINISHED to JobManager for task GroupReduce (GroupReduce at ExternalTransform(pytest:beam:transforms:count)/Combine.perKey(Count)/Group) 4e906db38deb5b8e1130c861d6dde996.
[flink-akka.actor.default-dispatcher-9] INFO org.apache.flink.runtime.taskexecutor.TaskExecutor - Un-registering task and sending final execution state FINISHED to JobManager for task GroupReduce (GroupReduce at ExternalTransform(pytest:beam:transforms:count)/Combine.perKey(Count)/Group) 9508e8af02d51501710f56dd528ffbb4.
[flink-akka.actor.default-dispatcher-10] INFO org.apache.flink.runtime.executiongraph.ExecutionGraph - GroupReduce (GroupReduce at ExternalTransform(pytest:beam:transforms:count)/Combine.perKey(Count)/Group) (2/2) (4e906db38deb5b8e1130c861d6dde996) switched from RUNNING to FINISHED.
[flink-akka.actor.default-dispatcher-10] INFO org.apache.flink.runtime.executiongraph.ExecutionGraph - GroupReduce (GroupReduce at ExternalTransform(pytest:beam:transforms:count)/Combine.perKey(Count)/Group) (1/2) (9508e8af02d51501710f56dd528ffbb4) switched from RUNNING to FINISHED.
[jobmanager-future-thread-6] INFO org.apache.flink.runtime.executiongraph.ExecutionGraph - CHAIN MapPartition (MapPartition at [6]{Map(<lambda at external_test.py:212>), Map(<lambda at external_test.py:213>), assert_that}) -> FlatMap (FlatMap at ExtractOutput[0]) (2/2) (698f766c68e8349243e60c8442b0e601) switched from CREATED to SCHEDULED.
[flink-akka.actor.default-dispatcher-6] INFO org.apache.flink.runtime.executiongraph.ExecutionGraph - CHAIN MapPartition (MapPartition at [6]{Map(<lambda at external_test.py:212>), Map(<lambda at external_test.py:213>), assert_that}) -> FlatMap (FlatMap at ExtractOutput[0]) (2/2) (698f766c68e8349243e60c8442b0e601) switched from SCHEDULED to DEPLOYING.
[flink-akka.actor.default-dispatcher-6] INFO org.apache.flink.runtime.executiongraph.ExecutionGraph - Deploying CHAIN MapPartition (MapPartition at [6]{Map(<lambda at external_test.py:212>), Map(<lambda at external_test.py:213>), assert_that}) -> FlatMap (FlatMap at ExtractOutput[0]) (2/2) (attempt #0) to localhost
[flink-akka.actor.default-dispatcher-9] INFO org.apache.flink.runtime.taskexecutor.TaskExecutor - Received task CHAIN MapPartition (MapPartition at [6]{Map(<lambda at external_test.py:212>), Map(<lambda at external_test.py:213>), assert_that}) -> FlatMap (FlatMap at ExtractOutput[0]) (2/2).
[CHAIN MapPartition (MapPartition at [2]ExternalTransform(pytest:beam:transforms:count)/Combine.perKey(Count)/{Merge, ExtractOutputs}) -> FlatMap (FlatMap at ExtractOutput[0]) (2/2)] INFO org.apache.flink.runtime.taskmanager.Task - CHAIN MapPartition (MapPartition at [2]ExternalTransform(pytest:beam:transforms:count)/Combine.perKey(Count)/{Merge, ExtractOutputs}) -> FlatMap (FlatMap at ExtractOutput[0]) (2/2) (0fc009512bb26888422fbbbfb4cb2c2f) switched from RUNNING to FINISHED.
[CHAIN MapPartition (MapPartition at [2]ExternalTransform(pytest:beam:transforms:count)/Combine.perKey(Count)/{Merge, ExtractOutputs}) -> FlatMap (FlatMap at ExtractOutput[0]) (2/2)] INFO org.apache.flink.runtime.taskmanager.Task - Freeing task resources for CHAIN MapPartition (MapPartition at [2]ExternalTransform(pytest:beam:transforms:count)/Combine.perKey(Count)/{Merge, ExtractOutputs}) -> FlatMap (FlatMap at ExtractOutput[0]) (2/2) (0fc009512bb26888422fbbbfb4cb2c2f).
[CHAIN MapPartition (MapPartition at [6]{Map(<lambda at external_test.py:212>), Map(<lambda at external_test.py:213>), assert_that}) -> FlatMap (FlatMap at ExtractOutput[0]) (2/2)] INFO org.apache.flink.runtime.taskmanager.Task - CHAIN MapPartition (MapPartition at [6]{Map(<lambda at external_test.py:212>), Map(<lambda at external_test.py:213>), assert_that}) -> FlatMap (FlatMap at ExtractOutput[0]) (2/2) (698f766c68e8349243e60c8442b0e601) switched from CREATED to DEPLOYING.
[CHAIN MapPartition (MapPartition at [6]{Map(<lambda at external_test.py:212>), Map(<lambda at external_test.py:213>), assert_that}) -> FlatMap (FlatMap at ExtractOutput[0]) (2/2)] INFO org.apache.flink.runtime.taskmanager.Task - Creating FileSystem stream leak safety net for task CHAIN MapPartition (MapPartition at [6]{Map(<lambda at external_test.py:212>), Map(<lambda at external_test.py:213>), assert_that}) -> FlatMap (FlatMap at ExtractOutput[0]) (2/2) (698f766c68e8349243e60c8442b0e601) [DEPLOYING]
[CHAIN MapPartition (MapPartition at [2]ExternalTransform(pytest:beam:transforms:count)/Combine.perKey(Count)/{Merge, ExtractOutputs}) -> FlatMap (FlatMap at ExtractOutput[0]) (2/2)] INFO org.apache.flink.runtime.taskmanager.Task - Ensuring all FileSystem streams are closed for task CHAIN MapPartition (MapPartition at [2]ExternalTransform(pytest:beam:transforms:count)/Combine.perKey(Count)/{Merge, ExtractOutputs}) -> FlatMap (FlatMap at ExtractOutput[0]) (2/2) (0fc009512bb26888422fbbbfb4cb2c2f) [FINISHED]
[CHAIN MapPartition (MapPartition at [6]{Map(<lambda at external_test.py:212>), Map(<lambda at external_test.py:213>), assert_that}) -> FlatMap (FlatMap at ExtractOutput[0]) (2/2)] INFO org.apache.flink.runtime.taskmanager.Task - Loading JAR files for task CHAIN MapPartition (MapPartition at [6]{Map(<lambda at external_test.py:212>), Map(<lambda at external_test.py:213>), assert_that}) -> FlatMap (FlatMap at ExtractOutput[0]) (2/2) (698f766c68e8349243e60c8442b0e601) [DEPLOYING].
[flink-akka.actor.default-dispatcher-9] INFO org.apache.flink.runtime.taskexecutor.TaskExecutor - Un-registering task and sending final execution state FINISHED to JobManager for task CHAIN MapPartition (MapPartition at [2]ExternalTransform(pytest:beam:transforms:count)/Combine.perKey(Count)/{Merge, ExtractOutputs}) -> FlatMap (FlatMap at ExtractOutput[0]) 0fc009512bb26888422fbbbfb4cb2c2f.
[CHAIN MapPartition (MapPartition at [6]{Map(<lambda at external_test.py:212>), Map(<lambda at external_test.py:213>), assert_that}) -> FlatMap (FlatMap at ExtractOutput[0]) (2/2)] INFO org.apache.flink.runtime.taskmanager.Task - Registering task at network: CHAIN MapPartition (MapPartition at [6]{Map(<lambda at external_test.py:212>), Map(<lambda at external_test.py:213>), assert_that}) -> FlatMap (FlatMap at ExtractOutput[0]) (2/2) (698f766c68e8349243e60c8442b0e601) [DEPLOYING].
[CHAIN MapPartition (MapPartition at [6]{Map(<lambda at external_test.py:212>), Map(<lambda at external_test.py:213>), assert_that}) -> FlatMap (FlatMap at ExtractOutput[0]) (2/2)] INFO org.apache.flink.runtime.taskmanager.Task - CHAIN MapPartition (MapPartition at [6]{Map(<lambda at external_test.py:212>), Map(<lambda at external_test.py:213>), assert_that}) -> FlatMap (FlatMap at ExtractOutput[0]) (2/2) (698f766c68e8349243e60c8442b0e601) switched from DEPLOYING to RUNNING.
[CHAIN MapPartition (MapPartition at [6]{Map(<lambda at external_test.py:212>), Map(<lambda at external_test.py:213>), assert_that}) -> FlatMap (FlatMap at ExtractOutput[0]) (2/2)] WARN org.apache.flink.metrics.MetricGroup - The operator name MapPartition (MapPartition at [6]{Map(<lambda at external_test.py:212>), Map(<lambda at external_test.py:213>), assert_that}) exceeded the 80 characters length limit and was truncated.
[flink-akka.actor.default-dispatcher-10] INFO org.apache.flink.runtime.executiongraph.ExecutionGraph - CHAIN MapPartition (MapPartition at [2]ExternalTransform(pytest:beam:transforms:count)/Combine.perKey(Count)/{Merge, ExtractOutputs}) -> FlatMap (FlatMap at ExtractOutput[0]) (2/2) (0fc009512bb26888422fbbbfb4cb2c2f) switched from RUNNING to FINISHED.
[flink-akka.actor.default-dispatcher-10] INFO org.apache.flink.runtime.executiongraph.ExecutionGraph - CHAIN MapPartition (MapPartition at [6]{Map(<lambda at external_test.py:212>), Map(<lambda at external_test.py:213>), assert_that}) -> FlatMap (FlatMap at ExtractOutput[0]) (2/2) (698f766c68e8349243e60c8442b0e601) switched from DEPLOYING to RUNNING.
[grpc-default-executor-0] WARN bundle_processor.create_operation - No unique name set for transform fn/write/ref_PCollection_PCollection_24:1:0 
[jobmanager-future-thread-2] INFO org.apache.flink.runtime.executiongraph.ExecutionGraph - CHAIN MapPartition (MapPartition at [6]{Map(<lambda at external_test.py:212>), Map(<lambda at external_test.py:213>), assert_that}) -> FlatMap (FlatMap at ExtractOutput[0]) (1/2) (1aa6fef9f5f8a8cf6405682bef93ed1a) switched from CREATED to SCHEDULED.
[flink-akka.actor.default-dispatcher-6] INFO org.apache.flink.runtime.executiongraph.ExecutionGraph - CHAIN MapPartition (MapPartition at [6]{Map(<lambda at external_test.py:212>), Map(<lambda at external_test.py:213>), assert_that}) -> FlatMap (FlatMap at ExtractOutput[0]) (1/2) (1aa6fef9f5f8a8cf6405682bef93ed1a) switched from SCHEDULED to DEPLOYING.
[flink-akka.actor.default-dispatcher-6] INFO org.apache.flink.runtime.executiongraph.ExecutionGraph - Deploying CHAIN MapPartition (MapPartition at [6]{Map(<lambda at external_test.py:212>), Map(<lambda at external_test.py:213>), assert_that}) -> FlatMap (FlatMap at ExtractOutput[0]) (1/2) (attempt #0) to localhost
[flink-akka.actor.default-dispatcher-9] INFO org.apache.flink.runtime.taskexecutor.TaskExecutor - Received task CHAIN MapPartition (MapPartition at [6]{Map(<lambda at external_test.py:212>), Map(<lambda at external_test.py:213>), assert_that}) -> FlatMap (FlatMap at ExtractOutput[0]) (1/2).
[CHAIN MapPartition (MapPartition at [6]{Map(<lambda at external_test.py:212>), Map(<lambda at external_test.py:213>), assert_that}) -> FlatMap (FlatMap at ExtractOutput[0]) (1/2)] INFO org.apache.flink.runtime.taskmanager.Task - CHAIN MapPartition (MapPartition at [6]{Map(<lambda at external_test.py:212>), Map(<lambda at external_test.py:213>), assert_that}) -> FlatMap (FlatMap at ExtractOutput[0]) (1/2) (1aa6fef9f5f8a8cf6405682bef93ed1a) switched from CREATED to DEPLOYING.
[CHAIN MapPartition (MapPartition at [6]{Map(<lambda at external_test.py:212>), Map(<lambda at external_test.py:213>), assert_that}) -> FlatMap (FlatMap at ExtractOutput[0]) (1/2)] INFO org.apache.flink.runtime.taskmanager.Task - Creating FileSystem stream leak safety net for task CHAIN MapPartition (MapPartition at [6]{Map(<lambda at external_test.py:212>), Map(<lambda at external_test.py:213>), assert_that}) -> FlatMap (FlatMap at ExtractOutput[0]) (1/2) (1aa6fef9f5f8a8cf6405682bef93ed1a) [DEPLOYING]
[CHAIN MapPartition (MapPartition at [6]{Map(<lambda at external_test.py:212>), Map(<lambda at external_test.py:213>), assert_that}) -> FlatMap (FlatMap at ExtractOutput[0]) (1/2)] INFO org.apache.flink.runtime.taskmanager.Task - Loading JAR files for task CHAIN MapPartition (MapPartition at [6]{Map(<lambda at external_test.py:212>), Map(<lambda at external_test.py:213>), assert_that}) -> FlatMap (FlatMap at ExtractOutput[0]) (1/2) (1aa6fef9f5f8a8cf6405682bef93ed1a) [DEPLOYING].
[CHAIN MapPartition (MapPartition at [6]{Map(<lambda at external_test.py:212>), Map(<lambda at external_test.py:213>), assert_that}) -> FlatMap (FlatMap at ExtractOutput[0]) (1/2)] INFO org.apache.flink.runtime.taskmanager.Task - Registering task at network: CHAIN MapPartition (MapPartition at [6]{Map(<lambda at external_test.py:212>), Map(<lambda at external_test.py:213>), assert_that}) -> FlatMap (FlatMap at ExtractOutput[0]) (1/2) (1aa6fef9f5f8a8cf6405682bef93ed1a) [DEPLOYING].
[CHAIN MapPartition (MapPartition at [6]{Map(<lambda at external_test.py:212>), Map(<lambda at external_test.py:213>), assert_that}) -> FlatMap (FlatMap at ExtractOutput[0]) (1/2)] INFO org.apache.flink.runtime.taskmanager.Task - CHAIN MapPartition (MapPartition at [6]{Map(<lambda at external_test.py:212>), Map(<lambda at external_test.py:213>), assert_that}) -> FlatMap (FlatMap at ExtractOutput[0]) (1/2) (1aa6fef9f5f8a8cf6405682bef93ed1a) switched from DEPLOYING to RUNNING.
[flink-akka.actor.default-dispatcher-9] INFO org.apache.flink.runtime.executiongraph.ExecutionGraph - CHAIN MapPartition (MapPartition at [6]{Map(<lambda at external_test.py:212>), Map(<lambda at external_test.py:213>), assert_that}) -> FlatMap (FlatMap at ExtractOutput[0]) (1/2) (1aa6fef9f5f8a8cf6405682bef93ed1a) switched from DEPLOYING to RUNNING.
[CHAIN MapPartition (MapPartition at [6]{Map(<lambda at external_test.py:212>), Map(<lambda at external_test.py:213>), assert_that}) -> FlatMap (FlatMap at ExtractOutput[0]) (1/2)] WARN org.apache.flink.metrics.MetricGroup - The operator name MapPartition (MapPartition at [6]{Map(<lambda at external_test.py:212>), Map(<lambda at external_test.py:213>), assert_that}) exceeded the 80 characters length limit and was truncated.
[CHAIN MapPartition (MapPartition at [2]ExternalTransform(pytest:beam:transforms:count)/Combine.perKey(Count)/{Merge, ExtractOutputs}) -> FlatMap (FlatMap at ExtractOutput[0]) (1/2)] INFO org.apache.flink.runtime.taskmanager.Task - CHAIN MapPartition (MapPartition at [2]ExternalTransform(pytest:beam:transforms:count)/Combine.perKey(Count)/{Merge, ExtractOutputs}) -> FlatMap (FlatMap at ExtractOutput[0]) (1/2) (4319d69a3ef3de9d81e65ef906712302) switched from RUNNING to FINISHED.
[CHAIN MapPartition (MapPartition at [2]ExternalTransform(pytest:beam:transforms:count)/Combine.perKey(Count)/{Merge, ExtractOutputs}) -> FlatMap (FlatMap at ExtractOutput[0]) (1/2)] INFO org.apache.flink.runtime.taskmanager.Task - Freeing task resources for CHAIN MapPartition (MapPartition at [2]ExternalTransform(pytest:beam:transforms:count)/Combine.perKey(Count)/{Merge, ExtractOutputs}) -> FlatMap (FlatMap at ExtractOutput[0]) (1/2) (4319d69a3ef3de9d81e65ef906712302).
[CHAIN MapPartition (MapPartition at [2]ExternalTransform(pytest:beam:transforms:count)/Combine.perKey(Count)/{Merge, ExtractOutputs}) -> FlatMap (FlatMap at ExtractOutput[0]) (1/2)] INFO org.apache.flink.runtime.taskmanager.Task - Ensuring all FileSystem streams are closed for task CHAIN MapPartition (MapPartition at [2]ExternalTransform(pytest:beam:transforms:count)/Combine.perKey(Count)/{Merge, ExtractOutputs}) -> FlatMap (FlatMap at ExtractOutput[0]) (1/2) (4319d69a3ef3de9d81e65ef906712302) [FINISHED]
[flink-akka.actor.default-dispatcher-11] INFO org.apache.flink.runtime.taskexecutor.TaskExecutor - Un-registering task and sending final execution state FINISHED to JobManager for task CHAIN MapPartition (MapPartition at [2]ExternalTransform(pytest:beam:transforms:count)/Combine.perKey(Count)/{Merge, ExtractOutputs}) -> FlatMap (FlatMap at ExtractOutput[0]) 4319d69a3ef3de9d81e65ef906712302.
[flink-akka.actor.default-dispatcher-11] INFO org.apache.flink.runtime.executiongraph.ExecutionGraph - CHAIN MapPartition (MapPartition at [2]ExternalTransform(pytest:beam:transforms:count)/Combine.perKey(Count)/{Merge, ExtractOutputs}) -> FlatMap (FlatMap at ExtractOutput[0]) (1/2) (4319d69a3ef3de9d81e65ef906712302) switched from RUNNING to FINISHED.
[grpc-default-executor-0] WARN bundle_processor.create_operation - No unique name set for transform fn/write/ref_PCollection_PCollection_24:1:0 
[grpc-default-executor-0] WARN bundle_processor.create_operation - No unique name set for transform fn/read/ref_PCollection_PCollection_14:0 
[grpc-default-executor-0] WARN bundle_processor.create_operation - No unique name set for transform fn/read/ref_PCollection_PCollection_14:0 
[CHAIN MapPartition (MapPartition at [6]{Map(<lambda at external_test.py:212>), Map(<lambda at external_test.py:213>), assert_that}) -> FlatMap (FlatMap at ExtractOutput[0]) (2/2)] INFO org.apache.flink.runtime.taskmanager.Task - CHAIN MapPartition (MapPartition at [6]{Map(<lambda at external_test.py:212>), Map(<lambda at external_test.py:213>), assert_that}) -> FlatMap (FlatMap at ExtractOutput[0]) (2/2) (698f766c68e8349243e60c8442b0e601) switched from RUNNING to FINISHED.
[CHAIN MapPartition (MapPartition at [6]{Map(<lambda at external_test.py:212>), Map(<lambda at external_test.py:213>), assert_that}) -> FlatMap (FlatMap at ExtractOutput[0]) (2/2)] INFO org.apache.flink.runtime.taskmanager.Task - Freeing task resources for CHAIN MapPartition (MapPartition at [6]{Map(<lambda at external_test.py:212>), Map(<lambda at external_test.py:213>), assert_that}) -> FlatMap (FlatMap at ExtractOutput[0]) (2/2) (698f766c68e8349243e60c8442b0e601).
[CHAIN MapPartition (MapPartition at [6]{Map(<lambda at external_test.py:212>), Map(<lambda at external_test.py:213>), assert_that}) -> FlatMap (FlatMap at ExtractOutput[0]) (2/2)] INFO org.apache.flink.runtime.taskmanager.Task - Ensuring all FileSystem streams are closed for task CHAIN MapPartition (MapPartition at [6]{Map(<lambda at external_test.py:212>), Map(<lambda at external_test.py:213>), assert_that}) -> FlatMap (FlatMap at ExtractOutput[0]) (2/2) (698f766c68e8349243e60c8442b0e601) [FINISHED]
[flink-akka.actor.default-dispatcher-6] INFO org.apache.flink.runtime.taskexecutor.TaskExecutor - Un-registering task and sending final execution state FINISHED to JobManager for task CHAIN MapPartition (MapPartition at [6]{Map(<lambda at external_test.py:212>), Map(<lambda at external_test.py:213>), assert_that}) -> FlatMap (FlatMap at ExtractOutput[0]) 698f766c68e8349243e60c8442b0e601.
[jobmanager-future-thread-16] INFO org.apache.flink.runtime.executiongraph.ExecutionGraph - GroupReduce (GroupReduce at assert_that/Group/GroupByKey) (1/2) (7be155e8821aaf3cf04662cb6a851d92) switched from CREATED to SCHEDULED.
[jobmanager-future-thread-8] INFO org.apache.flink.runtime.executiongraph.ExecutionGraph - GroupReduce (GroupReduce at assert_that/Group/GroupByKey) (2/2) (75b5a2733162be98da77d5af79d18bb1) switched from CREATED to SCHEDULED.
[flink-akka.actor.default-dispatcher-6] INFO org.apache.flink.runtime.executiongraph.ExecutionGraph - GroupReduce (GroupReduce at assert_that/Group/GroupByKey) (1/2) (7be155e8821aaf3cf04662cb6a851d92) switched from SCHEDULED to DEPLOYING.
[flink-akka.actor.default-dispatcher-10] INFO org.apache.flink.runtime.executiongraph.ExecutionGraph - GroupReduce (GroupReduce at assert_that/Group/GroupByKey) (2/2) (75b5a2733162be98da77d5af79d18bb1) switched from SCHEDULED to DEPLOYING.
[flink-akka.actor.default-dispatcher-6] INFO org.apache.flink.runtime.executiongraph.ExecutionGraph - Deploying GroupReduce (GroupReduce at assert_that/Group/GroupByKey) (1/2) (attempt #0) to localhost
[flink-akka.actor.default-dispatcher-10] INFO org.apache.flink.runtime.executiongraph.ExecutionGraph - Deploying GroupReduce (GroupReduce at assert_that/Group/GroupByKey) (2/2) (attempt #0) to localhost
[flink-akka.actor.default-dispatcher-9] INFO org.apache.flink.runtime.executiongraph.ExecutionGraph - CHAIN MapPartition (MapPartition at [6]{Map(<lambda at external_test.py:212>), Map(<lambda at external_test.py:213>), assert_that}) -> FlatMap (FlatMap at ExtractOutput[0]) (2/2) (698f766c68e8349243e60c8442b0e601) switched from RUNNING to FINISHED.
[flink-akka.actor.default-dispatcher-11] INFO org.apache.flink.runtime.taskexecutor.TaskExecutor - Received task GroupReduce (GroupReduce at assert_that/Group/GroupByKey) (1/2).
[GroupReduce (GroupReduce at assert_that/Group/GroupByKey) (1/2)] INFO org.apache.flink.runtime.taskmanager.Task - GroupReduce (GroupReduce at assert_that/Group/GroupByKey) (1/2) (7be155e8821aaf3cf04662cb6a851d92) switched from CREATED to DEPLOYING.
[GroupReduce (GroupReduce at assert_that/Group/GroupByKey) (1/2)] INFO org.apache.flink.runtime.taskmanager.Task - Creating FileSystem stream leak safety net for task GroupReduce (GroupReduce at assert_that/Group/GroupByKey) (1/2) (7be155e8821aaf3cf04662cb6a851d92) [DEPLOYING]
[GroupReduce (GroupReduce at assert_that/Group/GroupByKey) (1/2)] INFO org.apache.flink.runtime.taskmanager.Task - Loading JAR files for task GroupReduce (GroupReduce at assert_that/Group/GroupByKey) (1/2) (7be155e8821aaf3cf04662cb6a851d92) [DEPLOYING].
[flink-akka.actor.default-dispatcher-11] INFO org.apache.flink.runtime.taskexecutor.TaskExecutor - Received task GroupReduce (GroupReduce at assert_that/Group/GroupByKey) (2/2).
[GroupReduce (GroupReduce at assert_that/Group/GroupByKey) (1/2)] INFO org.apache.flink.runtime.taskmanager.Task - Registering task at network: GroupReduce (GroupReduce at assert_that/Group/GroupByKey) (1/2) (7be155e8821aaf3cf04662cb6a851d92) [DEPLOYING].
[GroupReduce (GroupReduce at assert_that/Group/GroupByKey) (1/2)] INFO org.apache.flink.runtime.taskmanager.Task - GroupReduce (GroupReduce at assert_that/Group/GroupByKey) (1/2) (7be155e8821aaf3cf04662cb6a851d92) switched from DEPLOYING to RUNNING.
[flink-akka.actor.default-dispatcher-6] INFO org.apache.flink.runtime.executiongraph.ExecutionGraph - GroupReduce (GroupReduce at assert_that/Group/GroupByKey) (1/2) (7be155e8821aaf3cf04662cb6a851d92) switched from DEPLOYING to RUNNING.
[GroupReduce (GroupReduce at assert_that/Group/GroupByKey) (2/2)] INFO org.apache.flink.runtime.taskmanager.Task - GroupReduce (GroupReduce at assert_that/Group/GroupByKey) (2/2) (75b5a2733162be98da77d5af79d18bb1) switched from CREATED to DEPLOYING.
[GroupReduce (GroupReduce at assert_that/Group/GroupByKey) (2/2)] INFO org.apache.flink.runtime.taskmanager.Task - Creating FileSystem stream leak safety net for task GroupReduce (GroupReduce at assert_that/Group/GroupByKey) (2/2) (75b5a2733162be98da77d5af79d18bb1) [DEPLOYING]
[GroupReduce (GroupReduce at assert_that/Group/GroupByKey) (2/2)] INFO org.apache.flink.runtime.taskmanager.Task - Loading JAR files for task GroupReduce (GroupReduce at assert_that/Group/GroupByKey) (2/2) (75b5a2733162be98da77d5af79d18bb1) [DEPLOYING].
[GroupReduce (GroupReduce at assert_that/Group/GroupByKey) (2/2)] INFO org.apache.flink.runtime.taskmanager.Task - Registering task at network: GroupReduce (GroupReduce at assert_that/Group/GroupByKey) (2/2) (75b5a2733162be98da77d5af79d18bb1) [DEPLOYING].
[GroupReduce (GroupReduce at assert_that/Group/GroupByKey) (2/2)] INFO org.apache.flink.runtime.taskmanager.Task - GroupReduce (GroupReduce at assert_that/Group/GroupByKey) (2/2) (75b5a2733162be98da77d5af79d18bb1) switched from DEPLOYING to RUNNING.
[flink-akka.actor.default-dispatcher-9] INFO org.apache.flink.runtime.executiongraph.ExecutionGraph - GroupReduce (GroupReduce at assert_that/Group/GroupByKey) (2/2) (75b5a2733162be98da77d5af79d18bb1) switched from DEPLOYING to RUNNING.
[CHAIN Filter (UnionFixFilter) -> Map (Key Extractor) -> GroupCombine (GroupCombine at GroupCombine: assert_that/Group/GroupByKey) -> Map (Key Extractor) (2/2)] INFO org.apache.flink.runtime.taskmanager.Task - CHAIN Filter (UnionFixFilter) -> Map (Key Extractor) -> GroupCombine (GroupCombine at GroupCombine: assert_that/Group/GroupByKey) -> Map (Key Extractor) (2/2) (0462a18b1f33f24d446cef3a7e7d2514) switched from RUNNING to FINISHED.
[CHAIN Filter (UnionFixFilter) -> Map (Key Extractor) -> GroupCombine (GroupCombine at GroupCombine: assert_that/Group/GroupByKey) -> Map (Key Extractor) (2/2)] INFO org.apache.flink.runtime.taskmanager.Task - Freeing task resources for CHAIN Filter (UnionFixFilter) -> Map (Key Extractor) -> GroupCombine (GroupCombine at GroupCombine: assert_that/Group/GroupByKey) -> Map (Key Extractor) (2/2) (0462a18b1f33f24d446cef3a7e7d2514).
[CHAIN MapPartition (MapPartition at [6]{Map(<lambda at external_test.py:212>), Map(<lambda at external_test.py:213>), assert_that}) -> FlatMap (FlatMap at ExtractOutput[0]) (1/2)] INFO org.apache.flink.runtime.taskmanager.Task - CHAIN MapPartition (MapPartition at [6]{Map(<lambda at external_test.py:212>), Map(<lambda at external_test.py:213>), assert_that}) -> FlatMap (FlatMap at ExtractOutput[0]) (1/2) (1aa6fef9f5f8a8cf6405682bef93ed1a) switched from RUNNING to FINISHED.
[CHAIN MapPartition (MapPartition at [6]{Map(<lambda at external_test.py:212>), Map(<lambda at external_test.py:213>), assert_that}) -> FlatMap (FlatMap at ExtractOutput[0]) (1/2)] INFO org.apache.flink.runtime.taskmanager.Task - Freeing task resources for CHAIN MapPartition (MapPartition at [6]{Map(<lambda at external_test.py:212>), Map(<lambda at external_test.py:213>), assert_that}) -> FlatMap (FlatMap at ExtractOutput[0]) (1/2) (1aa6fef9f5f8a8cf6405682bef93ed1a).
[CHAIN Filter (UnionFixFilter) -> Map (Key Extractor) -> GroupCombine (GroupCombine at GroupCombine: assert_that/Group/GroupByKey) -> Map (Key Extractor) (1/2)] INFO org.apache.flink.runtime.taskmanager.Task - CHAIN Filter (UnionFixFilter) -> Map (Key Extractor) -> GroupCombine (GroupCombine at GroupCombine: assert_that/Group/GroupByKey) -> Map (Key Extractor) (1/2) (533e76b34f4417194763f662ff5e73e7) switched from RUNNING to FINISHED.
[CHAIN Filter (UnionFixFilter) -> Map (Key Extractor) -> GroupCombine (GroupCombine at GroupCombine: assert_that/Group/GroupByKey) -> Map (Key Extractor) (2/2)] INFO org.apache.flink.runtime.taskmanager.Task - Ensuring all FileSystem streams are closed for task CHAIN Filter (UnionFixFilter) -> Map (Key Extractor) -> GroupCombine (GroupCombine at GroupCombine: assert_that/Group/GroupByKey) -> Map (Key Extractor) (2/2) (0462a18b1f33f24d446cef3a7e7d2514) [FINISHED]
[CHAIN MapPartition (MapPartition at [6]{Map(<lambda at external_test.py:212>), Map(<lambda at external_test.py:213>), assert_that}) -> FlatMap (FlatMap at ExtractOutput[0]) (1/2)] INFO org.apache.flink.runtime.taskmanager.Task - Ensuring all FileSystem streams are closed for task CHAIN MapPartition (MapPartition at [6]{Map(<lambda at external_test.py:212>), Map(<lambda at external_test.py:213>), assert_that}) -> FlatMap (FlatMap at ExtractOutput[0]) (1/2) (1aa6fef9f5f8a8cf6405682bef93ed1a) [FINISHED]
[CHAIN Filter (UnionFixFilter) -> Map (Key Extractor) -> GroupCombine (GroupCombine at GroupCombine: assert_that/Group/GroupByKey) -> Map (Key Extractor) (1/2)] INFO org.apache.flink.runtime.taskmanager.Task - Freeing task resources for CHAIN Filter (UnionFixFilter) -> Map (Key Extractor) -> GroupCombine (GroupCombine at GroupCombine: assert_that/Group/GroupByKey) -> Map (Key Extractor) (1/2) (533e76b34f4417194763f662ff5e73e7).
[flink-akka.actor.default-dispatcher-9] INFO org.apache.flink.runtime.taskexecutor.TaskExecutor - Un-registering task and sending final execution state FINISHED to JobManager for task CHAIN Filter (UnionFixFilter) -> Map (Key Extractor) -> GroupCombine (GroupCombine at GroupCombine: assert_that/Group/GroupByKey) -> Map (Key Extractor) 0462a18b1f33f24d446cef3a7e7d2514.
[flink-akka.actor.default-dispatcher-9] INFO org.apache.flink.runtime.taskexecutor.TaskExecutor - Un-registering task and sending final execution state FINISHED to JobManager for task CHAIN MapPartition (MapPartition at [6]{Map(<lambda at external_test.py:212>), Map(<lambda at external_test.py:213>), assert_that}) -> FlatMap (FlatMap at ExtractOutput[0]) 1aa6fef9f5f8a8cf6405682bef93ed1a.
[flink-akka.actor.default-dispatcher-6] INFO org.apache.flink.runtime.executiongraph.ExecutionGraph - CHAIN Filter (UnionFixFilter) -> Map (Key Extractor) -> GroupCombine (GroupCombine at GroupCombine: assert_that/Group/GroupByKey) -> Map (Key Extractor) (2/2) (0462a18b1f33f24d446cef3a7e7d2514) switched from RUNNING to FINISHED.
[flink-akka.actor.default-dispatcher-6] INFO org.apache.flink.runtime.executiongraph.ExecutionGraph - CHAIN MapPartition (MapPartition at [6]{Map(<lambda at external_test.py:212>), Map(<lambda at external_test.py:213>), assert_that}) -> FlatMap (FlatMap at ExtractOutput[0]) (1/2) (1aa6fef9f5f8a8cf6405682bef93ed1a) switched from RUNNING to FINISHED.
[CHAIN Filter (UnionFixFilter) -> Map (Key Extractor) -> GroupCombine (GroupCombine at GroupCombine: assert_that/Group/GroupByKey) -> Map (Key Extractor) (1/2)] INFO org.apache.flink.runtime.taskmanager.Task - Ensuring all FileSystem streams are closed for task CHAIN Filter (UnionFixFilter) -> Map (Key Extractor) -> GroupCombine (GroupCombine at GroupCombine: assert_that/Group/GroupByKey) -> Map (Key Extractor) (1/2) (533e76b34f4417194763f662ff5e73e7) [FINISHED]
[flink-akka.actor.default-dispatcher-6] INFO org.apache.flink.runtime.taskexecutor.TaskExecutor - Un-registering task and sending final execution state FINISHED to JobManager for task CHAIN Filter (UnionFixFilter) -> Map (Key Extractor) -> GroupCombine (GroupCombine at GroupCombine: assert_that/Group/GroupByKey) -> Map (Key Extractor) 533e76b34f4417194763f662ff5e73e7.
[flink-akka.actor.default-dispatcher-11] INFO org.apache.flink.runtime.executiongraph.ExecutionGraph - CHAIN Filter (UnionFixFilter) -> Map (Key Extractor) -> GroupCombine (GroupCombine at GroupCombine: assert_that/Group/GroupByKey) -> Map (Key Extractor) (1/2) (533e76b34f4417194763f662ff5e73e7) switched from RUNNING to FINISHED.
[jobmanager-future-thread-3] INFO org.apache.flink.runtime.executiongraph.ExecutionGraph - MapPartition (MapPartition at [3]assert_that/{Group, Unkey, Match}) (2/2) (4f7e0c2745b6b097215e3ef0db10e061) switched from CREATED to SCHEDULED.
[flink-akka.actor.default-dispatcher-6] INFO org.apache.flink.runtime.executiongraph.ExecutionGraph - MapPartition (MapPartition at [3]assert_that/{Group, Unkey, Match}) (2/2) (4f7e0c2745b6b097215e3ef0db10e061) switched from SCHEDULED to DEPLOYING.
[flink-akka.actor.default-dispatcher-6] INFO org.apache.flink.runtime.executiongraph.ExecutionGraph - Deploying MapPartition (MapPartition at [3]assert_that/{Group, Unkey, Match}) (2/2) (attempt #0) to localhost
[flink-akka.actor.default-dispatcher-9] INFO org.apache.flink.runtime.taskexecutor.TaskExecutor - Received task MapPartition (MapPartition at [3]assert_that/{Group, Unkey, Match}) (2/2).
[MapPartition (MapPartition at [3]assert_that/{Group, Unkey, Match}) (2/2)] INFO org.apache.flink.runtime.taskmanager.Task - MapPartition (MapPartition at [3]assert_that/{Group, Unkey, Match}) (2/2) (4f7e0c2745b6b097215e3ef0db10e061) switched from CREATED to DEPLOYING.
[MapPartition (MapPartition at [3]assert_that/{Group, Unkey, Match}) (2/2)] INFO org.apache.flink.runtime.taskmanager.Task - Creating FileSystem stream leak safety net for task MapPartition (MapPartition at [3]assert_that/{Group, Unkey, Match}) (2/2) (4f7e0c2745b6b097215e3ef0db10e061) [DEPLOYING]
[MapPartition (MapPartition at [3]assert_that/{Group, Unkey, Match}) (2/2)] INFO org.apache.flink.runtime.taskmanager.Task - Loading JAR files for task MapPartition (MapPartition at [3]assert_that/{Group, Unkey, Match}) (2/2) (4f7e0c2745b6b097215e3ef0db10e061) [DEPLOYING].
[MapPartition (MapPartition at [3]assert_that/{Group, Unkey, Match}) (2/2)] INFO org.apache.flink.runtime.taskmanager.Task - Registering task at network: MapPartition (MapPartition at [3]assert_that/{Group, Unkey, Match}) (2/2) (4f7e0c2745b6b097215e3ef0db10e061) [DEPLOYING].
[MapPartition (MapPartition at [3]assert_that/{Group, Unkey, Match}) (2/2)] INFO org.apache.flink.runtime.taskmanager.Task - MapPartition (MapPartition at [3]assert_that/{Group, Unkey, Match}) (2/2) (4f7e0c2745b6b097215e3ef0db10e061) switched from DEPLOYING to RUNNING.
[flink-akka.actor.default-dispatcher-9] INFO org.apache.flink.runtime.executiongraph.ExecutionGraph - MapPartition (MapPartition at [3]assert_that/{Group, Unkey, Match}) (2/2) (4f7e0c2745b6b097215e3ef0db10e061) switched from DEPLOYING to RUNNING.
[GroupReduce (GroupReduce at assert_that/Group/GroupByKey) (2/2)] INFO org.apache.flink.runtime.taskmanager.Task - GroupReduce (GroupReduce at assert_that/Group/GroupByKey) (2/2) (75b5a2733162be98da77d5af79d18bb1) switched from RUNNING to FINISHED.
[GroupReduce (GroupReduce at assert_that/Group/GroupByKey) (2/2)] INFO org.apache.flink.runtime.taskmanager.Task - Freeing task resources for GroupReduce (GroupReduce at assert_that/Group/GroupByKey) (2/2) (75b5a2733162be98da77d5af79d18bb1).
[grpc-default-executor-0] WARN bundle_processor.create_operation - No unique name set for transform fn/read/ref_PCollection_PCollection_27:0 
[GroupReduce (GroupReduce at assert_that/Group/GroupByKey) (2/2)] INFO org.apache.flink.runtime.taskmanager.Task - Ensuring all FileSystem streams are closed for task GroupReduce (GroupReduce at assert_that/Group/GroupByKey) (2/2) (75b5a2733162be98da77d5af79d18bb1) [FINISHED]
[flink-akka.actor.default-dispatcher-10] INFO org.apache.flink.runtime.taskexecutor.TaskExecutor - Un-registering task and sending final execution state FINISHED to JobManager for task GroupReduce (GroupReduce at assert_that/Group/GroupByKey) 75b5a2733162be98da77d5af79d18bb1.
[flink-akka.actor.default-dispatcher-10] INFO org.apache.flink.runtime.executiongraph.ExecutionGraph - GroupReduce (GroupReduce at assert_that/Group/GroupByKey) (2/2) (75b5a2733162be98da77d5af79d18bb1) switched from RUNNING to FINISHED.
[GroupReduce (GroupReduce at assert_that/Group/GroupByKey) (1/2)] INFO org.apache.flink.runtime.taskmanager.Task - GroupReduce (GroupReduce at assert_that/Group/GroupByKey) (1/2) (7be155e8821aaf3cf04662cb6a851d92) switched from RUNNING to FINISHED.
[GroupReduce (GroupReduce at assert_that/Group/GroupByKey) (1/2)] INFO org.apache.flink.runtime.taskmanager.Task - Freeing task resources for GroupReduce (GroupReduce at assert_that/Group/GroupByKey) (1/2) (7be155e8821aaf3cf04662cb6a851d92).
[GroupReduce (GroupReduce at assert_that/Group/GroupByKey) (1/2)] INFO org.apache.flink.runtime.taskmanager.Task - Ensuring all FileSystem streams are closed for task GroupReduce (GroupReduce at assert_that/Group/GroupByKey) (1/2) (7be155e8821aaf3cf04662cb6a851d92) [FINISHED]
[jobmanager-future-thread-1] INFO org.apache.flink.runtime.executiongraph.ExecutionGraph - MapPartition (MapPartition at [3]assert_that/{Group, Unkey, Match}) (1/2) (b6cb08021b61e939051dabd0a6362c83) switched from CREATED to SCHEDULED.
[flink-akka.actor.default-dispatcher-10] INFO org.apache.flink.runtime.taskexecutor.TaskExecutor - Un-registering task and sending final execution state FINISHED to JobManager for task GroupReduce (GroupReduce at assert_that/Group/GroupByKey) 7be155e8821aaf3cf04662cb6a851d92.
[MapPartition (MapPartition at [3]assert_that/{Group, Unkey, Match}) (2/2)] INFO org.apache.flink.runtime.taskmanager.Task - MapPartition (MapPartition at [3]assert_that/{Group, Unkey, Match}) (2/2) (4f7e0c2745b6b097215e3ef0db10e061) switched from RUNNING to FINISHED.
[flink-akka.actor.default-dispatcher-9] INFO org.apache.flink.runtime.executiongraph.ExecutionGraph - GroupReduce (GroupReduce at assert_that/Group/GroupByKey) (1/2) (7be155e8821aaf3cf04662cb6a851d92) switched from RUNNING to FINISHED.
[MapPartition (MapPartition at [3]assert_that/{Group, Unkey, Match}) (2/2)] INFO org.apache.flink.runtime.taskmanager.Task - Freeing task resources for MapPartition (MapPartition at [3]assert_that/{Group, Unkey, Match}) (2/2) (4f7e0c2745b6b097215e3ef0db10e061).
[MapPartition (MapPartition at [3]assert_that/{Group, Unkey, Match}) (2/2)] INFO org.apache.flink.runtime.taskmanager.Task - Ensuring all FileSystem streams are closed for task MapPartition (MapPartition at [3]assert_that/{Group, Unkey, Match}) (2/2) (4f7e0c2745b6b097215e3ef0db10e061) [FINISHED]
[flink-akka.actor.default-dispatcher-11] INFO org.apache.flink.runtime.taskexecutor.TaskExecutor - Un-registering task and sending final execution state FINISHED to JobManager for task MapPartition (MapPartition at [3]assert_that/{Group, Unkey, Match}) 4f7e0c2745b6b097215e3ef0db10e061.
[jobmanager-future-thread-4] INFO org.apache.flink.runtime.executiongraph.ExecutionGraph - DataSink (DiscardingOutput) (2/2) (b5ac9ba46cc13f50d3fb452347494f64) switched from CREATED to SCHEDULED.
[flink-akka.actor.default-dispatcher-11] INFO org.apache.flink.runtime.executiongraph.ExecutionGraph - MapPartition (MapPartition at [3]assert_that/{Group, Unkey, Match}) (1/2) (b6cb08021b61e939051dabd0a6362c83) switched from SCHEDULED to DEPLOYING.
[flink-akka.actor.default-dispatcher-11] INFO org.apache.flink.runtime.executiongraph.ExecutionGraph - Deploying MapPartition (MapPartition at [3]assert_that/{Group, Unkey, Match}) (1/2) (attempt #0) to localhost
[flink-akka.actor.default-dispatcher-10] INFO org.apache.flink.runtime.executiongraph.ExecutionGraph - DataSink (DiscardingOutput) (2/2) (b5ac9ba46cc13f50d3fb452347494f64) switched from SCHEDULED to DEPLOYING.
[flink-akka.actor.default-dispatcher-10] INFO org.apache.flink.runtime.executiongraph.ExecutionGraph - Deploying DataSink (DiscardingOutput) (2/2) (attempt #0) to localhost
[flink-akka.actor.default-dispatcher-6] INFO org.apache.flink.runtime.executiongraph.ExecutionGraph - MapPartition (MapPartition at [3]assert_that/{Group, Unkey, Match}) (2/2) (4f7e0c2745b6b097215e3ef0db10e061) switched from RUNNING to FINISHED.
[flink-akka.actor.default-dispatcher-9] INFO org.apache.flink.runtime.taskexecutor.TaskExecutor - Received task MapPartition (MapPartition at [3]assert_that/{Group, Unkey, Match}) (1/2).
[MapPartition (MapPartition at [3]assert_that/{Group, Unkey, Match}) (1/2)] INFO org.apache.flink.runtime.taskmanager.Task - MapPartition (MapPartition at [3]assert_that/{Group, Unkey, Match}) (1/2) (b6cb08021b61e939051dabd0a6362c83) switched from CREATED to DEPLOYING.
[MapPartition (MapPartition at [3]assert_that/{Group, Unkey, Match}) (1/2)] INFO org.apache.flink.runtime.taskmanager.Task - Creating FileSystem stream leak safety net for task MapPartition (MapPartition at [3]assert_that/{Group, Unkey, Match}) (1/2) (b6cb08021b61e939051dabd0a6362c83) [DEPLOYING]
[MapPartition (MapPartition at [3]assert_that/{Group, Unkey, Match}) (1/2)] INFO org.apache.flink.runtime.taskmanager.Task - Loading JAR files for task MapPartition (MapPartition at [3]assert_that/{Group, Unkey, Match}) (1/2) (b6cb08021b61e939051dabd0a6362c83) [DEPLOYING].
[flink-akka.actor.default-dispatcher-9] INFO org.apache.flink.runtime.taskexecutor.TaskExecutor - Received task DataSink (DiscardingOutput) (2/2).
[DataSink (DiscardingOutput) (2/2)] INFO org.apache.flink.runtime.taskmanager.Task - DataSink (DiscardingOutput) (2/2) (b5ac9ba46cc13f50d3fb452347494f64) switched from CREATED to DEPLOYING.
[MapPartition (MapPartition at [3]assert_that/{Group, Unkey, Match}) (1/2)] INFO org.apache.flink.runtime.taskmanager.Task - Registering task at network: MapPartition (MapPartition at [3]assert_that/{Group, Unkey, Match}) (1/2) (b6cb08021b61e939051dabd0a6362c83) [DEPLOYING].
[DataSink (DiscardingOutput) (2/2)] INFO org.apache.flink.runtime.taskmanager.Task - Creating FileSystem stream leak safety net for task DataSink (DiscardingOutput) (2/2) (b5ac9ba46cc13f50d3fb452347494f64) [DEPLOYING]
[DataSink (DiscardingOutput) (2/2)] INFO org.apache.flink.runtime.taskmanager.Task - Loading JAR files for task DataSink (DiscardingOutput) (2/2) (b5ac9ba46cc13f50d3fb452347494f64) [DEPLOYING].
[MapPartition (MapPartition at [3]assert_that/{Group, Unkey, Match}) (1/2)] INFO org.apache.flink.runtime.taskmanager.Task - MapPartition (MapPartition at [3]assert_that/{Group, Unkey, Match}) (1/2) (b6cb08021b61e939051dabd0a6362c83) switched from DEPLOYING to RUNNING.
[DataSink (DiscardingOutput) (2/2)] INFO org.apache.flink.runtime.taskmanager.Task - Registering task at network: DataSink (DiscardingOutput) (2/2) (b5ac9ba46cc13f50d3fb452347494f64) [DEPLOYING].
[flink-akka.actor.default-dispatcher-10] INFO org.apache.flink.runtime.executiongraph.ExecutionGraph - MapPartition (MapPartition at [3]assert_that/{Group, Unkey, Match}) (1/2) (b6cb08021b61e939051dabd0a6362c83) switched from DEPLOYING to RUNNING.
[DataSink (DiscardingOutput) (2/2)] INFO org.apache.flink.runtime.taskmanager.Task - DataSink (DiscardingOutput) (2/2) (b5ac9ba46cc13f50d3fb452347494f64) switched from DEPLOYING to RUNNING.
[flink-akka.actor.default-dispatcher-11] INFO org.apache.flink.runtime.executiongraph.ExecutionGraph - DataSink (DiscardingOutput) (2/2) (b5ac9ba46cc13f50d3fb452347494f64) switched from DEPLOYING to RUNNING.
[DataSink (DiscardingOutput) (2/2)] INFO org.apache.flink.runtime.taskmanager.Task - DataSink (DiscardingOutput) (2/2) (b5ac9ba46cc13f50d3fb452347494f64) switched from RUNNING to FINISHED.
[DataSink (DiscardingOutput) (2/2)] INFO org.apache.flink.runtime.taskmanager.Task - Freeing task resources for DataSink (DiscardingOutput) (2/2) (b5ac9ba46cc13f50d3fb452347494f64).
[DataSink (DiscardingOutput) (2/2)] INFO org.apache.flink.runtime.taskmanager.Task - Ensuring all FileSystem streams are closed for task DataSink (DiscardingOutput) (2/2) (b5ac9ba46cc13f50d3fb452347494f64) [FINISHED]
[flink-akka.actor.default-dispatcher-6] INFO org.apache.flink.runtime.taskexecutor.TaskExecutor - Un-registering task and sending final execution state FINISHED to JobManager for task DataSink (DiscardingOutput) b5ac9ba46cc13f50d3fb452347494f64.
[flink-akka.actor.default-dispatcher-6] INFO org.apache.flink.runtime.executiongraph.ExecutionGraph - DataSink (DiscardingOutput) (2/2) (b5ac9ba46cc13f50d3fb452347494f64) switched from RUNNING to FINISHED.
[grpc-default-executor-0] WARN bundle_processor.create_operation - No unique name set for transform fn/read/ref_PCollection_PCollection_27:0 
[MapPartition (MapPartition at [3]assert_that/{Group, Unkey, Match}) (1/2)] INFO org.apache.flink.runtime.taskmanager.Task - MapPartition (MapPartition at [3]assert_that/{Group, Unkey, Match}) (1/2) (b6cb08021b61e939051dabd0a6362c83) switched from RUNNING to FINISHED.
[MapPartition (MapPartition at [3]assert_that/{Group, Unkey, Match}) (1/2)] INFO org.apache.flink.runtime.taskmanager.Task - Freeing task resources for MapPartition (MapPartition at [3]assert_that/{Group, Unkey, Match}) (1/2) (b6cb08021b61e939051dabd0a6362c83).
[MapPartition (MapPartition at [3]assert_that/{Group, Unkey, Match}) (1/2)] INFO org.apache.flink.runtime.taskmanager.Task - Ensuring all FileSystem streams are closed for task MapPartition (MapPartition at [3]assert_that/{Group, Unkey, Match}) (1/2) (b6cb08021b61e939051dabd0a6362c83) [FINISHED]
[jobmanager-future-thread-6] INFO org.apache.flink.runtime.executiongraph.ExecutionGraph - DataSink (DiscardingOutput) (1/2) (d6315e30bda29dbba1e1507a580c781b) switched from CREATED to SCHEDULED.
[flink-akka.actor.default-dispatcher-11] INFO org.apache.flink.runtime.taskexecutor.TaskExecutor - Un-registering task and sending final execution state FINISHED to JobManager for task MapPartition (MapPartition at [3]assert_that/{Group, Unkey, Match}) b6cb08021b61e939051dabd0a6362c83.
[flink-akka.actor.default-dispatcher-6] INFO org.apache.flink.runtime.executiongraph.ExecutionGraph - DataSink (DiscardingOutput) (1/2) (d6315e30bda29dbba1e1507a580c781b) switched from SCHEDULED to DEPLOYING.
[flink-akka.actor.default-dispatcher-6] INFO org.apache.flink.runtime.executiongraph.ExecutionGraph - Deploying DataSink (DiscardingOutput) (1/2) (attempt #0) to localhost
[flink-akka.actor.default-dispatcher-11] INFO org.apache.flink.runtime.taskexecutor.TaskExecutor - Received task DataSink (DiscardingOutput) (1/2).
[DataSink (DiscardingOutput) (1/2)] INFO org.apache.flink.runtime.taskmanager.Task - DataSink (DiscardingOutput) (1/2) (d6315e30bda29dbba1e1507a580c781b) switched from CREATED to DEPLOYING.
[DataSink (DiscardingOutput) (1/2)] INFO org.apache.flink.runtime.taskmanager.Task - Creating FileSystem stream leak safety net for task DataSink (DiscardingOutput) (1/2) (d6315e30bda29dbba1e1507a580c781b) [DEPLOYING]
[flink-akka.actor.default-dispatcher-6] INFO org.apache.flink.runtime.executiongraph.ExecutionGraph - MapPartition (MapPartition at [3]assert_that/{Group, Unkey, Match}) (1/2) (b6cb08021b61e939051dabd0a6362c83) switched from RUNNING to FINISHED.
[DataSink (DiscardingOutput) (1/2)] INFO org.apache.flink.runtime.taskmanager.Task - Loading JAR files for task DataSink (DiscardingOutput) (1/2) (d6315e30bda29dbba1e1507a580c781b) [DEPLOYING].
[DataSink (DiscardingOutput) (1/2)] INFO org.apache.flink.runtime.taskmanager.Task - Registering task at network: DataSink (DiscardingOutput) (1/2) (d6315e30bda29dbba1e1507a580c781b) [DEPLOYING].
[DataSink (DiscardingOutput) (1/2)] INFO org.apache.flink.runtime.taskmanager.Task - DataSink (DiscardingOutput) (1/2) (d6315e30bda29dbba1e1507a580c781b) switched from DEPLOYING to RUNNING.
[flink-akka.actor.default-dispatcher-11] INFO org.apache.flink.runtime.executiongraph.ExecutionGraph - DataSink (DiscardingOutput) (1/2) (d6315e30bda29dbba1e1507a580c781b) switched from DEPLOYING to RUNNING.
[DataSink (DiscardingOutput) (1/2)] INFO org.apache.flink.runtime.taskmanager.Task - DataSink (DiscardingOutput) (1/2) (d6315e30bda29dbba1e1507a580c781b) switched from RUNNING to FINISHED.
[DataSink (DiscardingOutput) (1/2)] INFO org.apache.flink.runtime.taskmanager.Task - Freeing task resources for DataSink (DiscardingOutput) (1/2) (d6315e30bda29dbba1e1507a580c781b).
[DataSink (DiscardingOutput) (1/2)] INFO org.apache.flink.runtime.taskmanager.Task - Ensuring all FileSystem streams are closed for task DataSink (DiscardingOutput) (1/2) (d6315e30bda29dbba1e1507a580c781b) [FINISHED]
[flink-akka.actor.default-dispatcher-10] INFO org.apache.flink.runtime.taskexecutor.TaskExecutor - Un-registering task and sending final execution state FINISHED to JobManager for task DataSink (DiscardingOutput) d6315e30bda29dbba1e1507a580c781b.
[flink-akka.actor.default-dispatcher-10] INFO org.apache.flink.runtime.executiongraph.ExecutionGraph - DataSink (DiscardingOutput) (1/2) (d6315e30bda29dbba1e1507a580c781b) switched from RUNNING to FINISHED.
[flink-akka.actor.default-dispatcher-10] INFO org.apache.flink.runtime.executiongraph.ExecutionGraph - Job BeamApp-root-0722163346-1c7fb78a (5644439dbfcfd8a62e53f44001a7e382) switched from state RUNNING to FINISHED.
[flink-akka.actor.default-dispatcher-11] INFO org.apache.flink.runtime.dispatcher.StandaloneDispatcher - Job 5644439dbfcfd8a62e53f44001a7e382 reached globally terminal state FINISHED.
[flink-runner-job-invoker] INFO org.apache.flink.runtime.minicluster.MiniCluster - Shutting down Flink Mini Cluster
[flink-akka.actor.default-dispatcher-10] INFO org.apache.flink.runtime.jobmaster.JobMaster - Stopping the JobMaster for job BeamApp-root-0722163346-1c7fb78a(5644439dbfcfd8a62e53f44001a7e382).
[flink-runner-job-invoker] INFO org.apache.flink.runtime.dispatcher.DispatcherRestEndpoint - Shutting down rest endpoint.
[flink-akka.actor.default-dispatcher-9] INFO org.apache.flink.runtime.taskexecutor.TaskExecutor - Stopping TaskExecutor akka://flink/user/taskmanager_0.
[flink-akka.actor.default-dispatcher-9] INFO org.apache.flink.runtime.state.TaskExecutorLocalStateStoresManager - Shutting down TaskExecutorLocalStateStoresManager.
[flink-akka.actor.default-dispatcher-10] INFO org.apache.flink.runtime.jobmaster.JobMaster - Close ResourceManager connection 3649bd50abcc3c1abe555fcb999926b9: JobManager is shutting down..
[flink-akka.actor.default-dispatcher-6] INFO org.apache.flink.runtime.jobmaster.slotpool.SlotPool - Suspending SlotPool.
[flink-akka.actor.default-dispatcher-6] INFO org.apache.flink.runtime.jobmaster.slotpool.SlotPool - Stopping SlotPool.
[flink-akka.actor.default-dispatcher-10] INFO org.apache.flink.runtime.taskexecutor.TaskExecutor - JobManager for job 5644439dbfcfd8a62e53f44001a7e382 with leader id acd410044a0286ae0ad2ee602a9549e5 lost leadership.
[flink-akka.actor.default-dispatcher-6] INFO org.apache.flink.runtime.resourcemanager.StandaloneResourceManager - Disconnect job manager acd410044a0286ae0ad2ee602a9549e5@akka://flink/user/jobmanager_1 for job 5644439dbfcfd8a62e53f44001a7e382 from the resource manager.
[flink-akka.actor.default-dispatcher-11] INFO org.apache.flink.runtime.dispatcher.StandaloneDispatcher - Stopping dispatcher akka://flink/user/dispatcher2782e1e9-c173-42d7-9046-4f98d2e8d013.
[flink-akka.actor.default-dispatcher-11] INFO org.apache.flink.runtime.dispatcher.StandaloneDispatcher - Stopping all currently running jobs of dispatcher akka://flink/user/dispatcher2782e1e9-c173-42d7-9046-4f98d2e8d013.
[flink-akka.actor.default-dispatcher-6] INFO org.apache.flink.runtime.resourcemanager.slotmanager.SlotManager - Closing the SlotManager.
[flink-akka.actor.default-dispatcher-6] INFO org.apache.flink.runtime.resourcemanager.slotmanager.SlotManager - Suspending the SlotManager.
[ForkJoinPool.commonPool-worker-2] INFO org.apache.flink.runtime.dispatcher.DispatcherRestEndpoint - Removing cache directory /tmp/flink-web-ui
[flink-akka.actor.default-dispatcher-9] INFO org.apache.flink.runtime.io.disk.iomanager.IOManager - I/O manager removed spill file directory /tmp/flink-io-a6d658b3-aba2-4b5a-975d-94fde9e614cb
[flink-akka.actor.default-dispatcher-9] INFO org.apache.flink.runtime.io.network.NetworkEnvironment - Shutting down the network environment and its components.
[ForkJoinPool.commonPool-worker-2] INFO org.apache.flink.runtime.dispatcher.DispatcherRestEndpoint - Shut down complete.
[flink-akka.actor.default-dispatcher-10] INFO org.apache.flink.runtime.rest.handler.legacy.backpressure.StackTraceSampleCoordinator - Shutting down stack trace sample coordinator.
[flink-akka.actor.default-dispatcher-10] INFO org.apache.flink.runtime.dispatcher.StandaloneDispatcher - Stopped dispatcher akka://flink/user/dispatcher2782e1e9-c173-42d7-9046-4f98d2e8d013.
[flink-akka.actor.default-dispatcher-9] INFO org.apache.flink.runtime.taskexecutor.JobLeaderService - Stop job leader service.
[flink-akka.actor.default-dispatcher-9] INFO org.apache.flink.runtime.taskexecutor.TaskExecutor - Stopped TaskExecutor akka://flink/user/taskmanager_0.
[flink-akka.actor.default-dispatcher-9] INFO org.apache.flink.runtime.rpc.akka.AkkaRpcService - Stopping Akka RPC service.
[flink-akka.actor.default-dispatcher-10] INFO org.apache.flink.runtime.blob.PermanentBlobCache - Shutting down BLOB cache
[flink-akka.actor.default-dispatcher-10] INFO org.apache.flink.runtime.blob.TransientBlobCache - Shutting down BLOB cache
[flink-akka.actor.default-dispatcher-10] INFO org.apache.flink.runtime.blob.BlobServer - Stopped BLOB server at 0.0.0.0:38199
[flink-akka.actor.default-dispatcher-10] INFO org.apache.flink.runtime.rpc.akka.AkkaRpcService - Stopped Akka RPC service.
[flink-runner-job-invoker] INFO org.apache.beam.runners.flink.FlinkRunner - Execution finished in 26946 msecs
[flink-runner-job-invoker] INFO org.apache.beam.runners.flink.FlinkRunner - Final accumulator values:
[flink-runner-job-invoker] INFO org.apache.beam.runners.flink.FlinkRunner - __metricscontainers : MetricQueryResults(Counters(ref_PCollection_PCollection_14:beam:metric:pardo_execution_time:start_bundle_msecs:v1 {PTRANSFORM=ref_AppliedPTransform_assert_that/Group/Flatten_34}: 0, ref_PCollection_PCollection_27:beam:metric:pardo_execution_time:start_bundle_msecs:v1 {PTRANSFORM=fn/read/ref_PCollection_PCollection_27:0}: 0, ref_PCollection_PCollection_12:beam:metric:pardo_execution_time:finish_bundle_msecs:v1 {PTRANSFORM=ExternalTransform(pytest:beam:transforms:count)/Combine.perKey(Count)/Precombine}: 0, ref_PCollection_PCollection_9:beam:metric:pardo_execution_time:finish_bundle_msecs:v1 {PTRANSFORM=fn/read/ref_PCollection_PCollection_9:0}: 0, ref_PCollection_PCollection_9:beam:metric:pardo_execution_time:start_bundle_msecs:v1 {PTRANSFORM=fn/read/ref_PCollection_PCollection_9:0}: 0, ref_PCollection_PCollection_27:beam:metric:pardo_execution_time:finish_bundle_msecs:v1 {PTRANSFORM=fn/read/ref_PCollection_PCollection_27:0}: 0, ref_PCollection_PCollection_9:beam:metric:pardo_execution_time:process_bundle_msecs:v1 {PTRANSFORM=fn/read/ref_PCollection_PCollection_9:0}: 0, ref_PCollection_PCollection_14:beam:metric:pardo_execution_time:finish_bundle_msecs:v1 {PTRANSFORM=ref_AppliedPTransform_assert_that/ToVoidKey_30}: 0, ref_PCollection_PCollection_12:beam:metric:pardo_execution_time:process_bundle_msecs:v1 {PTRANSFORM=external_2root/Init/Map/ParMultiDo(Anonymous)}: 0, ref_PCollection_PCollection_9:beam:metric:pardo_execution_time:finish_bundle_msecs:v1 {PTRANSFORM=fn/write/ref_PCollection_PCollection_12:0}: 0, ref_PCollection_PCollection_12:beam:metric:element_count:v1 {PCOLLECTION=pcollection}: 5, ref_PCollection_PCollection_12:beam:metric:pardo_execution_time:process_bundle_msecs:v1 {PTRANSFORM=ExternalTransform(pytest:beam:transforms:count)/Combine.perKey(Count)/Precombine}: 0, ref_PCollection_PCollection_1:beam:metric:ptransform_execution_time:total_msecs:v1 {PTRANSFORM=fn/read/ref_PCollection_PCollection_1:0}: 0, ref_PCollection_PCollection_14:beam:metric:pardo_execution_time:process_bundle_msecs:v1 {PTRANSFORM=ref_AppliedPTransform_assert_that/ToVoidKey_30}: 0, ref_PCollection_PCollection_14:beam:metric:pardo_execution_time:finish_bundle_msecs:v1 {PTRANSFORM=fn/write/ref_PCollection_PCollection_24:1:0}: 0, ref_PCollection_PCollection_14:beam:metric:pardo_execution_time:start_bundle_msecs:v1 {PTRANSFORM=fn/read/ref_PCollection_PCollection_14:0}: 0, ref_PCollection_PCollection_14:beam:metric:pardo_execution_time:start_bundle_msecs:v1 {PTRANSFORM=fn/write/ref_PCollection_PCollection_24:1:0}: 0, ref_PCollection_PCollection_14:beam:metric:pardo_execution_time:finish_bundle_msecs:v1 {PTRANSFORM=fn/read/ref_PCollection_PCollection_14:0}: 0, ref_PCollection_PCollection_9:beam:metric:pardo_execution_time:start_bundle_msecs:v1 {PTRANSFORM=fn/write/ref_PCollection_PCollection_12:0}: 0, ref_PCollection_PCollection_14:beam:metric:pardo_execution_time:finish_bundle_msecs:v1 {PTRANSFORM=ref_AppliedPTransform_assert_that/Group/Flatten_34}: 0, ref_PCollection_PCollection_12:beam:metric:pardo_execution_time:start_bundle_msecs:v1 {PTRANSFORM=ExternalTransform(pytest:beam:transforms:count)/Combine.perKey(Count)/Precombine}: 0, ref_PCollection_PCollection_14:beam:metric:pardo_execution_time:start_bundle_msecs:v1 {PTRANSFORM=ref_AppliedPTransform_Map(<lambda at external_test.py:213>)_22}: 0, ref_PCollection_PCollection_9:beam:metric:ptransform_execution_time:total_msecs:v1 {PTRANSFORM=ref_AppliedPTransform_Create/Map(decode)_16}: 0, ref_PCollection_PCollection_17:beam:metric:element_count:v1 {PCOLLECTION=ref_PCollection_PCollection_18}: 1, ref_PCollection_PCollection_17:beam:metric:element_count:v1 {PCOLLECTION=ref_PCollection_PCollection_19}: 1, ref_PCollection_PCollection_17:beam:metric:ptransform_execution_time:total_msecs:v1 {PTRANSFORM=ref_AppliedPTransform_assert_that/Create/Map(decode)_28}: 0, ref_PCollection_PCollection_17:beam:metric:element_count:v1 {PCOLLECTION=ref_PCollection_PCollection_17}: 1, ref_PCollection_PCollection_12:beam:metric:pardo_execution_time:finish_bundle_msecs:v1 {PTRANSFORM=external_2root/Init/Map/ParMultiDo(Anonymous)}: 0, ref_PCollection_PCollection_17:beam:metric:pardo_execution_time:process_bundle_msecs:v1 {PTRANSFORM=ref_AppliedPTransform_assert_that/Create/FlatMap(<lambda at core.py:2257>)_26}: 0, pcollection_1:beam:metric:pardo_execution_time:start_bundle_msecs:v1 {PTRANSFORM=fn/write/ref_PCollection_PCollection_14:0}: 0, pcollection_1:beam:metric:pardo_execution_time:finish_bundle_msecs:v1 {PTRANSFORM=fn/write/ref_PCollection_PCollection_14:0}: 0, ref_PCollection_PCollection_27:beam:metric:pardo_execution_time:start_bundle_msecs:v1 {PTRANSFORM=ref_AppliedPTransform_assert_that/Match_41}: 0, pcollection_1:beam:metric:element_count:v1 {PCOLLECTION=pcollection_1}: 3, ref_PCollection_PCollection_17:beam:metric:element_count:v1 {PCOLLECTION=ref_PCollection_PCollection_24:0}: 1, ref_PCollection_PCollection_14:beam:metric:pardo_execution_time:process_bundle_msecs:v1 {PTRANSFORM=fn/read/ref_PCollection_PCollection_14:0}: 0, ref_PCollection_PCollection_1:beam:metric:pardo_execution_time:process_bundle_msecs:v1 {PTRANSFORM=fn/write/ref_PCollection_PCollection_2:0}: 0, ref_PCollection_PCollection_27:beam:metric:pardo_execution_time:finish_bundle_msecs:v1 {PTRANSFORM=ref_AppliedPTransform_assert_that/Match_41}: 0, ref_PCollection_PCollection_1:beam:metric:element_count:v1 {PCOLLECTION=ref_PCollection_PCollection_1}: 1, ref_PCollection_PCollection_14:beam:metric:ptransform_execution_time:total_msecs:v1 {PTRANSFORM=ref_AppliedPTransform_assert_that/Group/Flatten_34}: 0, ref_PCollection_PCollection_14:beam:metric:pardo_execution_time:start_bundle_msecs:v1 {PTRANSFORM=ref_AppliedPTransform_assert_that/WindowInto(WindowIntoFn)_29}: 0, ref_PCollection_PCollection_14:beam:metric:pardo_execution_time:start_bundle_msecs:v1 {PTRANSFORM=ref_AppliedPTransform_assert_that/ToVoidKey_30}: 0, ref_PCollection_PCollection_1:beam:metric:element_count:v1 {PCOLLECTION=ref_PCollection_PCollection_2}: 12, pcollection_1:beam:metric:element_count:v1 {PCOLLECTION=pcollection_2}: 3, ref_PCollection_PCollection_17:beam:metric:ptransform_execution_time:total_msecs:v1 {PTRANSFORM=ref_AppliedPTransform_assert_that/Create/FlatMap(<lambda at core.py:2257>)_26}: 0, ref_PCollection_PCollection_27:beam:metric:element_count:v1 {PCOLLECTION=ref_PCollection_PCollection_30}: 1, ref_PCollection_PCollection_14:beam:metric:pardo_execution_time:finish_bundle_msecs:v1 {PTRANSFORM=ref_AppliedPTransform_Map(<lambda at external_test.py:213>)_22}: 0, ref_PCollection_PCollection_14:beam:metric:pardo_execution_time:process_bundle_msecs:v1 {PTRANSFORM=ref_AppliedPTransform_Map(<lambda at external_test.py:213>)_22}: 0, ref_PCollection_PCollection_14:beam:metric:pardo_execution_time:process_bundle_msecs:v1 {PTRANSFORM=ref_AppliedPTransform_assert_that/Group/Flatten_34}: 0, ref_PCollection_PCollection_14:beam:metric:ptransform_execution_time:total_msecs:v1 {PTRANSFORM=fn/read/ref_PCollection_PCollection_14:0}: 0, ref_PCollection_PCollection_14:beam:metric:pardo_execution_time:process_bundle_msecs:v1 {PTRANSFORM=ref_AppliedPTransform_assert_that/WindowInto(WindowIntoFn)_29}: 0, pcollection_1:beam:metric:pardo_execution_time:finish_bundle_msecs:v1 {PTRANSFORM=fn/read/pcollection_1:0}: 0, ref_PCollection_PCollection_17:beam:metric:ptransform_execution_time:total_msecs:v1 {PTRANSFORM=ref_AppliedPTransform_assert_that/Group/pair_with_0_32}: 0, ref_PCollection_PCollection_9:beam:metric:pardo_execution_time:process_bundle_msecs:v1 {PTRANSFORM=ref_AppliedPTransform_Map(unicode)_17}: 0, ref_PCollection_PCollection_27:beam:metric:pardo_execution_time:finish_bundle_msecs:v1 {PTRANSFORM=ref_AppliedPTransform_assert_that/Unkey_40}: 0, ref_PCollection_PCollection_14:beam:metric:ptransform_execution_time:total_msecs:v1 {PTRANSFORM=ref_AppliedPTransform_Map(<lambda at external_test.py:213>)_22}: 0, pcollection_1:beam:metric:pardo_execution_time:process_bundle_msecs:v1 {PTRANSFORM=ExternalTransform(pytest:beam:transforms:count)/Combine.perKey(Count)/Merge}: 0, ref_PCollection_PCollection_12:beam:metric:pardo_execution_time:start_bundle_msecs:v1 {PTRANSFORM=external_2root/Init/Map/ParMultiDo(Anonymous)}: 0, ref_PCollection_PCollection_1:beam:metric:ptransform_execution_time:total_msecs:v1 {PTRANSFORM=ref_AppliedPTransform_Create/FlatMap(<lambda at core.py:2257>)_4}: 6, ref_PCollection_PCollection_27:beam:metric:pardo_execution_time:start_bundle_msecs:v1 {PTRANSFORM=ref_AppliedPTransform_assert_that/Group/Map(_merge_tagged_vals_under_key)_39}: 0, ref_PCollection_PCollection_9:beam:metric:ptransform_execution_time:total_msecs:v1 {PTRANSFORM=ref_AppliedPTransform_Map(unicode)_17}: 0, ref_PCollection_PCollection_14:beam:metric:pardo_execution_time:finish_bundle_msecs:v1 {PTRANSFORM=ref_AppliedPTransform_assert_that/WindowInto(WindowIntoFn)_29}: 0, ref_PCollection_PCollection_17:beam:metric:pardo_execution_time:start_bundle_msecs:v1 {PTRANSFORM=fn/write/ref_PCollection_PCollection_24:0:0}: 0, ref_PCollection_PCollection_27:beam:metric:ptransform_execution_time:total_msecs:v1 {PTRANSFORM=fn/read/ref_PCollection_PCollection_27:0}: 0, ref_PCollection_PCollection_14:beam:metric:ptransform_execution_time:total_msecs:v1 {PTRANSFORM=ref_AppliedPTransform_assert_that/ToVoidKey_30}: 0, ref_PCollection_PCollection_27:beam:metric:ptransform_execution_time:total_msecs:v1 {PTRANSFORM=ref_AppliedPTransform_assert_that/Unkey_40}: 0, pcollection_1:beam:metric:element_count:v1 {PCOLLECTION=ref_PCollection_PCollection_14}: 3, ref_PCollection_PCollection_27:beam:metric:pardo_execution_time:process_bundle_msecs:v1 {PTRANSFORM=fn/read/ref_PCollection_PCollection_27:0}: 0, ref_PCollection_PCollection_17:beam:metric:pardo_execution_time:finish_bundle_msecs:v1 {PTRANSFORM=ref_AppliedPTransform_assert_that/Create/FlatMap(<lambda at core.py:2257>)_26}: 0, ref_PCollection_PCollection_14:beam:metric:ptransform_execution_time:total_msecs:v1 {PTRANSFORM=ref_AppliedPTransform_assert_that/Group/pair_with_1_33}: 20, ref_PCollection_PCollection_17:beam:metric:element_count:v1 {PCOLLECTION=ref_PCollection_PCollection_22}: 1, ref_PCollection_PCollection_14:beam:metric:pardo_execution_time:start_bundle_msecs:v1 {PTRANSFORM=ref_AppliedPTransform_Map(<lambda at external_test.py:212>)_21}: 0, ref_PCollection_PCollection_27:beam:metric:element_count:v1 {PCOLLECTION=ref_PCollection_PCollection_28}: 1, ref_PCollection_PCollection_14:beam:metric:pardo_execution_time:process_bundle_msecs:v1 {PTRANSFORM=fn/write/ref_PCollection_PCollection_24:1:0}: 0, ref_PCollection_PCollection_17:beam:metric:ptransform_execution_time:total_msecs:v1 {PTRANSFORM=fn/read/ref_PCollection_PCollection_17:0}: 0, ref_PCollection_PCollection_27:beam:metric:element_count:v1 {PCOLLECTION=ref_PCollection_PCollection_29}: 1, ref_PCollection_PCollection_12:beam:metric:element_count:v1 {PCOLLECTION=external_2root/Init/Map/ParMultiDo(Anonymous).output}: 6, ref_PCollection_PCollection_27:beam:metric:element_count:v1 {PCOLLECTION=ref_PCollection_PCollection_27}: 1, pcollection_1:beam:metric:pardo_execution_time:start_bundle_msecs:v1 {PTRANSFORM=fn/read/pcollection_1:0}: 0, ref_PCollection_PCollection_17:beam:metric:pardo_execution_time:start_bundle_msecs:v1 {PTRANSFORM=ref_AppliedPTransform_assert_that/Create/FlatMap(<lambda at core.py:2257>)_26}: 0, pcollection_1:beam:metric:pardo_execution_time:process_bundle_msecs:v1 {PTRANSFORM=ExternalTransform(pytest:beam:transforms:count)/Combine.perKey(Count)/ExtractOutputs}: 0, ref_PCollection_PCollection_9:beam:metric:pardo_execution_time:finish_bundle_msecs:v1 {PTRANSFORM=ref_AppliedPTransform_Map(unicode)_17}: 0, ref_PCollection_PCollection_17:beam:metric:ptransform_execution_time:total_msecs:v1 {PTRANSFORM=fn/write/ref_PCollection_PCollection_24:0:0}: 0, ref_PCollection_PCollection_9:beam:metric:pardo_execution_time:finish_bundle_msecs:v1 {PTRANSFORM=ref_AppliedPTransform_Map(<lambda at external_test.py:208>)_18}: 0, ref_PCollection_PCollection_9:beam:metric:pardo_execution_time:finish_bundle_msecs:v1 {PTRANSFORM=ref_AppliedPTransform_Create/Map(decode)_16}: 0, ref_PCollection_PCollection_27:beam:metric:pardo_execution_time:process_bundle_msecs:v1 {PTRANSFORM=ref_AppliedPTransform_assert_that/Group/Map(_merge_tagged_vals_under_key)_39}: 0, ref_PCollection_PCollection_17:beam:metric:pardo_execution_time:start_bundle_msecs:v1 {PTRANSFORM=ref_AppliedPTransform_assert_that/Group/Flatten_34}: 0, ref_PCollection_PCollection_27:beam:metric:pardo_execution_time:finish_bundle_msecs:v1 {PTRANSFORM=ref_AppliedPTransform_assert_that/Group/Map(_merge_tagged_vals_under_key)_39}: 0, ref_PCollection_PCollection_17:beam:metric:pardo_execution_time:finish_bundle_msecs:v1 {PTRANSFORM=ref_AppliedPTransform_assert_that/Group/Flatten_34}: 0, ref_PCollection_PCollection_12:beam:metric:pardo_execution_time:finish_bundle_msecs:v1 {PTRANSFORM=fn/write/pcollection:0}: 0, ref_PCollection_PCollection_12:beam:metric:pardo_execution_time:finish_bundle_msecs:v1 {PTRANSFORM=fn/read/ref_PCollection_PCollection_12:0}: 0, ref_PCollection_PCollection_12:beam:metric:pardo_execution_time:start_bundle_msecs:v1 {PTRANSFORM=fn/write/pcollection:0}: 0, ref_PCollection_PCollection_12:beam:metric:element_count:v1 {PCOLLECTION=ref_PCollection_PCollection_13}: 6, ref_PCollection_PCollection_14:beam:metric:pardo_execution_time:process_bundle_msecs:v1 {PTRANSFORM=ref_AppliedPTransform_Map(<lambda at external_test.py:212>)_21}: 0, ref_PCollection_PCollection_9:beam:metric:pardo_execution_time:process_bundle_msecs:v1 {PTRANSFORM=ref_AppliedPTransform_Create/Map(decode)_16}: 0, ref_PCollection_PCollection_14:beam:metric:pardo_execution_time:finish_bundle_msecs:v1 {PTRANSFORM=ref_AppliedPTransform_Map(<lambda at external_test.py:212>)_21}: 0, ref_PCollection_PCollection_12:beam:metric:pardo_execution_time:process_bundle_msecs:v1 {PTRANSFORM=fn/write/pcollection:0}: 0, ref_PCollection_PCollection_9:beam:metric:pardo_execution_time:start_bundle_msecs:v1 {PTRANSFORM=ref_AppliedPTransform_Map(unicode)_17}: 0, ref_PCollection_PCollection_9:beam:metric:pardo_execution_time:start_bundle_msecs:v1 {PTRANSFORM=ref_AppliedPTransform_Map(<lambda at external_test.py:208>)_18}: 2, ref_PCollection_PCollection_27:beam:metric:pardo_execution_time:start_bundle_msecs:v1 {PTRANSFORM=ref_AppliedPTransform_assert_that/Unkey_40}: 0, ref_PCollection_PCollection_17:beam:metric:pardo_execution_time:finish_bundle_msecs:v1 {PTRANSFORM=ref_AppliedPTransform_assert_that/Group/pair_with_0_32}: 0, ref_PCollection_PCollection_1:beam:metric:pardo_execution_time:process_bundle_msecs:v1 {PTRANSFORM=fn/read/ref_PCollection_PCollection_1:0}: 0, ref_PCollection_PCollection_17:beam:metric:pardo_execution_time:process_bundle_msecs:v1 {PTRANSFORM=ref_AppliedPTransform_assert_that/Group/pair_with_0_32}: 0, ref_PCollection_PCollection_14:beam:metric:element_count:v1 {PCOLLECTION=ref_PCollection_PCollection_14}: 3, ref_PCollection_PCollection_12:beam:metric:pardo_execution_time:start_bundle_msecs:v1 {PTRANSFORM=fn/read/ref_PCollection_PCollection_12:0}: 0, ref_PCollection_PCollection_9:beam:metric:element_count:v1 {PCOLLECTION=ref_PCollection_PCollection_9}: 12, ref_PCollection_PCollection_17:beam:metric:pardo_execution_time:process_bundle_msecs:v1 {PTRANSFORM=fn/write/ref_PCollection_PCollection_24:0:0}: 0, ref_PCollection_PCollection_14:beam:metric:element_count:v1 {PCOLLECTION=ref_PCollection_PCollection_16}: 3, ref_PCollection_PCollection_17:beam:metric:pardo_execution_time:finish_bundle_msecs:v1 {PTRANSFORM=fn/write/ref_PCollection_PCollection_24:0:0}: 0, ref_PCollection_PCollection_1:beam:metric:pardo_execution_time:start_bundle_msecs:v1 {PTRANSFORM=fn/read/ref_PCollection_PCollection_1:0}: 0, ref_PCollection_PCollection_14:beam:metric:element_count:v1 {PCOLLECTION=ref_PCollection_PCollection_15}: 3, ref_PCollection_PCollection_17:beam:metric:pardo_execution_time:process_bundle_msecs:v1 {PTRANSFORM=ref_AppliedPTransform_assert_that/Group/Flatten_34}: 2, ref_PCollection_PCollection_1:beam:metric:ptransform_execution_time:total_msecs:v1 {PTRANSFORM=fn/write/ref_PCollection_PCollection_2:0}: 0, ref_PCollection_PCollection_17:beam:metric:ptransform_execution_time:total_msecs:v1 {PTRANSFORM=ref_AppliedPTransform_assert_that/Group/Flatten_34}: 2, ref_PCollection_PCollection_12:beam:metric:element_count:v1 {PCOLLECTION=ref_PCollection_PCollection_12}: 12, ref_PCollection_PCollection_14:beam:metric:ptransform_execution_time:total_msecs:v1 {PTRANSFORM=ref_AppliedPTransform_Map(<lambda at external_test.py:212>)_21}: 0, ref_PCollection_PCollection_1:beam:metric:pardo_execution_time:finish_bundle_msecs:v1 {PTRANSFORM=fn/read/ref_PCollection_PCollection_1:0}: 0, ref_PCollection_PCollection_9:beam:metric:ptransform_execution_time:total_msecs:v1 {PTRANSFORM=fn/read/ref_PCollection_PCollection_9:0}: 0, ref_PCollection_PCollection_1:beam:metric:pardo_execution_time:process_bundle_msecs:v1 {PTRANSFORM=ref_AppliedPTransform_Create/FlatMap(<lambda at core.py:2257>)_4}: 2, ref_PCollection_PCollection_14:beam:metric:element_count:v1 {PCOLLECTION=ref_PCollection_PCollection_24:1}: 3, ref_PCollection_PCollection_27:beam:metric:pardo_execution_time:process_bundle_msecs:v1 {PTRANSFORM=ref_AppliedPTransform_assert_that/Unkey_40}: 0, ref_PCollection_PCollection_9:beam:metric:pardo_execution_time:process_bundle_msecs:v1 {PTRANSFORM=ref_AppliedPTransform_Map(<lambda at external_test.py:208>)_18}: 0, ref_PCollection_PCollection_14:beam:metric:pardo_execution_time:finish_bundle_msecs:v1 {PTRANSFORM=ref_AppliedPTransform_assert_that/Group/pair_with_1_33}: 0, ref_PCollection_PCollection_14:beam:metric:ptransform_execution_time:total_msecs:v1 {PTRANSFORM=fn/write/ref_PCollection_PCollection_24:1:0}: 0, ref_PCollection_PCollection_14:beam:metric:pardo_execution_time:process_bundle_msecs:v1 {PTRANSFORM=ref_AppliedPTransform_assert_that/Group/pair_with_1_33}: 0, ref_PCollection_PCollection_17:beam:metric:pardo_execution_time:start_bundle_msecs:v1 {PTRANSFORM=ref_AppliedPTransform_assert_that/Create/Map(decode)_28}: 0, ref_PCollection_PCollection_17:beam:metric:pardo_execution_time:process_bundle_msecs:v1 {PTRANSFORM=ref_AppliedPTransform_assert_that/Create/Map(decode)_28}: 0, ref_PCollection_PCollection_9:beam:metric:pardo_execution_time:process_bundle_msecs:v1 {PTRANSFORM=fn/write/ref_PCollection_PCollection_12:0}: 0, ref_PCollection_PCollection_14:beam:metric:pardo_execution_time:start_bundle_msecs:v1 {PTRANSFORM=ref_AppliedPTransform_assert_that/Group/pair_with_1_33}: 20, ref_PCollection_PCollection_17:beam:metric:pardo_execution_time:start_bundle_msecs:v1 {PTRANSFORM=fn/read/ref_PCollection_PCollection_17:0}: 0, ref_PCollection_PCollection_27:beam:metric:pardo_execution_time:process_bundle_msecs:v1 {PTRANSFORM=ref_AppliedPTransform_assert_that/Match_41}: 0, ref_PCollection_PCollection_1:beam:metric:pardo_execution_time:start_bundle_msecs:v1 {PTRANSFORM=ref_AppliedPTransform_Create/FlatMap(<lambda at core.py:2257>)_4}: 4, ref_PCollection_PCollection_9:beam:metric:ptransform_execution_time:total_msecs:v1 {PTRANSFORM=ref_AppliedPTransform_Map(<lambda at external_test.py:208>)_18}: 2, ref_PCollection_PCollection_1:beam:metric:pardo_execution_time:finish_bundle_msecs:v1 {PTRANSFORM=ref_AppliedPTransform_Create/FlatMap(<lambda at core.py:2257>)_4}: 0, ref_PCollection_PCollection_1:beam:metric:pardo_execution_time:finish_bundle_msecs:v1 {PTRANSFORM=fn/write/ref_PCollection_PCollection_2:0}: 0, ref_PCollection_PCollection_9:beam:metric:ptransform_execution_time:total_msecs:v1 {PTRANSFORM=fn/write/ref_PCollection_PCollection_12:0}: 0, ref_PCollection_PCollection_17:beam:metric:pardo_execution_time:finish_bundle_msecs:v1 {PTRANSFORM=fn/read/ref_PCollection_PCollection_17:0}: 0, ref_PCollection_PCollection_17:beam:metric:pardo_execution_time:finish_bundle_msecs:v1 {PTRANSFORM=ref_AppliedPTransform_assert_that/Create/Map(decode)_28}: 0, ref_PCollection_PCollection_17:beam:metric:pardo_execution_time:start_bundle_msecs:v1 {PTRANSFORM=ref_AppliedPTransform_assert_that/Group/pair_with_0_32}: 0, ref_PCollection_PCollection_14:beam:metric:element_count:v1 {PCOLLECTION=ref_PCollection_PCollection_23}: 3, ref_PCollection_PCollection_27:beam:metric:ptransform_execution_time:total_msecs:v1 {PTRANSFORM=ref_AppliedPTransform_assert_that/Match_41}: 0, ref_PCollection_PCollection_14:beam:metric:element_count:v1 {PCOLLECTION=ref_PCollection_PCollection_20}: 3, pcollection_1:beam:metric:pardo_execution_time:process_bundle_msecs:v1 {PTRANSFORM=fn/write/ref_PCollection_PCollection_14:0}: 0, ref_PCollection_PCollection_14:beam:metric:element_count:v1 {PCOLLECTION=ref_PCollection_PCollection_21}: 3, ref_PCollection_PCollection_9:beam:metric:element_count:v1 {PCOLLECTION=ref_PCollection_PCollection_11}: 12, ref_PCollection_PCollection_9:beam:metric:element_count:v1 {PCOLLECTION=ref_PCollection_PCollection_12}: 12, ref_PCollection_PCollection_9:beam:metric:element_count:v1 {PCOLLECTION=ref_PCollection_PCollection_10}: 12, ref_PCollection_PCollection_27:beam:metric:ptransform_execution_time:total_msecs:v1 {PTRANSFORM=ref_AppliedPTransform_assert_that/Group/Map(_merge_tagged_vals_under_key)_39}: 0, ref_PCollection_PCollection_1:beam:metric:pardo_execution_time:start_bundle_msecs:v1 {PTRANSFORM=fn/write/ref_PCollection_PCollection_2:0}: 0, ref_PCollection_PCollection_14:beam:metric:ptransform_execution_time:total_msecs:v1 {PTRANSFORM=ref_AppliedPTransform_assert_that/WindowInto(WindowIntoFn)_29}: 0, ref_PCollection_PCollection_12:beam:metric:pardo_execution_time:finish_bundle_msecs:v1 {PTRANSFORM=external_1root/ParDo(Anonymous)/ParMultiDo(Anonymous)}: 0, ref_PCollection_PCollection_17:beam:metric:pardo_execution_time:process_bundle_msecs:v1 {PTRANSFORM=fn/read/ref_PCollection_PCollection_17:0}: 0, ref_PCollection_PCollection_12:beam:metric:pardo_execution_time:process_bundle_msecs:v1 {PTRANSFORM=external_1root/ParDo(Anonymous)/ParMultiDo(Anonymous)}: 0, ref_PCollection_PCollection_12:beam:metric:pardo_execution_time:start_bundle_msecs:v1 {PTRANSFORM=external_1root/ParDo(Anonymous)/ParMultiDo(Anonymous)}: 0, ref_PCollection_PCollection_9:beam:metric:pardo_execution_time:start_bundle_msecs:v1 {PTRANSFORM=ref_AppliedPTransform_Create/Map(decode)_16}: 0)Distributions(ref_PCollection_PCollection_14:beam:metric:sampled_byte_size:v1 {PCOLLECTION=ref_PCollection_PCollection_16}: DistributionResult{sum=54, count=3, min=18, max=18}, ref_PCollection_PCollection_14:beam:metric:sampled_byte_size:v1 {PCOLLECTION=ref_PCollection_PCollection_15}: DistributionResult{sum=51, count=3, min=17, max=17}, ref_PCollection_PCollection_14:beam:metric:sampled_byte_size:v1 {PCOLLECTION=ref_PCollection_PCollection_14}: DistributionResult{sum=45, count=3, min=15, max=15}, ref_PCollection_PCollection_27:beam:metric:sampled_byte_size:v1 {PCOLLECTION=ref_PCollection_PCollection_30}: DistributionResult{sum=14, count=1, min=14, max=14}, ref_PCollection_PCollection_17:beam:metric:sampled_byte_size:v1 {PCOLLECTION=ref_PCollection_PCollection_24:0}: DistributionResult{sum=19, count=1, min=19, max=19}, ref_PCollection_PCollection_17:beam:metric:sampled_byte_size:v1 {PCOLLECTION=ref_PCollection_PCollection_17}: DistributionResult{sum=13, count=1, min=13, max=13}, ref_PCollection_PCollection_14:beam:metric:sampled_byte_size:v1 {PCOLLECTION=ref_PCollection_PCollection_24:1}: DistributionResult{sum=72, count=3, min=24, max=24}, ref_PCollection_PCollection_17:beam:metric:sampled_byte_size:v1 {PCOLLECTION=ref_PCollection_PCollection_18}: DistributionResult{sum=16, count=1, min=16, max=16}, ref_PCollection_PCollection_17:beam:metric:sampled_byte_size:v1 {PCOLLECTION=ref_PCollection_PCollection_19}: DistributionResult{sum=15, count=1, min=15, max=15}, ref_PCollection_PCollection_9:beam:metric:sampled_byte_size:v1 {PCOLLECTION=ref_PCollection_PCollection_9}: DistributionResult{sum=192, count=12, min=16, max=16}, ref_PCollection_PCollection_17:beam:metric:sampled_byte_size:v1 {PCOLLECTION=ref_PCollection_PCollection_22}: DistributionResult{sum=17, count=1, min=17, max=17}, ref_PCollection_PCollection_9:beam:metric:sampled_byte_size:v1 {PCOLLECTION=ref_PCollection_PCollection_10}: DistributionResult{sum=168, count=12, min=14, max=14}, ref_PCollection_PCollection_9:beam:metric:sampled_byte_size:v1 {PCOLLECTION=ref_PCollection_PCollection_12}: DistributionResult{sum=168, count=12, min=14, max=14}, ref_PCollection_PCollection_9:beam:metric:sampled_byte_size:v1 {PCOLLECTION=ref_PCollection_PCollection_11}: DistributionResult{sum=168, count=12, min=14, max=14}, ref_PCollection_PCollection_1:beam:metric:sampled_byte_size:v1 {PCOLLECTION=ref_PCollection_PCollection_1}: DistributionResult{sum=13, count=1, min=13, max=13}, ref_PCollection_PCollection_27:beam:metric:sampled_byte_size:v1 {PCOLLECTION=ref_PCollection_PCollection_27}: DistributionResult{sum=58, count=1, min=58, max=58}, ref_PCollection_PCollection_27:beam:metric:sampled_byte_size:v1 {PCOLLECTION=ref_PCollection_PCollection_28}: DistributionResult{sum=41, count=1, min=41, max=41}, ref_PCollection_PCollection_14:beam:metric:sampled_byte_size:v1 {PCOLLECTION=ref_PCollection_PCollection_23}: DistributionResult{sum=63, count=3, min=21, max=21}, ref_PCollection_PCollection_27:beam:metric:sampled_byte_size:v1 {PCOLLECTION=ref_PCollection_PCollection_29}: DistributionResult{sum=33, count=1, min=33, max=33}, ref_PCollection_PCollection_1:beam:metric:sampled_byte_size:v1 {PCOLLECTION=ref_PCollection_PCollection_2}: DistributionResult{sum=150, count=10, min=15, max=15}, ref_PCollection_PCollection_14:beam:metric:sampled_byte_size:v1 {PCOLLECTION=ref_PCollection_PCollection_21}: DistributionResult{sum=57, count=3, min=19, max=19}, ref_PCollection_PCollection_14:beam:metric:sampled_byte_size:v1 {PCOLLECTION=ref_PCollection_PCollection_20}: DistributionResult{sum=54, count=3, min=18, max=18}))
[flink-runner-job-invoker] INFO org.apache.beam.runners.fnexecution.artifact.BeamFileSystemArtifactRetrievalService - Manifest at /tmp/beam-artifact-staging/job_d8312fb8-0900-41e0-a628-a2d2274be978/MANIFEST has 0 artifact locations
[flink-runner-job-invoker] INFO org.apache.beam.runners.fnexecution.artifact.BeamFileSystemArtifactStagingService - Removed dir /tmp/beam-artifact-staging/job_d8312fb8-0900-41e0-a628-a2d2274be978/

FAILURE: Build completed with 2 failures.

1: Task failed with an exception.
-----------
* Where:
Build file '<https://builds.apache.org/job/beam_PostCommit_Python2/ws/src/sdks/python/build.gradle'> line: 115

* What went wrong:
Execution failed for task ':sdks:python:directRunnerIT'.
> Process 'command 'sh'' finished with non-zero exit value 1

* Try:
Run with --stacktrace option to get the stack trace. Run with --info or --debug option to get more log output. Run with --scan to get full insights.
==============================================================================

2: Task failed with an exception.
-----------
* Where:
Build file '<https://builds.apache.org/job/beam_PostCommit_Python2/ws/src/sdks/python/build.gradle'> line: 427

* What went wrong:
Execution failed for task ':sdks:python:crossLanguagePortableWordCount'.
> Process 'command 'sh'' finished with non-zero exit value 1

* Try:
Run with --stacktrace option to get the stack trace. Run with --info or --debug option to get more log output. Run with --scan to get full insights.
==============================================================================

* Get more help at https://help.gradle.org

Deprecated Gradle features were used in this build, making it incompatible with Gradle 6.0.
Use '--warning-mode all' to show the individual deprecation warnings.
See https://docs.gradle.org/5.2.1/userguide/command_line_interface.html#sec:command_line_warnings

BUILD FAILED in 1h 7m 9s
105 actionable tasks: 81 executed, 21 from cache, 3 up-to-date

Publishing build scan...
https://gradle.com/s/crslpslm6h634

Build step 'Invoke Gradle script' changed build result to FAILURE
Build step 'Invoke Gradle script' marked build as failure

---------------------------------------------------------------------
To unsubscribe, e-mail: builds-unsubscribe@beam.apache.org
For additional commands, e-mail: builds-help@beam.apache.org


Mime
View raw message