beam-builds mailing list archives

Site index · List index
Message view « Date » · « Thread »
Top « Date » · « Thread »
From Apache Jenkins Server <jenk...@builds.apache.org>
Subject Build failed in Jenkins: beam_PostCommit_Python35 #19
Date Mon, 22 Jul 2019 13:37:07 GMT
See <https://builds.apache.org/job/beam_PostCommit_Python35/19/display/redirect>

------------------------------------------
[...truncated 75.60 KB...]
test_big_query_legacy_sql (apache_beam.io.gcp.big_query_query_to_table_it_test.BigQueryQueryToTableIT)
... ok
test_big_query_new_types (apache_beam.io.gcp.big_query_query_to_table_it_test.BigQueryQueryToTableIT)
... ok
test_big_query_standard_sql (apache_beam.io.gcp.big_query_query_to_table_it_test.BigQueryQueryToTableIT)
... ok
test_big_query_standard_sql_kms_key_native (apache_beam.io.gcp.big_query_query_to_table_it_test.BigQueryQueryToTableIT)
... SKIP: This test doesn't work on DirectRunner.
test_wordcount_it (apache_beam.examples.wordcount_it_test.WordCountIT) ... ok

======================================================================
ERROR: test_bigquery_read_1M_python (apache_beam.io.gcp.bigquery_io_read_it_test.BigqueryIOReadIT)
----------------------------------------------------------------------
Traceback (most recent call last):
  File "<https://builds.apache.org/job/beam_PostCommit_Python35/ws/src/sdks/python/apache_beam/io/gcp/bigquery_io_read_it_test.py",>
line 58, in test_bigquery_read_1M_python
    self.run_bigquery_io_read_pipeline('1M')
  File "<https://builds.apache.org/job/beam_PostCommit_Python35/ws/src/sdks/python/apache_beam/io/gcp/bigquery_io_read_it_test.py",>
line 54, in run_bigquery_io_read_pipeline
    **extra_opts))
  File "<https://builds.apache.org/job/beam_PostCommit_Python35/ws/src/sdks/python/apache_beam/io/gcp/bigquery_io_read_pipeline.py",>
line 74, in run
    p.run()
  File "<https://builds.apache.org/job/beam_PostCommit_Python35/ws/src/sdks/python/apache_beam/testing/test_pipeline.py",>
line 107, in run
    else test_runner_api))
  File "<https://builds.apache.org/job/beam_PostCommit_Python35/ws/src/sdks/python/apache_beam/pipeline.py",>
line 406, in run
    self._options).run(False)
  File "<https://builds.apache.org/job/beam_PostCommit_Python35/ws/src/sdks/python/apache_beam/pipeline.py",>
line 419, in run
    return self.runner.run_pipeline(self, self._options)
  File "<https://builds.apache.org/job/beam_PostCommit_Python35/ws/src/sdks/python/apache_beam/runners/direct/test_direct_runner.py",>
line 43, in run_pipeline
    self.result = super(TestDirectRunner, self).run_pipeline(pipeline, options)
  File "<https://builds.apache.org/job/beam_PostCommit_Python35/ws/src/sdks/python/apache_beam/runners/direct/direct_runner.py",>
line 129, in run_pipeline
    return runner.run_pipeline(pipeline, options)
  File "<https://builds.apache.org/job/beam_PostCommit_Python35/ws/src/sdks/python/apache_beam/runners/direct/direct_runner.py",>
line 355, in run_pipeline
    pipeline.replace_all(_get_transform_overrides(options))
  File "<https://builds.apache.org/job/beam_PostCommit_Python35/ws/src/sdks/python/apache_beam/pipeline.py",>
line 389, in replace_all
    self._replace(override)
  File "<https://builds.apache.org/job/beam_PostCommit_Python35/ws/src/sdks/python/apache_beam/pipeline.py",>
line 300, in _replace
    self.visit(TransformUpdater(self))
  File "<https://builds.apache.org/job/beam_PostCommit_Python35/ws/src/sdks/python/apache_beam/pipeline.py",>
line 447, in visit
    self._root_transform().visit(visitor, self, visited)
  File "<https://builds.apache.org/job/beam_PostCommit_Python35/ws/src/sdks/python/apache_beam/pipeline.py",>
line 824, in visit
    part.visit(visitor, pipeline, visited)
  File "<https://builds.apache.org/job/beam_PostCommit_Python35/ws/src/sdks/python/apache_beam/pipeline.py",>
line 824, in visit
    part.visit(visitor, pipeline, visited)
  File "<https://builds.apache.org/job/beam_PostCommit_Python35/ws/src/sdks/python/apache_beam/pipeline.py",>
line 824, in visit
    part.visit(visitor, pipeline, visited)
  File "<https://builds.apache.org/job/beam_PostCommit_Python35/ws/src/sdks/python/apache_beam/pipeline.py",>
line 822, in visit
    visitor.enter_composite_transform(self)
  File "<https://builds.apache.org/job/beam_PostCommit_Python35/ws/src/sdks/python/apache_beam/pipeline.py",>
line 295, in enter_composite_transform
    self._replace_if_needed(transform_node)
  File "<https://builds.apache.org/job/beam_PostCommit_Python35/ws/src/sdks/python/apache_beam/pipeline.py",>
line 264, in _replace_if_needed
    new_output = replacement_transform.expand(input_node)
  File "<https://builds.apache.org/job/beam_PostCommit_Python35/ws/src/sdks/python/apache_beam/runners/direct/helper_transforms.py",>
line 51, in expand
    | beam.ParDo(FinishCombine(self._combine_fn)))
  File "<https://builds.apache.org/job/beam_PostCommit_Python35/ws/src/sdks/python/apache_beam/pvalue.py",>
line 111, in __or__
    return self.pipeline.apply(ptransform, self)
  File "<https://builds.apache.org/job/beam_PostCommit_Python35/ws/src/sdks/python/apache_beam/pipeline.py",>
line 514, in apply
    transform.type_check_inputs(pvalueish)
  File "<https://builds.apache.org/job/beam_PostCommit_Python35/ws/src/sdks/python/apache_beam/transforms/ptransform.py",>
line 758, in type_check_inputs
    type_hints = self.get_type_hints().input_types
  File "<https://builds.apache.org/job/beam_PostCommit_Python35/ws/src/sdks/python/apache_beam/typehints/decorators.py",>
line 213, in get_type_hints
    .with_defaults(self.default_type_hints())
  File "<https://builds.apache.org/job/beam_PostCommit_Python35/ws/src/sdks/python/apache_beam/transforms/core.py",>
line 1068, in default_type_hints
    return self.fn.get_type_hints()
  File "<https://builds.apache.org/job/beam_PostCommit_Python35/ws/src/sdks/python/apache_beam/typehints/decorators.py",>
line 213, in get_type_hints
    .with_defaults(self.default_type_hints())
  File "<https://builds.apache.org/job/beam_PostCommit_Python35/ws/src/sdks/python/apache_beam/runners/direct/helper_transforms.py",>
line 81, in default_type_hints
    args = (typing.Tuple[K, args[0]],) + args[1:]
  File "/usr/lib/python3.5/typing.py", line 710, in __getitem__
    parameters = tuple(_type_check(p, msg) for p in parameters)
  File "/usr/lib/python3.5/typing.py", line 710, in <genexpr>
    parameters = tuple(_type_check(p, msg) for p in parameters)
  File "/usr/lib/python3.5/typing.py", line 312, in _type_check
    raise TypeError(msg + " Got %.100r." % (arg,))
TypeError: Tuple[t0, t1, ...]: each t must be a type. Got Any.

----------------------------------------------------------------------
XML: nosetests-postCommitIT-direct-py35.xml
----------------------------------------------------------------------
XML: <https://builds.apache.org/job/beam_PostCommit_Python35/ws/src/sdks/python/nosetests.xml>
----------------------------------------------------------------------
Ran 15 tests in 25.005s

FAILED (SKIP=1, errors=1)

> Task :sdks:python:test-suites:direct:py35:postCommitIT FAILED

> Task :sdks:python:test-suites:dataflow:py35:postCommitIT
>>> RUNNING integration tests with pipeline options: --runner=TestDataflowRunner
--project=apache-beam-testing --staging_location=gs://temp-storage-for-end-to-end-tests/staging-it
--temp_location=gs://temp-storage-for-end-to-end-tests/temp-it --output=gs://temp-storage-for-end-to-end-tests/py-it-cloud/output
--sdk_location=<https://builds.apache.org/job/beam_PostCommit_Python35/ws/src/sdks/python/test-suites/dataflow/py35/build/apache-beam.tar.gz>
--requirements_file=postcommit_requirements.txt --num_workers=1 --sleep_secs=20 --dataflow_worker_jar=<https://builds.apache.org/job/beam_PostCommit_Python35/ws/src/runners/google-cloud-dataflow-java/worker/build/libs/beam-runners-google-cloud-dataflow-java-fn-api-worker-2.15.0-SNAPSHOT.jar>
--kms_key_name=projects/apache-beam-testing/locations/global/keyRings/beam-it/cryptoKeys/test
--dataflow_kms_key=projects/apache-beam-testing/locations/global/keyRings/beam-it/cryptoKeys/test
>>>   test options: --nocapture --processes=8 --process-timeout=4500 --attr=IT
running nosetests
running egg_info
writing requirements to apache_beam.egg-info/requires.txt
writing dependency_links to apache_beam.egg-info/dependency_links.txt
writing top-level names to apache_beam.egg-info/top_level.txt
writing entry points to apache_beam.egg-info/entry_points.txt
writing apache_beam.egg-info/PKG-INFO
reading manifest file 'apache_beam.egg-info/SOURCES.txt'
reading manifest template 'MANIFEST.in'
setup.py:178: UserWarning: Some syntactic constructs of Python 3 are not yet fully supported
by Apache Beam.
  'Some syntactic constructs of Python 3 are not yet fully supported by '
<https://builds.apache.org/job/beam_PostCommit_Python35/ws/src/build/gradleenv/-1734967054/lib/python3.5/site-packages/setuptools/dist.py>:472:
UserWarning: Normalizing '2.15.0.dev' to '2.15.0.dev0'
  normalized_version,
warning: no files found matching 'README.md'
warning: no files found matching 'NOTICE'
warning: no files found matching 'LICENSE'
writing manifest file 'apache_beam.egg-info/SOURCES.txt'
<https://builds.apache.org/job/beam_PostCommit_Python35/ws/src/sdks/python/apache_beam/__init__.py>:84:
UserWarning: Some syntactic constructs of Python 3 are not yet fully supported by Apache Beam.
  'Some syntactic constructs of Python 3 are not yet fully supported by '
<https://builds.apache.org/job/beam_PostCommit_Python35/ws/src/sdks/python/apache_beam/io/gcp/datastore/v1/datastoreio.py>:59:
UserWarning: Datastore IO will support Python 3 after replacing googledatastore by google-cloud-datastore,
see: BEAM-4543.
  warnings.warn('Datastore IO will support Python 3 after replacing '
<https://builds.apache.org/job/beam_PostCommit_Python35/ws/src/sdks/python/apache_beam/io/vcfio.py>:47:
UserWarning: VCF IO will support Python 3 after migration to Nucleus, see: BEAM-5628.
  warnings.warn("VCF IO will support Python 3 after migration to Nucleus, "
Found: https://console.cloud.google.com/dataflow/jobsDetail/locations/us-central1/jobs/2019-07-22_05_40_53-14356573016545677880?project=apache-beam-testing.
<https://builds.apache.org/job/beam_PostCommit_Python35/ws/src/sdks/python/apache_beam/io/gcp/bigquery.py>:1140:
BeamDeprecationWarning: options is deprecated since First stable release. References to <pipeline>.options
will not be supported
Found: https://console.cloud.google.com/dataflow/jobsDetail/locations/us-central1/jobs/2019-07-22_05_56_40-1970038005282180218?project=apache-beam-testing.
Found: https://console.cloud.google.com/dataflow/jobsDetail/locations/us-central1/jobs/2019-07-22_06_05_33-16787741187769819225?project=apache-beam-testing.
  method_to_use = self._compute_method(p, p.options)
Found: https://console.cloud.google.com/dataflow/jobsDetail/locations/us-central1/jobs/2019-07-22_06_13_55-5896325189258332064?project=apache-beam-testing.
Found: https://console.cloud.google.com/dataflow/jobsDetail/locations/us-central1/jobs/2019-07-22_05_40_50-13936122506369534021?project=apache-beam-testing.
<https://builds.apache.org/job/beam_PostCommit_Python35/ws/src/sdks/python/apache_beam/runners/dataflow/dataflow_runner.py>:686:
BeamDeprecationWarning: BigQuerySink is deprecated since 2.11.0. Use WriteToBigQuery instead.
Found: https://console.cloud.google.com/dataflow/jobsDetail/locations/us-central1/jobs/2019-07-22_06_03_56-402623988745886199?project=apache-beam-testing.
  kms_key=transform.kms_key))
Found: https://console.cloud.google.com/dataflow/jobsDetail/locations/us-central1/jobs/2019-07-22_06_12_10-2217008073538856839?project=apache-beam-testing.
Found: https://console.cloud.google.com/dataflow/jobsDetail/locations/us-central1/jobs/2019-07-22_05_40_50-18280079728626819519?project=apache-beam-testing.
<https://builds.apache.org/job/beam_PostCommit_Python35/ws/src/sdks/python/apache_beam/io/gcp/bigquery.py>:1140:
BeamDeprecationWarning: options is deprecated since First stable release. References to <pipeline>.options
will not be supported
  method_to_use = self._compute_method(p, p.options)
Found: https://console.cloud.google.com/dataflow/jobsDetail/locations/us-central1/jobs/2019-07-22_05_55_28-3023003156118621220?project=apache-beam-testing.
<https://builds.apache.org/job/beam_PostCommit_Python35/ws/src/sdks/python/apache_beam/io/fileio_test.py>:232:
FutureWarning: MatchAll is experimental.
Found: https://console.cloud.google.com/dataflow/jobsDetail/locations/us-central1/jobs/2019-07-22_06_04_52-3047649454562471702?project=apache-beam-testing.
Found: https://console.cloud.google.com/dataflow/jobsDetail/locations/us-central1/jobs/2019-07-22_06_13_54-13822705512712168107?project=apache-beam-testing.
  | 'GetPath' >> beam.Map(lambda metadata: metadata.path))
Found: https://console.cloud.google.com/dataflow/jobsDetail/locations/us-central1/jobs/2019-07-22_06_22_50-13254954385933542407?project=apache-beam-testing.
<https://builds.apache.org/job/beam_PostCommit_Python35/ws/src/sdks/python/apache_beam/io/fileio_test.py>:243:
FutureWarning: MatchAll is experimental.
  | 'Checksums' >> beam.Map(compute_hash))
<https://builds.apache.org/job/beam_PostCommit_Python35/ws/src/sdks/python/apache_beam/io/fileio_test.py>:243:
FutureWarning: ReadMatches is experimental.
  | 'Checksums' >> beam.Map(compute_hash))
Found: https://console.cloud.google.com/dataflow/jobsDetail/locations/us-central1/jobs/2019-07-22_05_40_49-11316180780873223949?project=apache-beam-testing.
Found: https://console.cloud.google.com/dataflow/jobsDetail/locations/us-central1/jobs/2019-07-22_06_02_48-10238799840782961645?project=apache-beam-testing.
<https://builds.apache.org/job/beam_PostCommit_Python35/ws/src/sdks/python/apache_beam/runners/dataflow/dataflow_runner.py>:686:
BeamDeprecationWarning: BigQuerySink is deprecated since 2.11.0. Use WriteToBigQuery instead.
  kms_key=transform.kms_key))
Found: https://console.cloud.google.com/dataflow/jobsDetail/locations/us-central1/jobs/2019-07-22_06_11_21-6274329252909264989?project=apache-beam-testing.
Found: https://console.cloud.google.com/dataflow/jobsDetail/locations/us-central1/jobs/2019-07-22_06_20_06-14630449538733736046?project=apache-beam-testing.
Found: https://console.cloud.google.com/dataflow/jobsDetail/locations/us-central1/jobs/2019-07-22_05_40_49-3772941030214021709?project=apache-beam-testing.
Found: https://console.cloud.google.com/dataflow/jobsDetail/locations/us-central1/jobs/2019-07-22_05_51_03-3716463997418605675?project=apache-beam-testing.
Found: https://console.cloud.google.com/dataflow/jobsDetail/locations/us-central1/jobs/2019-07-22_06_01_36-1162633264599059692?project=apache-beam-testing.
<https://builds.apache.org/job/beam_PostCommit_Python35/ws/src/sdks/python/apache_beam/io/gcp/bigquery.py>:1140:
BeamDeprecationWarning: options is deprecated since First stable release. References to <pipeline>.options
will not be supported
Found: https://console.cloud.google.com/dataflow/jobsDetail/locations/us-central1/jobs/2019-07-22_06_10_21-625512022221787183?project=apache-beam-testing.
  method_to_use = self._compute_method(p, p.options)
<https://builds.apache.org/job/beam_PostCommit_Python35/ws/src/sdks/python/apache_beam/io/gcp/bigquery_file_loads.py>:557:
BeamDeprecationWarning: options is deprecated since First stable release. References to <pipeline>.options
will not be supported
  temp_location = p.options.view_as(GoogleCloudOptions).temp_location
Found: https://console.cloud.google.com/dataflow/jobsDetail/locations/us-central1/jobs/2019-07-22_05_40_48-5648274892521113978?project=apache-beam-testing.
<https://builds.apache.org/job/beam_PostCommit_Python35/ws/src/sdks/python/apache_beam/runners/dataflow/dataflow_runner.py>:686:
BeamDeprecationWarning: BigQuerySink is deprecated since 2.11.0. Use WriteToBigQuery instead.
Found: https://console.cloud.google.com/dataflow/jobsDetail/locations/us-central1/jobs/2019-07-22_05_50_30-3967782822930378377?project=apache-beam-testing.
  kms_key=transform.kms_key))
Found: https://console.cloud.google.com/dataflow/jobsDetail/locations/us-central1/jobs/2019-07-22_05_59_17-6252390388051784417?project=apache-beam-testing.
Found: https://console.cloud.google.com/dataflow/jobsDetail/locations/us-central1/jobs/2019-07-22_06_08_35-16316026743675958294?project=apache-beam-testing.
Found: https://console.cloud.google.com/dataflow/jobsDetail/locations/us-central1/jobs/2019-07-22_06_17_43-184186249712861081?project=apache-beam-testing.
Found: https://console.cloud.google.com/dataflow/jobsDetail/locations/us-central1/jobs/2019-07-22_06_26_51-6136408116085095582?project=apache-beam-testing.
Found: https://console.cloud.google.com/dataflow/jobsDetail/locations/us-central1/jobs/2019-07-22_05_40_50-16641437698586206138?project=apache-beam-testing.
Found: https://console.cloud.google.com/dataflow/jobsDetail/locations/us-central1/jobs/2019-07-22_05_50_22-9074717298040949244?project=apache-beam-testing.
<https://builds.apache.org/job/beam_PostCommit_Python35/ws/src/sdks/python/apache_beam/io/gcp/bigquery_test.py>:565:
BeamDeprecationWarning: options is deprecated since First stable release. References to <pipeline>.options
will not be supported
Found: https://console.cloud.google.com/dataflow/jobsDetail/locations/us-central1/jobs/2019-07-22_05_59_10-7176823077190910995?project=apache-beam-testing.
Found: https://console.cloud.google.com/dataflow/jobsDetail/locations/us-central1/jobs/2019-07-22_06_08_15-14539372919600641598?project=apache-beam-testing.
  streaming = self.test_pipeline.options.view_as(StandardOptions).streaming
Found: https://console.cloud.google.com/dataflow/jobsDetail/locations/us-central1/jobs/2019-07-22_05_40_51-3819513958485435704?project=apache-beam-testing.
<https://builds.apache.org/job/beam_PostCommit_Python35/ws/src/sdks/python/apache_beam/io/gcp/bigquery.py>:1140:
BeamDeprecationWarning: options is deprecated since First stable release. References to <pipeline>.options
will not be supported
  method_to_use = self._compute_method(p, p.options)
Found: https://console.cloud.google.com/dataflow/jobsDetail/locations/us-central1/jobs/2019-07-22_05_50_39-3299873465636533545?project=apache-beam-testing.
Found: https://console.cloud.google.com/dataflow/jobsDetail/locations/us-central1/jobs/2019-07-22_05_58_42-14318974227505422524?project=apache-beam-testing.
<https://builds.apache.org/job/beam_PostCommit_Python35/ws/src/sdks/python/apache_beam/io/gcp/bigquery_file_loads.py>:557:
BeamDeprecationWarning: options is deprecated since First stable release. References to <pipeline>.options
will not be supported
Found: https://console.cloud.google.com/dataflow/jobsDetail/locations/us-central1/jobs/2019-07-22_06_08_10-14080401151289351775?project=apache-beam-testing.
  temp_location = p.options.view_as(GoogleCloudOptions).temp_location
Found: https://console.cloud.google.com/dataflow/jobsDetail/locations/us-central1/jobs/2019-07-22_06_16_27-17274145436973687822?project=apache-beam-testing.
<https://builds.apache.org/job/beam_PostCommit_Python35/ws/src/sdks/python/apache_beam/runners/dataflow/dataflow_runner.py>:686:
BeamDeprecationWarning: BigQuerySink is deprecated since 2.11.0. Use WriteToBigQuery instead.
  kms_key=transform.kms_key))
<https://builds.apache.org/job/beam_PostCommit_Python35/ws/src/sdks/python/apache_beam/io/gcp/big_query_query_to_table_pipeline.py>:73:
BeamDeprecationWarning: BigQuerySink is deprecated since 2.11.0. Use WriteToBigQuery instead.
  kms_key=kms_key))
test_datastore_wordcount_it (apache_beam.examples.cookbook.datastore_wordcount_it_test.DatastoreWordCountIT)
... SKIP: This test still needs to be fixed on Python 3TODO: BEAM-4543
test_avro_it (apache_beam.examples.fastavro_it_test.FastavroIT) ... SKIP: Due to a known issue
in avro-python3 package, thistest is skipped until BEAM-6522 is addressed. 
test_streaming_wordcount_it (apache_beam.examples.streaming_wordcount_it_test.StreamingWordCountIT)
... ok
test_bigquery_tornadoes_it (apache_beam.examples.cookbook.bigquery_tornadoes_it_test.BigqueryTornadoesIT)
... ok
test_wordcount_fnapi_it (apache_beam.examples.wordcount_it_test.WordCountIT) ... ok
test_autocomplete_it (apache_beam.examples.complete.autocomplete_test.AutocompleteTest) ...
ok
test_leader_board_it (apache_beam.examples.complete.game.leader_board_it_test.LeaderBoardIT)
... ok
test_game_stats_it (apache_beam.examples.complete.game.game_stats_it_test.GameStatsIT) ...
ok
test_wordcount_it (apache_beam.examples.wordcount_it_test.WordCountIT) ... ok
test_user_score_it (apache_beam.examples.complete.game.user_score_it_test.UserScoreIT) ...
ok
test_hourly_team_score_it (apache_beam.examples.complete.game.hourly_team_score_it_test.HourlyTeamScoreIT)
... ok
test_datastore_write_limit (apache_beam.io.gcp.datastore_write_it_test.DatastoreWriteIT) ...
SKIP: This test still needs to be fixed on Python 3TODO: BEAM-4543
test_copy (apache_beam.io.gcp.gcsio_integration_test.GcsIOIntegrationTest) ... ok
test_copy_batch (apache_beam.io.gcp.gcsio_integration_test.GcsIOIntegrationTest) ... ok
test_copy_batch_kms (apache_beam.io.gcp.gcsio_integration_test.GcsIOIntegrationTest) ... ok
test_copy_batch_rewrite_token (apache_beam.io.gcp.gcsio_integration_test.GcsIOIntegrationTest)
... ok
test_copy_kms (apache_beam.io.gcp.gcsio_integration_test.GcsIOIntegrationTest) ... ok
test_copy_rewrite_token (apache_beam.io.gcp.gcsio_integration_test.GcsIOIntegrationTest) ...
ok
test_bigquery_read_1M_python (apache_beam.io.gcp.bigquery_io_read_it_test.BigqueryIOReadIT)
... ok
test_multiple_destinations_transform (apache_beam.io.gcp.bigquery_file_loads_test.BigQueryFileLoadsIT)
... ok
test_one_job_fails_all_jobs_fail (apache_beam.io.gcp.bigquery_file_loads_test.BigQueryFileLoadsIT)
... ok
test_transform_on_gcs (apache_beam.io.fileio_test.MatchIntegrationTest) ... ok
test_big_query_read (apache_beam.io.gcp.bigquery_read_it_test.BigQueryReadIntegrationTests)
... ok
test_big_query_read_new_types (apache_beam.io.gcp.bigquery_read_it_test.BigQueryReadIntegrationTests)
... ok
test_multiple_destinations_transform (apache_beam.io.gcp.bigquery_test.BigQueryStreamingInsertTransformIntegrationTests)
... ok
test_value_provider_transform (apache_beam.io.gcp.bigquery_test.BigQueryStreamingInsertTransformIntegrationTests)
... ok
test_streaming_data_only (apache_beam.io.gcp.pubsub_integration_test.PubSubIntegrationTest)
... ok
test_streaming_with_attributes (apache_beam.io.gcp.pubsub_integration_test.PubSubIntegrationTest)
... ok
test_parquetio_it (apache_beam.io.parquetio_it_test.TestParquetIT) ... ok
test_job_python_from_python_it (apache_beam.transforms.external_test_it.ExternalTransformIT)
... ok
test_big_query_legacy_sql (apache_beam.io.gcp.big_query_query_to_table_it_test.BigQueryQueryToTableIT)
... ok
test_big_query_new_types (apache_beam.io.gcp.big_query_query_to_table_it_test.BigQueryQueryToTableIT)
... ok
test_big_query_standard_sql (apache_beam.io.gcp.big_query_query_to_table_it_test.BigQueryQueryToTableIT)
... ok
test_big_query_standard_sql_kms_key_native (apache_beam.io.gcp.big_query_query_to_table_it_test.BigQueryQueryToTableIT)
... ok
test_big_query_write (apache_beam.io.gcp.bigquery_write_it_test.BigQueryWriteIntegrationTests)
... ok
test_big_query_write_new_types (apache_beam.io.gcp.bigquery_write_it_test.BigQueryWriteIntegrationTests)
... ok
test_big_query_write_schema_autodetect (apache_beam.io.gcp.bigquery_write_it_test.BigQueryWriteIntegrationTests)
... SKIP: DataflowRunner does not support schema autodetection
test_big_query_write_without_schema (apache_beam.io.gcp.bigquery_write_it_test.BigQueryWriteIntegrationTests)
... ok
test_metrics_fnapi_it (apache_beam.runners.dataflow.dataflow_exercise_metrics_pipeline_test.ExerciseMetricsPipelineTest)
... ok
test_metrics_it (apache_beam.runners.dataflow.dataflow_exercise_metrics_pipeline_test.ExerciseMetricsPipelineTest)
... ok
test_datastore_write_limit (apache_beam.io.gcp.datastore.v1new.datastore_write_it_test.DatastoreWriteIT)
... ok

----------------------------------------------------------------------
XML: nosetests-postCommitIT-df-py35.xml
----------------------------------------------------------------------
XML: <https://builds.apache.org/job/beam_PostCommit_Python35/ws/src/sdks/python/nosetests.xml>
----------------------------------------------------------------------
Ran 41 tests in 3411.011s

OK (SKIP=4)

FAILURE: Build failed with an exception.

* Where:
Build file '<https://builds.apache.org/job/beam_PostCommit_Python35/ws/src/sdks/python/test-suites/direct/py35/build.gradle'>
line: 49

* What went wrong:
Execution failed for task ':sdks:python:test-suites:direct:py35:postCommitIT'.
> Process 'command 'sh'' finished with non-zero exit value 1

* Try:
Run with --stacktrace option to get the stack trace. Run with --info or --debug option to
get more log output. Run with --scan to get full insights.

* Get more help at https://help.gradle.org

Deprecated Gradle features were used in this build, making it incompatible with Gradle 6.0.
Use '--warning-mode all' to show the individual deprecation warnings.
See https://docs.gradle.org/5.2.1/userguide/command_line_interface.html#sec:command_line_warnings

BUILD FAILED in 57m 50s
63 actionable tasks: 46 executed, 17 from cache

Publishing build scan...
https://gradle.com/s/y32a3cvt3cbgc

Build step 'Invoke Gradle script' changed build result to FAILURE
Build step 'Invoke Gradle script' marked build as failure

---------------------------------------------------------------------
To unsubscribe, e-mail: builds-unsubscribe@beam.apache.org
For additional commands, e-mail: builds-help@beam.apache.org


Mime
View raw message