beam-builds mailing list archives

Site index · List index
Message view « Date » · « Thread »
Top « Date » · « Thread »
From Apache Jenkins Server <jenk...@builds.apache.org>
Subject Build failed in Jenkins: beam_PostCommit_Java_ValidatesRunner_Dataflow #3012
Date Tue, 09 Jul 2019 02:58:51 GMT
See <https://builds.apache.org/job/beam_PostCommit_Java_ValidatesRunner_Dataflow/3012/display/redirect?page=changes>

Changes:

[boyuanz] Fix RestrictionTracker docstring

------------------------------------------
Started by GitHub push by boyuanzz
[EnvInject] - Loading node environment variables.
Building remotely on apache-beam-jenkins-11 (beam) in workspace <https://builds.apache.org/job/beam_PostCommit_Java_ValidatesRunner_Dataflow/ws/>
No credentials specified
 > git rev-parse --is-inside-work-tree # timeout=10
Fetching changes from the remote Git repository
 > git config remote.origin.url https://github.com/apache/beam.git # timeout=10
Fetching upstream changes from https://github.com/apache/beam.git
 > git --version # timeout=10
 > git fetch --tags --progress https://github.com/apache/beam.git +refs/heads/*:refs/remotes/origin/*
+refs/pull/${ghprbPullId}/*:refs/remotes/origin/pr/${ghprbPullId}/*
 > git rev-parse origin/master^{commit} # timeout=10
Checking out Revision 69bb363334fdfe7f812bbb2a0bc210419be0409d (origin/master)
 > git config core.sparsecheckout # timeout=10
 > git checkout -f 69bb363334fdfe7f812bbb2a0bc210419be0409d
Commit message: "Merge pull request #8999 from boyuanzz/doc_fix"
 > git rev-list --no-walk 82cfdb805e4a530443f450f7262ff344d5cc7ede # timeout=10
Cleaning workspace
 > git rev-parse --verify HEAD # timeout=10
Resetting working tree
 > git reset --hard # timeout=10
 > git clean -fdx # timeout=10
No emails were triggered.
[EnvInject] - Executing scripts and injecting environment variables after the SCM step.
[EnvInject] - Injecting as environment variables the properties content 
SPARK_LOCAL_IP=127.0.0.1

[EnvInject] - Variables injected successfully.
[Gradle] - Launching build.
[src] $ <https://builds.apache.org/job/beam_PostCommit_Java_ValidatesRunner_Dataflow/ws/src/gradlew>
--continue --max-workers=120 -Dorg.gradle.jvmargs=-Xms2g -Dorg.gradle.jvmargs=-Xmx4g :runners:google-cloud-dataflow-java:validatesRunner
Starting a Gradle Daemon, 1 busy Daemon could not be reused, use --status for details
> Task :buildSrc:compileJava NO-SOURCE
> Task :buildSrc:compileGroovy FROM-CACHE
> Task :buildSrc:pluginDescriptors
> Task :buildSrc:processResources
> Task :buildSrc:classes
> Task :buildSrc:jar
> Task :buildSrc:assemble
> Task :buildSrc:spotlessGroovy
> Task :buildSrc:spotlessGroovyCheck
> Task :buildSrc:spotlessGroovyGradle
> Task :buildSrc:spotlessGroovyGradleCheck
> Task :buildSrc:spotlessCheck
> Task :buildSrc:pluginUnderTestMetadata
> Task :buildSrc:compileTestJava NO-SOURCE
> Task :buildSrc:compileTestGroovy NO-SOURCE
> Task :buildSrc:processTestResources NO-SOURCE
> Task :buildSrc:testClasses UP-TO-DATE
> Task :buildSrc:test NO-SOURCE
> Task :buildSrc:validateTaskProperties FROM-CACHE
> Task :buildSrc:check
> Task :buildSrc:build
Configuration on demand is an incubating feature.
> Task :sdks:java:core:generateAvroProtocol NO-SOURCE
> Task :runners:core-java:processResources NO-SOURCE
> Task :runners:java-fn-execution:processResources NO-SOURCE
> Task :runners:core-construction-java:processResources NO-SOURCE
> Task :runners:google-cloud-dataflow-java:worker:legacy-worker:processResources NO-SOURCE
> Task :sdks:java:io:google-cloud-platform:processResources NO-SOURCE
> Task :sdks:java:extensions:google-cloud-platform-core:processResources NO-SOURCE
> Task :sdks:java:fn-execution:processResources NO-SOURCE
> Task :sdks:java:harness:processResources NO-SOURCE
> Task :vendor:sdks-java-extensions-protobuf:processResources NO-SOURCE
> Task :sdks:java:core:generateAvroJava NO-SOURCE
> Task :model:fn-execution:extractProto
> Task :model:job-management:extractProto
> Task :sdks:java:extensions:protobuf:extractProto
> Task :sdks:java:extensions:protobuf:processResources NO-SOURCE
> Task :model:job-management:processResources
> Task :sdks:java:core:generateGrammarSource FROM-CACHE
> Task :runners:google-cloud-dataflow-java:processResources
> Task :model:fn-execution:processResources
> Task :sdks:java:core:processResources
> Task :sdks:java:core:generateTestAvroProtocol NO-SOURCE
> Task :model:pipeline:extractIncludeProto
> Task :model:pipeline:extractProto
> Task :runners:google-cloud-dataflow-java:worker:windmill:extractIncludeProto
> Task :runners:google-cloud-dataflow-java:worker:windmill:extractProto
> Task :runners:google-cloud-dataflow-java:worker:windmill:generateProto
> Task :sdks:java:core:generateTestAvroJava
> Task :sdks:java:core:generateTestGrammarSource NO-SOURCE
> Task :sdks:java:core:processTestResources
> Task :runners:google-cloud-dataflow-java:worker:windmill:compileJava FROM-CACHE
> Task :runners:google-cloud-dataflow-java:worker:windmill:processResources
> Task :runners:google-cloud-dataflow-java:worker:windmill:classes
> Task :model:pipeline:generateProto
> Task :model:pipeline:compileJava FROM-CACHE
> Task :model:pipeline:processResources
> Task :model:pipeline:classes
> Task :model:pipeline:jar
> Task :model:job-management:extractIncludeProto
> Task :model:fn-execution:extractIncludeProto
> Task :model:job-management:generateProto
> Task :model:fn-execution:generateProto
> Task :model:fn-execution:compileJava FROM-CACHE
> Task :model:fn-execution:classes
> Task :model:job-management:compileJava FROM-CACHE
> Task :model:job-management:classes
> Task :runners:google-cloud-dataflow-java:worker:windmill:shadowJar
> Task :model:pipeline:shadowJar
> Task :model:job-management:shadowJar
> Task :model:fn-execution:shadowJar
> Task :sdks:java:core:compileJava FROM-CACHE
> Task :sdks:java:core:classes
> Task :sdks:java:core:shadowJar
> Task :sdks:java:extensions:protobuf:extractIncludeProto
> Task :sdks:java:extensions:protobuf:generateProto NO-SOURCE
> Task :vendor:sdks-java-extensions-protobuf:compileJava FROM-CACHE
> Task :vendor:sdks-java-extensions-protobuf:classes UP-TO-DATE
> Task :runners:core-construction-java:compileJava FROM-CACHE
> Task :runners:core-construction-java:classes UP-TO-DATE
> Task :sdks:java:fn-execution:compileJava FROM-CACHE
> Task :sdks:java:fn-execution:classes UP-TO-DATE
> Task :sdks:java:fn-execution:jar
> Task :runners:core-construction-java:jar
> Task :runners:core-java:compileJava FROM-CACHE
> Task :runners:core-java:classes UP-TO-DATE
> Task :runners:core-java:jar
> Task :sdks:java:extensions:protobuf:compileJava FROM-CACHE
> Task :sdks:java:extensions:protobuf:classes UP-TO-DATE
> Task :sdks:java:extensions:protobuf:jar
> Task :sdks:java:extensions:google-cloud-platform-core:compileJava FROM-CACHE
> Task :sdks:java:extensions:google-cloud-platform-core:classes UP-TO-DATE
> Task :sdks:java:extensions:google-cloud-platform-core:jar
> Task :sdks:java:core:compileTestJava FROM-CACHE
> Task :sdks:java:core:testClasses
> Task :sdks:java:harness:compileJava FROM-CACHE
> Task :sdks:java:harness:classes UP-TO-DATE
> Task :sdks:java:harness:jar
> Task :sdks:java:io:google-cloud-platform:compileJava FROM-CACHE
> Task :sdks:java:io:google-cloud-platform:classes UP-TO-DATE
> Task :sdks:java:io:google-cloud-platform:jar
> Task :runners:google-cloud-dataflow-java:compileJava FROM-CACHE
> Task :runners:google-cloud-dataflow-java:classes
> Task :runners:google-cloud-dataflow-java:jar
> Task :vendor:sdks-java-extensions-protobuf:shadowJar
> Task :sdks:java:core:shadowTestJar
> Task :sdks:java:harness:shadowJar
> Task :runners:java-fn-execution:compileJava FROM-CACHE
> Task :runners:java-fn-execution:classes UP-TO-DATE
> Task :runners:java-fn-execution:jar
> Task :runners:google-cloud-dataflow-java:worker:legacy-worker:compileJava FROM-CACHE
> Task :runners:google-cloud-dataflow-java:worker:legacy-worker:classes UP-TO-DATE
> Task :runners:google-cloud-dataflow-java:worker:legacy-worker:shadowJar
> Task :runners:google-cloud-dataflow-java:validatesRunnerLegacyWorkerTest

org.apache.beam.sdk.transforms.FlattenTest > testFlattenPCollectionsSingletonList FAILED
    java.lang.RuntimeException at FlattenTest.java:104

221 tests completed, 1 failed, 2 skipped

> Task :runners:google-cloud-dataflow-java:validatesRunnerLegacyWorkerTest FAILED

FAILURE: Build failed with an exception.

* What went wrong:
Execution failed for task ':runners:google-cloud-dataflow-java:validatesRunnerLegacyWorkerTest'.
> There were failing tests. See the report at: file://<https://builds.apache.org/job/beam_PostCommit_Java_ValidatesRunner_Dataflow/ws/src/runners/google-cloud-dataflow-java/build/reports/tests/validatesRunnerLegacyWorkerTest/index.html>

* Try:
Run with --stacktrace option to get the stack trace. Run with --info or --debug option to
get more log output. Run with --scan to get full insights.

* Get more help at https://help.gradle.org

Deprecated Gradle features were used in this build, making it incompatible with Gradle 6.0.
Use '--warning-mode all' to show the individual deprecation warnings.
See https://docs.gradle.org/5.2.1/userguide/command_line_interface.html#sec:command_line_warnings

BUILD FAILED in 3h 16m 37s
60 actionable tasks: 42 executed, 18 from cache

Publishing build scan...
https://gradle.com/s/ojz2jxq5czi4c

Build step 'Invoke Gradle script' changed build result to FAILURE
Build step 'Invoke Gradle script' marked build as failure

---------------------------------------------------------------------
To unsubscribe, e-mail: builds-unsubscribe@beam.apache.org
For additional commands, e-mail: builds-help@beam.apache.org


Mime
View raw message