beam-builds mailing list archives

Site index · List index
Message view « Date » · « Thread »
Top « Date » · « Thread »
From Apache Jenkins Server <jenk...@builds.apache.org>
Subject Build failed in Jenkins: beam_PostCommit_Py_ValCont #3701
Date Tue, 02 Jul 2019 12:31:38 GMT
See <https://builds.apache.org/job/beam_PostCommit_Py_ValCont/3701/display/redirect>

------------------------------------------
[...truncated 208.12 KB...]
copying apache_beam/utils/retry_test.py -> apache-beam-2.15.0.dev0/apache_beam/utils
copying apache_beam/utils/timestamp.py -> apache-beam-2.15.0.dev0/apache_beam/utils
copying apache_beam/utils/timestamp_test.py -> apache-beam-2.15.0.dev0/apache_beam/utils
copying apache_beam/utils/urns.py -> apache-beam-2.15.0.dev0/apache_beam/utils
copying apache_beam/utils/windowed_value.pxd -> apache-beam-2.15.0.dev0/apache_beam/utils
copying apache_beam/utils/windowed_value.py -> apache-beam-2.15.0.dev0/apache_beam/utils
copying apache_beam/utils/windowed_value_test.py -> apache-beam-2.15.0.dev0/apache_beam/utils
Writing apache-beam-2.15.0.dev0/setup.cfg
creating dist
Creating tar archive
removing 'apache-beam-2.15.0.dev0' (and everything under it)
SDK_LOCATION=$(find dist/apache-beam-*.tar.gz)
find dist/apache-beam-*.tar.gz

# Run ValidatesRunner tests on Google Cloud Dataflow service
echo ">>> RUNNING DATAFLOW RUNNER VALIDATESCONTAINER TEST"
>>> RUNNING DATAFLOW RUNNER VALIDATESCONTAINER TEST
python setup.py nosetests \
  --attr ValidatesContainer \
  --nologcapture \
  --processes=1 \
  --process-timeout=900 \
  --test-pipeline-options=" \
    --runner=TestDataflowRunner \
    --project=$PROJECT \
    --worker_harness_container_image=$CONTAINER:$TAG \
    --staging_location=$GCS_LOCATION/staging-validatesrunner-test \
    --temp_location=$GCS_LOCATION/temp-validatesrunner-test \
    --output=$GCS_LOCATION/output \
    --sdk_location=$SDK_LOCATION \
    --num_workers=1"
<https://builds.apache.org/job/beam_PostCommit_Py_ValCont/ws/src/sdks/python/container/venv/python/local/lib/python2.7/site-packages/setuptools/dist.py>:472:
UserWarning: Normalizing '2.15.0.dev' to '2.15.0.dev0'
  normalized_version,
running nosetests
running egg_info
<https://builds.apache.org/job/beam_PostCommit_Py_ValCont/ws/src/sdks/python/gen_protos.py>:57:
UserWarning: Installing grpcio-tools is recommended for development.
  warnings.warn('Installing grpcio-tools is recommended for development.')
writing requirements to apache_beam.egg-info/requires.txt
writing apache_beam.egg-info/PKG-INFO
writing top-level names to apache_beam.egg-info/top_level.txt
writing dependency_links to apache_beam.egg-info/dependency_links.txt
writing entry points to apache_beam.egg-info/entry_points.txt
reading manifest file 'apache_beam.egg-info/SOURCES.txt'
reading manifest template 'MANIFEST.in'
warning: no files found matching 'README.md'
warning: no files found matching 'NOTICE'
warning: no files found matching 'LICENSE'
writing manifest file 'apache_beam.egg-info/SOURCES.txt'
WARNING:root:Using deprecated Datastore client.
This client will be removed in Beam 3.0 (next Beam major release).
Please migrate to apache_beam.io.gcp.datastore.v1new.datastoreio.
WARNING:root:python-snappy is not installed; some tests will be skipped.
WARNING:root:Tensorflow is not installed, so skipping some tests.
test_wordcount_fnapi_it (apache_beam.examples.wordcount_it_test.WordCountIT) ... ERROR
WARNING:root:Discarding unparseable args: ['--output=gs://temp-storage-for-end-to-end-tests/output']
WARNING:root:Discarding unparseable args: ['--output=gs://temp-storage-for-end-to-end-tests/output']
test_metrics_fnapi_it (apache_beam.runners.dataflow.dataflow_exercise_metrics_pipeline_test.ExerciseMetricsPipelineTest)
... ERROR

======================================================================
ERROR: test_wordcount_fnapi_it (apache_beam.examples.wordcount_it_test.WordCountIT)
----------------------------------------------------------------------
Traceback (most recent call last):
  File "<https://builds.apache.org/job/beam_PostCommit_Py_ValCont/ws/src/sdks/python/apache_beam/examples/wordcount_it_test.py",>
line 52, in test_wordcount_fnapi_it
    self._run_wordcount_it(wordcount.run, experiment='beam_fn_api')
  File "<https://builds.apache.org/job/beam_PostCommit_Py_ValCont/ws/src/sdks/python/apache_beam/examples/wordcount_it_test.py",>
line 84, in _run_wordcount_it
    run_wordcount(test_pipeline.get_full_options_as_args(**extra_opts))
  File "<https://builds.apache.org/job/beam_PostCommit_Py_ValCont/ws/src/sdks/python/apache_beam/examples/wordcount.py",>
line 114, in run
    result = p.run()
  File "<https://builds.apache.org/job/beam_PostCommit_Py_ValCont/ws/src/sdks/python/apache_beam/pipeline.py",>
line 406, in run
    self._options).run(False)
  File "<https://builds.apache.org/job/beam_PostCommit_Py_ValCont/ws/src/sdks/python/apache_beam/pipeline.py",>
line 419, in run
    return self.runner.run_pipeline(self, self._options)
  File "<https://builds.apache.org/job/beam_PostCommit_Py_ValCont/ws/src/sdks/python/apache_beam/runners/dataflow/test_dataflow_runner.py",>
line 64, in run_pipeline
    self.result.wait_until_finish(duration=wait_duration)
  File "<https://builds.apache.org/job/beam_PostCommit_Py_ValCont/ws/src/sdks/python/apache_beam/runners/dataflow/dataflow_runner.py",>
line 1338, in wait_until_finish
    (self.state, getattr(self._runner, 'last_error_msg', None)), self)
DataflowRuntimeException: Dataflow pipeline failed. State: FAILED, Error:
java.util.concurrent.ExecutionException: java.lang.RuntimeException: Error received from SDK
harness for instruction -379: Traceback (most recent call last):
  File "/usr/local/lib/python2.7/site-packages/apache_beam/runners/worker/sdk_worker.py",
line 157, in _execute
    response = task()
  File "/usr/local/lib/python2.7/site-packages/apache_beam/runners/worker/sdk_worker.py",
line 190, in <lambda>
    self._execute(lambda: worker.do_instruction(work), work)
  File "/usr/local/lib/python2.7/site-packages/apache_beam/runners/worker/sdk_worker.py",
line 342, in do_instruction
    request.instruction_id)
  File "/usr/local/lib/python2.7/site-packages/apache_beam/runners/worker/sdk_worker.py",
line 368, in process_bundle
    bundle_processor.process_bundle(instruction_id))
  File "/usr/local/lib/python2.7/site-packages/apache_beam/runners/worker/bundle_processor.py",
line 593, in process_bundle
    data.ptransform_id].process_encoded(data.data)
KeyError: u'\n\x04-321\x12\x04-319'

	at java.util.concurrent.CompletableFuture.reportGet(CompletableFuture.java:357)
	at java.util.concurrent.CompletableFuture.get(CompletableFuture.java:1895)
	at org.apache.beam.sdk.util.MoreFutures.get(MoreFutures.java:57)
	at org.apache.beam.runners.dataflow.worker.fn.control.RegisterAndProcessBundleOperation.finish(RegisterAndProcessBundleOperation.java:285)
	at org.apache.beam.runners.dataflow.worker.util.common.worker.MapTaskExecutor.execute(MapTaskExecutor.java:85)
	at org.apache.beam.runners.dataflow.worker.fn.control.BeamFnMapTaskExecutor.execute(BeamFnMapTaskExecutor.java:125)
	at org.apache.beam.runners.dataflow.worker.BatchDataflowWorker.executeWork(BatchDataflowWorker.java:412)
	at org.apache.beam.runners.dataflow.worker.BatchDataflowWorker.doWork(BatchDataflowWorker.java:381)
	at org.apache.beam.runners.dataflow.worker.BatchDataflowWorker.getAndPerformWork(BatchDataflowWorker.java:306)
	at org.apache.beam.runners.dataflow.worker.DataflowRunnerHarness.start(DataflowRunnerHarness.java:195)
	at org.apache.beam.runners.dataflow.worker.DataflowRunnerHarness.main(DataflowRunnerHarness.java:123)
	Suppressed: java.lang.IllegalStateException: Already closed.
		at org.apache.beam.sdk.fn.data.BeamFnDataBufferingOutboundObserver.close(BeamFnDataBufferingOutboundObserver.java:95)
		at org.apache.beam.runners.dataflow.worker.fn.data.RemoteGrpcPortWriteOperation.abort(RemoteGrpcPortWriteOperation.java:215)
		at org.apache.beam.runners.dataflow.worker.util.common.worker.MapTaskExecutor.execute(MapTaskExecutor.java:91)
		... 6 more
Caused by: java.lang.RuntimeException: Error received from SDK harness for instruction -379:
Traceback (most recent call last):
  File "/usr/local/lib/python2.7/site-packages/apache_beam/runners/worker/sdk_worker.py",
line 157, in _execute
    response = task()
  File "/usr/local/lib/python2.7/site-packages/apache_beam/runners/worker/sdk_worker.py",
line 190, in <lambda>
    self._execute(lambda: worker.do_instruction(work), work)
  File "/usr/local/lib/python2.7/site-packages/apache_beam/runners/worker/sdk_worker.py",
line 342, in do_instruction
    request.instruction_id)
  File "/usr/local/lib/python2.7/site-packages/apache_beam/runners/worker/sdk_worker.py",
line 368, in process_bundle
    bundle_processor.process_bundle(instruction_id))
  File "/usr/local/lib/python2.7/site-packages/apache_beam/runners/worker/bundle_processor.py",
line 593, in process_bundle
    data.ptransform_id].process_encoded(data.data)
KeyError: u'\n\x04-321\x12\x04-319'

	at org.apache.beam.runners.fnexecution.control.FnApiControlClient$ResponseStreamObserver.onNext(FnApiControlClient.java:157)
	at org.apache.beam.runners.fnexecution.control.FnApiControlClient$ResponseStreamObserver.onNext(FnApiControlClient.java:140)
	at org.apache.beam.vendor.grpc.v1p13p1.io.grpc.stub.ServerCalls$StreamingServerCallHandler$StreamingServerCallListener.onMessage(ServerCalls.java:248)
	at org.apache.beam.vendor.grpc.v1p13p1.io.grpc.ForwardingServerCallListener.onMessage(ForwardingServerCallListener.java:33)
	at org.apache.beam.vendor.grpc.v1p13p1.io.grpc.Contexts$ContextualizedServerCallListener.onMessage(Contexts.java:76)
	at org.apache.beam.vendor.grpc.v1p13p1.io.grpc.internal.ServerCallImpl$ServerStreamListenerImpl.messagesAvailable(ServerCallImpl.java:263)
	at org.apache.beam.vendor.grpc.v1p13p1.io.grpc.internal.ServerImpl$JumpToApplicationThreadServerStreamListener$1MessagesAvailable.runInContext(ServerImpl.java:683)
	at org.apache.beam.vendor.grpc.v1p13p1.io.grpc.internal.ContextRunnable.run(ContextRunnable.java:37)
	at org.apache.beam.vendor.grpc.v1p13p1.io.grpc.internal.SerializingExecutor.run(SerializingExecutor.java:123)
	at java.util.concurrent.ThreadPoolExecutor.runWorker(ThreadPoolExecutor.java:1142)
	at java.util.concurrent.ThreadPoolExecutor$Worker.run(ThreadPoolExecutor.java:617)
	at java.lang.Thread.run(Thread.java:745)

-------------------- >> begin captured stdout << ---------------------
Found: https://console.cloud.google.com/dataflow/jobsDetail/locations/us-central1/jobs/2019-07-02_05_18_58-8606748156447795834?project=apache-beam-testing.

--------------------- >> end captured stdout << ----------------------

======================================================================
ERROR: test_metrics_fnapi_it (apache_beam.runners.dataflow.dataflow_exercise_metrics_pipeline_test.ExerciseMetricsPipelineTest)
----------------------------------------------------------------------
Traceback (most recent call last):
  File "<https://builds.apache.org/job/beam_PostCommit_Py_ValCont/ws/src/sdks/python/apache_beam/runners/dataflow/dataflow_exercise_metrics_pipeline_test.py",>
line 60, in test_metrics_fnapi_it
    result = self.run_pipeline(experiment='beam_fn_api')
  File "<https://builds.apache.org/job/beam_PostCommit_Py_ValCont/ws/src/sdks/python/apache_beam/runners/dataflow/dataflow_exercise_metrics_pipeline_test.py",>
line 48, in run_pipeline
    return dataflow_exercise_metrics_pipeline.apply_and_run(p)
  File "<https://builds.apache.org/job/beam_PostCommit_Py_ValCont/ws/src/sdks/python/apache_beam/runners/dataflow/dataflow_exercise_metrics_pipeline.py",>
line 197, in apply_and_run
    result = pipeline.run()
  File "<https://builds.apache.org/job/beam_PostCommit_Py_ValCont/ws/src/sdks/python/apache_beam/pipeline.py",>
line 406, in run
    self._options).run(False)
  File "<https://builds.apache.org/job/beam_PostCommit_Py_ValCont/ws/src/sdks/python/apache_beam/pipeline.py",>
line 419, in run
    return self.runner.run_pipeline(self, self._options)
  File "<https://builds.apache.org/job/beam_PostCommit_Py_ValCont/ws/src/sdks/python/apache_beam/runners/dataflow/test_dataflow_runner.py",>
line 64, in run_pipeline
    self.result.wait_until_finish(duration=wait_duration)
  File "<https://builds.apache.org/job/beam_PostCommit_Py_ValCont/ws/src/sdks/python/apache_beam/runners/dataflow/dataflow_runner.py",>
line 1338, in wait_until_finish
    (self.state, getattr(self._runner, 'last_error_msg', None)), self)
DataflowRuntimeException: Dataflow pipeline failed. State: FAILED, Error:
java.util.concurrent.ExecutionException: java.lang.RuntimeException: Error received from SDK
harness for instruction -130: Traceback (most recent call last):
  File "/usr/local/lib/python2.7/site-packages/apache_beam/runners/worker/sdk_worker.py",
line 157, in _execute
    response = task()
  File "/usr/local/lib/python2.7/site-packages/apache_beam/runners/worker/sdk_worker.py",
line 190, in <lambda>
    self._execute(lambda: worker.do_instruction(work), work)
  File "/usr/local/lib/python2.7/site-packages/apache_beam/runners/worker/sdk_worker.py",
line 342, in do_instruction
    request.instruction_id)
  File "/usr/local/lib/python2.7/site-packages/apache_beam/runners/worker/sdk_worker.py",
line 368, in process_bundle
    bundle_processor.process_bundle(instruction_id))
  File "/usr/local/lib/python2.7/site-packages/apache_beam/runners/worker/bundle_processor.py",
line 593, in process_bundle
    data.ptransform_id].process_encoded(data.data)
KeyError: u'\n\x04-108\x12\x04-106'

	at java.util.concurrent.CompletableFuture.reportGet(CompletableFuture.java:357)
	at java.util.concurrent.CompletableFuture.get(CompletableFuture.java:1895)
	at org.apache.beam.sdk.util.MoreFutures.get(MoreFutures.java:57)
	at org.apache.beam.runners.dataflow.worker.fn.control.RegisterAndProcessBundleOperation.finish(RegisterAndProcessBundleOperation.java:285)
	at org.apache.beam.runners.dataflow.worker.util.common.worker.MapTaskExecutor.execute(MapTaskExecutor.java:85)
	at org.apache.beam.runners.dataflow.worker.fn.control.BeamFnMapTaskExecutor.execute(BeamFnMapTaskExecutor.java:125)
	at org.apache.beam.runners.dataflow.worker.BatchDataflowWorker.executeWork(BatchDataflowWorker.java:412)
	at org.apache.beam.runners.dataflow.worker.BatchDataflowWorker.doWork(BatchDataflowWorker.java:381)
	at org.apache.beam.runners.dataflow.worker.BatchDataflowWorker.getAndPerformWork(BatchDataflowWorker.java:306)
	at org.apache.beam.runners.dataflow.worker.DataflowRunnerHarness.start(DataflowRunnerHarness.java:195)
	at org.apache.beam.runners.dataflow.worker.DataflowRunnerHarness.main(DataflowRunnerHarness.java:123)
	Suppressed: java.lang.IllegalStateException: Already closed.
		at org.apache.beam.sdk.fn.data.BeamFnDataBufferingOutboundObserver.close(BeamFnDataBufferingOutboundObserver.java:95)
		at org.apache.beam.runners.dataflow.worker.fn.data.RemoteGrpcPortWriteOperation.abort(RemoteGrpcPortWriteOperation.java:215)
		at org.apache.beam.runners.dataflow.worker.util.common.worker.MapTaskExecutor.execute(MapTaskExecutor.java:91)
		... 6 more
Caused by: java.lang.RuntimeException: Error received from SDK harness for instruction -130:
Traceback (most recent call last):
  File "/usr/local/lib/python2.7/site-packages/apache_beam/runners/worker/sdk_worker.py",
line 157, in _execute
    response = task()
  File "/usr/local/lib/python2.7/site-packages/apache_beam/runners/worker/sdk_worker.py",
line 190, in <lambda>
    self._execute(lambda: worker.do_instruction(work), work)
  File "/usr/local/lib/python2.7/site-packages/apache_beam/runners/worker/sdk_worker.py",
line 342, in do_instruction
    request.instruction_id)
  File "/usr/local/lib/python2.7/site-packages/apache_beam/runners/worker/sdk_worker.py",
line 368, in process_bundle
    bundle_processor.process_bundle(instruction_id))
  File "/usr/local/lib/python2.7/site-packages/apache_beam/runners/worker/bundle_processor.py",
line 593, in process_bundle
    data.ptransform_id].process_encoded(data.data)
KeyError: u'\n\x04-108\x12\x04-106'

	at org.apache.beam.runners.fnexecution.control.FnApiControlClient$ResponseStreamObserver.onNext(FnApiControlClient.java:157)
	at org.apache.beam.runners.fnexecution.control.FnApiControlClient$ResponseStreamObserver.onNext(FnApiControlClient.java:140)
	at org.apache.beam.vendor.grpc.v1p13p1.io.grpc.stub.ServerCalls$StreamingServerCallHandler$StreamingServerCallListener.onMessage(ServerCalls.java:248)
	at org.apache.beam.vendor.grpc.v1p13p1.io.grpc.ForwardingServerCallListener.onMessage(ForwardingServerCallListener.java:33)
	at org.apache.beam.vendor.grpc.v1p13p1.io.grpc.Contexts$ContextualizedServerCallListener.onMessage(Contexts.java:76)
	at org.apache.beam.vendor.grpc.v1p13p1.io.grpc.internal.ServerCallImpl$ServerStreamListenerImpl.messagesAvailable(ServerCallImpl.java:263)
	at org.apache.beam.vendor.grpc.v1p13p1.io.grpc.internal.ServerImpl$JumpToApplicationThreadServerStreamListener$1MessagesAvailable.runInContext(ServerImpl.java:683)
	at org.apache.beam.vendor.grpc.v1p13p1.io.grpc.internal.ContextRunnable.run(ContextRunnable.java:37)
	at org.apache.beam.vendor.grpc.v1p13p1.io.grpc.internal.SerializingExecutor.run(SerializingExecutor.java:123)
	at java.util.concurrent.ThreadPoolExecutor.runWorker(ThreadPoolExecutor.java:1142)
	at java.util.concurrent.ThreadPoolExecutor$Worker.run(ThreadPoolExecutor.java:617)
	at java.lang.Thread.run(Thread.java:745)

-------------------- >> begin captured stdout << ---------------------
Found: https://console.cloud.google.com/dataflow/jobsDetail/locations/us-central1/jobs/2019-07-02_05_25_17-1767413820336237218?project=apache-beam-testing.

--------------------- >> end captured stdout << ----------------------

----------------------------------------------------------------------
XML: <https://builds.apache.org/job/beam_PostCommit_Py_ValCont/ws/src/sdks/python/nosetests.xml>
----------------------------------------------------------------------
Ran 2 tests in 759.096s

FAILED (errors=2)
cleanup_container
Untagged: us.gcr.io/apache-beam-testing/jenkins/python:20190702-121148
Untagged: us.gcr.io/apache-beam-testing/jenkins/python@sha256:e0105589b3d0a126d38d45887e2a8a4a19495c4caa482c806f57deaa3d9ab248
Deleted: sha256:093239b013423284e634bbb8db542df7b800adaeaf009597a62a844ff216e7c0
Deleted: sha256:1f6474e593446db3e0cdb78736e6e956e426b2b28b49ed1a825564c5cd4699cf
Deleted: sha256:e61c1b79c7ed77a0c19c775dc2631aeb456abd7ee262df9f2433f686f4c3b43d
Deleted: sha256:0dec01143ead7ac8e1b806b21cf9401eb76a707858a860aadd681c723b8b903b
Deleted: sha256:f6b86d1c606739d0d7cb889e5abff5e7ec29ac7a6d4e0f549e6c0b728b72d5c1
Deleted: sha256:b328578e5db710cae450b0857f7db95fcf47e5ef3b6495b438520e604c3a905d
Deleted: sha256:7f7efb7719a501391ba50351c383774b2d56f8afb822e4a8a6a184c708f605c0
Deleted: sha256:aa42c77f60e6ed22381c6cb81431577c366fbac43eaf7d323165bd2f046c88bb
Deleted: sha256:456276da7d158343704fa6d041b5351d05bf2b9b32eeef28349c8d01d071fb91
Deleted: sha256:f2e430ab53ddc98030950962364baf586163054cc4042644abafa8e2b4e96c18
Deleted: sha256:3d4fa7f15898275aa5dca6c0bbc61e5bf38164f7949590879908464e4942b11c
Deleted: sha256:96e4c17add6e2cfc762bed0507ee68bf331c7bf02c8d4730d1df07b196472a84
Deleted: sha256:2232a4c95859bf0b8144984324f1f664152730544de0c1143a24fb5bb3e1a5c7
Deleted: sha256:5e08e6cfface0427a1a541cc383b567ff47bafe39e8dbbbad78b448c23eea80d
Digests:
- us.gcr.io/apache-beam-testing/jenkins/python@sha256:e0105589b3d0a126d38d45887e2a8a4a19495c4caa482c806f57deaa3d9ab248
  Associated tags:
 - 20190702-121148
Tags:
- us.gcr.io/apache-beam-testing/jenkins/python:20190702-121148
Deleted [us.gcr.io/apache-beam-testing/jenkins/python:20190702-121148].
Deleted [us.gcr.io/apache-beam-testing/jenkins/python@sha256:e0105589b3d0a126d38d45887e2a8a4a19495c4caa482c806f57deaa3d9ab248].
Removed the container
Build step 'Execute shell' marked build as failure

---------------------------------------------------------------------
To unsubscribe, e-mail: builds-unsubscribe@beam.apache.org
For additional commands, e-mail: builds-help@beam.apache.org


Mime
View raw message