beam-builds mailing list archives

Site index · List index
Message view « Date » · « Thread »
Top « Date » · « Thread »
From Apache Jenkins Server <jenk...@builds.apache.org>
Subject Build failed in Jenkins: beam_PostCommit_Java11_ValidatesRunner_PortabilityApi_Dataflow #773
Date Mon, 15 Jul 2019 08:40:41 GMT
See <https://builds.apache.org/job/beam_PostCommit_Java11_ValidatesRunner_PortabilityApi_Dataflow/773/display/redirect>

------------------------------------------
[...truncated 70.31 KB...]
51d5211fea3c: Preparing
bd426411db69: Preparing
cad0181e2290: Preparing
a8122da79081: Preparing
483b6afcd302: Preparing
f4aaad5a2844: Preparing
f0fa4eb58fbc: Preparing
4230ff7f2288: Preparing
2c719774c1e1: Preparing
ec62f19bb3aa: Preparing
f94641f1fe1f: Preparing
4230ff7f2288: Waiting
a8122da79081: Waiting
2c719774c1e1: Waiting
ec62f19bb3aa: Waiting
483b6afcd302: Waiting
f94641f1fe1f: Waiting
f4aaad5a2844: Waiting
f0fa4eb58fbc: Waiting
bd426411db69: Waiting
cad0181e2290: Waiting
f8edf2d22d7f: Layer already exists
43e12a7530bb: Layer already exists
cad0181e2290: Layer already exists
a8122da79081: Layer already exists
483b6afcd302: Layer already exists
f0fa4eb58fbc: Layer already exists
f4aaad5a2844: Layer already exists
2c719774c1e1: Layer already exists
ec62f19bb3aa: Layer already exists
4230ff7f2288: Layer already exists
f94641f1fe1f: Layer already exists
51d5211fea3c: Layer already exists
ced1a5480e21: Layer already exists
2c0cce6f45ef: Layer already exists
bd426411db69: Layer already exists
20190620155933: digest: sha256:7d3fe4c9f62b2b0c8867e38b4f41d4475fb9de8e6f2ceb677dd43c53452b94c7
size: 3469
fbe25072aa20: Preparing
4e4d796c8611: Preparing
71603d4231e7: Preparing
8147d65b8d12: Preparing
b09dcbd0c67a: Preparing
a719a6b80925: Preparing
cad0181e2290: Preparing
a8122da79081: Preparing
483b6afcd302: Preparing
f4aaad5a2844: Preparing
f0fa4eb58fbc: Preparing
4230ff7f2288: Preparing
2c719774c1e1: Preparing
ec62f19bb3aa: Preparing
f94641f1fe1f: Preparing
a719a6b80925: Waiting
cad0181e2290: Waiting
a8122da79081: Waiting
483b6afcd302: Waiting
f4aaad5a2844: Waiting
ec62f19bb3aa: Waiting
f94641f1fe1f: Waiting
f0fa4eb58fbc: Waiting
4230ff7f2288: Waiting
b09dcbd0c67a: Layer already exists
fbe25072aa20: Layer already exists
cad0181e2290: Layer already exists
a8122da79081: Layer already exists
483b6afcd302: Layer already exists
f4aaad5a2844: Layer already exists
f0fa4eb58fbc: Layer already exists
4230ff7f2288: Layer already exists
2c719774c1e1: Layer already exists
ec62f19bb3aa: Layer already exists
f94641f1fe1f: Layer already exists
8147d65b8d12: Layer already exists
71603d4231e7: Layer already exists
4e4d796c8611: Layer already exists
a719a6b80925: Layer already exists
20190708180027: digest: sha256:8cd67c375a3b7eee13c370ae02b41f4f583655503e9e76956459226898cbba9b
size: 3469
fdd0bded3eaa: Preparing
c1747f8e0c79: Preparing
82e7d41a06b9: Preparing
8aa77783ba70: Preparing
ab737348ee19: Preparing
88c2d07b31f2: Preparing
cad0181e2290: Preparing
a8122da79081: Preparing
483b6afcd302: Preparing
f4aaad5a2844: Preparing
f0fa4eb58fbc: Preparing
4230ff7f2288: Preparing
2c719774c1e1: Preparing
ec62f19bb3aa: Preparing
f94641f1fe1f: Preparing
88c2d07b31f2: Waiting
cad0181e2290: Waiting
a8122da79081: Waiting
483b6afcd302: Waiting
f4aaad5a2844: Waiting
f0fa4eb58fbc: Waiting
4230ff7f2288: Waiting
ec62f19bb3aa: Waiting
8aa77783ba70: Layer already exists
ab737348ee19: Layer already exists
cad0181e2290: Layer already exists
a8122da79081: Layer already exists
483b6afcd302: Layer already exists
f4aaad5a2844: Layer already exists
f0fa4eb58fbc: Layer already exists
4230ff7f2288: Layer already exists
2c719774c1e1: Layer already exists
ec62f19bb3aa: Layer already exists
f94641f1fe1f: Layer already exists
fdd0bded3eaa: Layer already exists
c1747f8e0c79: Layer already exists
82e7d41a06b9: Layer already exists
88c2d07b31f2: Layer already exists
20190710140618: digest: sha256:d3c7ac47c124bde1782d5fc08112ed3958eddacca1c434dc1eab76a0307ebadf
size: 3469
d09054d38577: Preparing
880f246a53f9: Preparing
0a0aa347c5c5: Preparing
dce383795705: Preparing
fe5d5a0a9dfd: Preparing
6dde6d58a89e: Preparing
cad0181e2290: Preparing
a8122da79081: Preparing
483b6afcd302: Preparing
f4aaad5a2844: Preparing
f0fa4eb58fbc: Preparing
4230ff7f2288: Preparing
6dde6d58a89e: Waiting
2c719774c1e1: Preparing
ec62f19bb3aa: Preparing
cad0181e2290: Waiting
f94641f1fe1f: Preparing
a8122da79081: Waiting
f0fa4eb58fbc: Waiting
4230ff7f2288: Waiting
2c719774c1e1: Waiting
ec62f19bb3aa: Waiting
f4aaad5a2844: Waiting
483b6afcd302: Waiting
f94641f1fe1f: Waiting
d09054d38577: Layer already exists
fe5d5a0a9dfd: Layer already exists
f4aaad5a2844: Layer already exists
cad0181e2290: Layer already exists
2c719774c1e1: Layer already exists
4230ff7f2288: Layer already exists
ec62f19bb3aa: Layer already exists
f94641f1fe1f: Layer already exists
f0fa4eb58fbc: Layer already exists
a8122da79081: Layer already exists
483b6afcd302: Layer already exists
880f246a53f9: Layer already exists
0a0aa347c5c5: Layer already exists
dce383795705: Layer already exists
6dde6d58a89e: Layer already exists
20190714120022: digest: sha256:c06241b26cdaeaf32292d4f243054059cf5f143977dc83254d4f772c32050208
size: 3469
1061ab08766a: Preparing
a140d32361a0: Preparing
5c3100c74616: Preparing
b51872695b85: Preparing
f07a14d0b012: Preparing
ad1702be9e22: Preparing
cad0181e2290: Preparing
a8122da79081: Preparing
483b6afcd302: Preparing
f4aaad5a2844: Preparing
f0fa4eb58fbc: Preparing
4230ff7f2288: Preparing
2c719774c1e1: Preparing
ec62f19bb3aa: Preparing
f94641f1fe1f: Preparing
f0fa4eb58fbc: Waiting
4230ff7f2288: Waiting
2c719774c1e1: Waiting
cad0181e2290: Waiting
a8122da79081: Waiting
ec62f19bb3aa: Waiting
483b6afcd302: Waiting
f94641f1fe1f: Waiting
f4aaad5a2844: Waiting
ad1702be9e22: Waiting
5c3100c74616: Pushed
a140d32361a0: Pushed
483b6afcd302: Layer already exists
a8122da79081: Layer already exists
cad0181e2290: Layer already exists
4230ff7f2288: Layer already exists
f4aaad5a2844: Layer already exists
2c719774c1e1: Layer already exists
f0fa4eb58fbc: Layer already exists
ec62f19bb3aa: Layer already exists
f94641f1fe1f: Layer already exists
f07a14d0b012: Pushed
ad1702be9e22: Pushed
1061ab08766a: Pushed
b51872695b85: Pushed
20190715060023: digest: sha256:2c6b14da57b554ad8bedb4ddec97393c2a72b5512e23986a9f909b3f6b232f71
size: 3469

> Task :runners:google-cloud-dataflow-java:validatesRunnerFnApiWorkerTest

org.apache.beam.sdk.transforms.ViewTest > testWindowedMapAsEntrySetSideInput FAILED
    java.lang.RuntimeException at ViewTest.java:1099

org.apache.beam.sdk.transforms.ViewTest > testMultimapAsEntrySetSideInput FAILED
    java.lang.RuntimeException at ViewTest.java:581

org.apache.beam.sdk.transforms.ViewTest > testSingletonSideInput FAILED
    java.lang.RuntimeException at ViewTest.java:113

156 tests completed, 3 failed, 2 skipped

> Task :runners:google-cloud-dataflow-java:validatesRunnerFnApiWorkerTest FAILED

> Task :runners:google-cloud-dataflow-java:cleanUpDockerImages
Untagged: us.gcr.io/apache-beam-testing/java-postcommit-it/java:20190715060023
Untagged: us.gcr.io/apache-beam-testing/java-postcommit-it/java@sha256:2c6b14da57b554ad8bedb4ddec97393c2a72b5512e23986a9f909b3f6b232f71
Digests:
- us.gcr.io/apache-beam-testing/java-postcommit-it/java@sha256:2c6b14da57b554ad8bedb4ddec97393c2a72b5512e23986a9f909b3f6b232f71
  Associated tags:
 - 20190715060023
Tags:
- us.gcr.io/apache-beam-testing/java-postcommit-it/java:20190715060023
Deleted [us.gcr.io/apache-beam-testing/java-postcommit-it/java:20190715060023].
Deleted [us.gcr.io/apache-beam-testing/java-postcommit-it/java@sha256:2c6b14da57b554ad8bedb4ddec97393c2a72b5512e23986a9f909b3f6b232f71].

FAILURE: Build failed with an exception.

* What went wrong:
Execution failed for task ':runners:google-cloud-dataflow-java:validatesRunnerFnApiWorkerTest'.
> There were failing tests. See the report at: file://<https://builds.apache.org/job/beam_PostCommit_Java11_ValidatesRunner_PortabilityApi_Dataflow/ws/src/runners/google-cloud-dataflow-java/build/reports/tests/validatesRunnerFnApiWorkerTest/index.html>

* Try:
Run with --stacktrace option to get the stack trace. Run with --info or --debug option to
get more log output. Run with --scan to get full insights.

* Get more help at https://help.gradle.org

Deprecated Gradle features were used in this build, making it incompatible with Gradle 6.0.
Use '--warning-mode all' to show the individual deprecation warnings.
See https://docs.gradle.org/5.2.1/userguide/command_line_interface.html#sec:command_line_warnings

BUILD FAILED in 2h 40m 32s
79 actionable tasks: 59 executed, 19 from cache, 1 up-to-date

Publishing build scan...
https://gradle.com/s/zinzjsw5qwa4y

Build step 'Invoke Gradle script' changed build result to FAILURE
Build step 'Invoke Gradle script' marked build as failure

---------------------------------------------------------------------
To unsubscribe, e-mail: builds-unsubscribe@beam.apache.org
For additional commands, e-mail: builds-help@beam.apache.org


Mime
View raw message