beam-builds mailing list archives

Site index · List index
Message view « Date » · « Thread »
Top « Date » · « Thread »
From Apache Jenkins Server <jenk...@builds.apache.org>
Subject Build failed in Jenkins: beam_PerformanceTests_WordCountIT_Py27 #190
Date Mon, 01 Jul 2019 06:22:03 GMT
See <https://builds.apache.org/job/beam_PerformanceTests_WordCountIT_Py27/190/display/redirect>

------------------------------------------
[...truncated 54.29 KB...]
Collecting google-api-core[grpc]<2.0.0dev,>=1.6.0 (from google-cloud-datastore<1.8.0,>=1.7.1->apache-beam==2.15.0.dev0)
  Using cached https://files.pythonhosted.org/packages/a2/78/bbd685dda48a291b4cc81568ed3e1a89af7a61958dc88a3d52a819b1919d/google_api_core-1.13.0-py2.py3-none-any.whl
Collecting grpc-google-iam-v1<0.12dev,>=0.11.4 (from google-cloud-pubsub<0.40.0,>=0.39.0->apache-beam==2.15.0.dev0)
Collecting google-resumable-media>=0.2.1 (from google-cloud-bigquery<1.7.0,>=1.6.0->apache-beam==2.15.0.dev0)
  Using cached https://files.pythonhosted.org/packages/e2/5d/4bc5c28c252a62efe69ed1a1561da92bd5af8eca0cdcdf8e60354fae9b29/google_resumable_media-0.3.2-py2.py3-none-any.whl
Collecting googleapis-common-protos<2.0dev,>=1.5.2 (from proto-google-cloud-datastore-v1<=0.90.4,>=0.90.0->apache-beam==2.15.0.dev0)
Collecting python-dateutil>=2.5.0 (from pandas<0.24,>=0.23.4->apache-beam==2.15.0.dev0)
  Using cached https://files.pythonhosted.org/packages/41/17/c62faccbfbd163c7f57f3844689e3a78bae1f403648a6afb1d0866d87fbb/python_dateutil-2.8.0-py2.py3-none-any.whl
Collecting monotonic>=0.6; python_version == "2.7" (from tenacity<6.0,>=5.0.2->apache-beam==2.15.0.dev0)
  Using cached https://files.pythonhosted.org/packages/ac/aa/063eca6a416f397bd99552c534c6d11d57f58f2e94c14780f3bbf818c4cf/monotonic-1.5-py2.py3-none-any.whl
Collecting urllib3!=1.25.0,!=1.25.1,<1.26,>=1.21.1 (from requests>=2.7.0->hdfs<3.0.0,>=2.1.0->apache-beam==2.15.0.dev0)
  Using cached https://files.pythonhosted.org/packages/e6/60/247f23a7121ae632d62811ba7f273d0e58972d75e58a94d329d51550a47d/urllib3-1.25.3-py2.py3-none-any.whl
Collecting certifi>=2017.4.17 (from requests>=2.7.0->hdfs<3.0.0,>=2.1.0->apache-beam==2.15.0.dev0)
  Using cached https://files.pythonhosted.org/packages/69/1b/b853c7a9d4f6a6d00749e94eb6f3a041e342a885b87340b79c1ef73e3a78/certifi-2019.6.16-py2.py3-none-any.whl
Collecting chardet<3.1.0,>=3.0.2 (from requests>=2.7.0->hdfs<3.0.0,>=2.1.0->apache-beam==2.15.0.dev0)
  Using cached https://files.pythonhosted.org/packages/bc/a9/01ffebfb562e4274b6487b4bb1ddec7ca55ec7510b22e4c51f14098443b8/chardet-3.0.4-py2.py3-none-any.whl
Collecting idna<2.9,>=2.5 (from requests>=2.7.0->hdfs<3.0.0,>=2.1.0->apache-beam==2.15.0.dev0)
  Using cached https://files.pythonhosted.org/packages/14/2c/cd551d81dbe15200be1cf41cd03869a46fe7226e7450af7a6545bfc474c9/idna-2.8-py2.py3-none-any.whl
Collecting google-auth<2.0dev,>=0.4.0 (from google-api-core[grpc]<2.0.0dev,>=1.6.0->google-cloud-datastore<1.8.0,>=1.7.1->apache-beam==2.15.0.dev0)
  Using cached https://files.pythonhosted.org/packages/c5/9b/ed0516cc1f7609fb0217e3057ff4f0f9f3e3ce79a369c6af4a6c5ca25664/google_auth-1.6.3-py2.py3-none-any.whl
Installing collected packages: crcmod, dill, fastavro, docopt, urllib3, certifi, chardet,
idna, requests, hdfs, httplib2, pbr, funcsigs, mock, pymongo, pyasn1, pyasn1-modules, rsa,
oauth2client, pyparsing, pydot, pytz, pyyaml, avro, pyvcf, typing, numpy, pyarrow, cachetools,
monotonic, fasteners, google-apitools, googleapis-common-protos, google-auth, google-api-core,
google-cloud-core, google-cloud-datastore, grpc-google-iam-v1, google-cloud-pubsub, google-resumable-media,
google-cloud-bigquery, google-cloud-bigtable, proto-google-cloud-datastore-v1, googledatastore,
nose, python-dateutil, pandas, parameterized, pyhamcrest, tenacity, apache-beam
  Running setup.py develop for apache-beam
Successfully installed apache-beam avro-1.9.0 cachetools-3.1.1 certifi-2019.6.16 chardet-3.0.4
crcmod-1.7 dill-0.2.9 docopt-0.6.2 fastavro-0.21.24 fasteners-0.15 funcsigs-1.0.2 google-api-core-1.13.0
google-apitools-0.5.28 google-auth-1.6.3 google-cloud-bigquery-1.6.1 google-cloud-bigtable-0.32.2
google-cloud-core-0.29.1 google-cloud-datastore-1.7.4 google-cloud-pubsub-0.39.1 google-resumable-media-0.3.2
googleapis-common-protos-1.6.0 googledatastore-7.0.2 grpc-google-iam-v1-0.11.4 hdfs-2.5.7
httplib2-0.12.0 idna-2.8 mock-2.0.0 monotonic-1.5 nose-1.3.7 numpy-1.16.4 oauth2client-3.0.0
pandas-0.23.4 parameterized-0.6.3 pbr-5.3.1 proto-google-cloud-datastore-v1-0.90.4 pyarrow-0.13.0
pyasn1-0.4.5 pyasn1-modules-0.2.5 pydot-1.2.4 pyhamcrest-1.9.0 pymongo-3.8.0 pyparsing-2.4.0
python-dateutil-2.8.0 pytz-2019.1 pyvcf-0.6.8 pyyaml-3.13 requests-2.22.0 rsa-4.0 tenacity-5.0.4
typing-3.6.6 urllib3-1.25.3
:sdks:python:installGcpTest (Thread[Execution worker for ':',5,main]) completed. Took 19.509
secs.
:sdks:python:integrationTest (Thread[Execution worker for ':',5,main]) started.

> Task :sdks:python:integrationTest
Caching disabled for task ':sdks:python:integrationTest': Caching has not been enabled for
the task
Task ':sdks:python:integrationTest' is not up-to-date because:
  Task has not declared any outputs despite executing actions.
Custom actions are attached to task ':sdks:python:integrationTest'.
Starting process 'command 'sh''. Working directory: <https://builds.apache.org/job/beam_PerformanceTests_WordCountIT_Py27/ws/src/sdks/python>
Command: sh -c . <https://builds.apache.org/job/beam_PerformanceTests_WordCountIT_Py27/ws/src/build/gradleenv/1922375555/bin/activate>
&& <https://builds.apache.org/job/beam_PerformanceTests_WordCountIT_Py27/ws/src/sdks/python/scripts/run_integration_test.sh>
--test_opts "--tests=apache_beam.examples.wordcount_it_test:WordCountIT.test_wordcount_it
--attr=IT --nocapture" --pipeline_opts "--project=apache-beam-testing --staging_location=gs://temp-storage-for-end-to-end-tests/staging-it
--temp_location=gs://temp-storage-for-end-to-end-tests/temp-it --input=gs://apache-beam-samples/input_small_files/ascii_sort_1MB_input.0000*
--output=gs://temp-storage-for-end-to-end-tests/py-it-cloud/output --expect_checksum=ea0ca2e5ee4ea5f218790f28d0b9fe7d09d8d710
--num_workers=10 --autoscaling_algorithm=NONE --runner=TestDataflowRunner --sdk_location=build/apache-beam.tar.gz"
Successfully started process 'command 'sh''
>>> RUNNING integration tests with pipeline options: --project=apache-beam-testing
--staging_location=gs://temp-storage-for-end-to-end-tests/staging-it --temp_location=gs://temp-storage-for-end-to-end-tests/temp-it
--input=gs://apache-beam-samples/input_small_files/ascii_sort_1MB_input.0000* --output=gs://temp-storage-for-end-to-end-tests/py-it-cloud/output
--expect_checksum=ea0ca2e5ee4ea5f218790f28d0b9fe7d09d8d710 --num_workers=10 --autoscaling_algorithm=NONE
--runner=TestDataflowRunner --sdk_location=build/apache-beam.tar.gz
>>>   test options: --tests=apache_beam.examples.wordcount_it_test:WordCountIT.test_wordcount_it
--attr=IT --nocapture
running nosetests
running egg_info
writing requirements to apache_beam.egg-info/requires.txt
writing apache_beam.egg-info/PKG-INFO
writing top-level names to apache_beam.egg-info/top_level.txt
writing dependency_links to apache_beam.egg-info/dependency_links.txt
writing entry points to apache_beam.egg-info/entry_points.txt
reading manifest file 'apache_beam.egg-info/SOURCES.txt'
reading manifest template 'MANIFEST.in'
writing manifest file 'apache_beam.egg-info/SOURCES.txt'

> Task :sdks:python:integrationTest FAILED
:sdks:python:integrationTest (Thread[Execution worker for ':',5,main]) completed. Took 6 mins
5.995 secs.

Deprecated Gradle features were used in this build, making it incompatible with Gradle 6.0.
Use '--warning-mode all' to show the individual deprecation warnings.
See https://docs.gradle.org/5.2.1/userguide/command_line_interface.html#sec:command_line_warnings
4 actionable tasks: 4 executed

STDERR: DEPRECATION: Python 2.7 will reach the end of its life on January 1st, 2020. Please
upgrade your Python as Python 2.7 won't be maintained after that date. A future version of
pip will drop support for Python 2.7.
<https://builds.apache.org/job/beam_PerformanceTests_WordCountIT_Py27/ws/src/build/gradleenv/1922375555/local/lib/python2.7/site-packages/setuptools/dist.py>:472:
UserWarning: Normalizing '2.15.0.dev' to '2.15.0.dev0'
  normalized_version,
beam_fn_api.proto: warning: Import google/protobuf/descriptor.proto but not used.
beam_fn_api.proto: warning: Import google/protobuf/wrappers.proto but not used.
DEPRECATION: Python 2.7 will reach the end of its life on January 1st, 2020. Please upgrade
your Python as Python 2.7 won't be maintained after that date. A future version of pip will
drop support for Python 2.7.
root: Generating grammar tables from /usr/lib/python2.7/lib2to3/PatternGrammar.txt
root: Generating grammar tables from /usr/lib/python2.7/lib2to3/PatternGrammar.txt
root: Generating grammar tables from /usr/lib/python2.7/lib2to3/PatternGrammar.txt
root: Generating grammar tables from /usr/lib/python2.7/lib2to3/PatternGrammar.txt
root: Generating grammar tables from /usr/lib/python2.7/lib2to3/PatternGrammar.txt
root: Generating grammar tables from /usr/lib/python2.7/lib2to3/PatternGrammar.txt
root: Generating grammar tables from /usr/lib/python2.7/lib2to3/PatternGrammar.txt
root: Generating grammar tables from /usr/lib/python2.7/lib2to3/PatternGrammar.txt
root: Generating grammar tables from /usr/lib/python2.7/lib2to3/PatternGrammar.txt
root: Generating grammar tables from /usr/lib/python2.7/lib2to3/PatternGrammar.txt
root: Generating grammar tables from /usr/lib/python2.7/lib2to3/PatternGrammar.txt
root: Generating grammar tables from /usr/lib/python2.7/lib2to3/PatternGrammar.txt
RefactoringTool: Skipping optional fixer: idioms
root: Generating grammar tables from /usr/lib/python2.7/lib2to3/PatternGrammar.txt
root: Generating grammar tables from /usr/lib/python2.7/lib2to3/PatternGrammar.txt
root: Generating grammar tables from /usr/lib/python2.7/lib2to3/PatternGrammar.txt
root: Generating grammar tables from /usr/lib/python2.7/lib2to3/PatternGrammar.txt
root: Generating grammar tables from /usr/lib/python2.7/lib2to3/PatternGrammar.txt
root: Generating grammar tables from /usr/lib/python2.7/lib2to3/PatternGrammar.txt
root: Generating grammar tables from /usr/lib/python2.7/lib2to3/PatternGrammar.txt
root: Generating grammar tables from /usr/lib/python2.7/lib2to3/PatternGrammar.txt
root: Generating grammar tables from /usr/lib/python2.7/lib2to3/PatternGrammar.txt
root: Generating grammar tables from /usr/lib/python2.7/lib2to3/PatternGrammar.txt
root: Generating grammar tables from /usr/lib/python2.7/lib2to3/PatternGrammar.txt
root: Generating grammar tables from /usr/lib/python2.7/lib2to3/PatternGrammar.txt
root: Generating grammar tables from /usr/lib/python2.7/lib2to3/PatternGrammar.txt
root: Generating grammar tables from /usr/lib/python2.7/lib2to3/PatternGrammar.txt
root: Generating grammar tables from /usr/lib/python2.7/lib2to3/PatternGrammar.txt
root: Generating grammar tables from /usr/lib/python2.7/lib2to3/PatternGrammar.txt
root: Generating grammar tables from /usr/lib/python2.7/lib2to3/PatternGrammar.txt
root: Generating grammar tables from /usr/lib/python2.7/lib2to3/PatternGrammar.txt
root: Generating grammar tables from /usr/lib/python2.7/lib2to3/PatternGrammar.txt
root: Generating grammar tables from /usr/lib/python2.7/lib2to3/PatternGrammar.txt
root: Generating grammar tables from /usr/lib/python2.7/lib2to3/PatternGrammar.txt
root: Generating grammar tables from /usr/lib/python2.7/lib2to3/PatternGrammar.txt
root: Generating grammar tables from /usr/lib/python2.7/lib2to3/PatternGrammar.txt
RefactoringTool: Skipping optional fixer: ws_comma
root: Generating grammar tables from /usr/lib/python2.7/lib2to3/PatternGrammar.txt
root: Generating grammar tables from /usr/lib/python2.7/lib2to3/PatternGrammar.txt
root: Generating grammar tables from /usr/lib/python2.7/lib2to3/PatternGrammar.txt
root: Generating grammar tables from /usr/lib/python2.7/lib2to3/PatternGrammar.txt
root: Generating grammar tables from /usr/lib/python2.7/lib2to3/PatternGrammar.txt
root: Generating grammar tables from /usr/lib/python2.7/lib2to3/PatternGrammar.txt
root: Generating grammar tables from /usr/lib/python2.7/lib2to3/PatternGrammar.txt
root: Generating grammar tables from /usr/lib/python2.7/lib2to3/PatternGrammar.txt
root: Generating grammar tables from /usr/lib/python2.7/lib2to3/PatternGrammar.txt
root: Generating grammar tables from /usr/lib/python2.7/lib2to3/PatternGrammar.txt
root: Generating grammar tables from /usr/lib/python2.7/lib2to3/PatternGrammar.txt
root: Generating grammar tables from /usr/lib/python2.7/lib2to3/PatternGrammar.txt
root: Generating grammar tables from /usr/lib/python2.7/lib2to3/PatternGrammar.txt
root: Generating grammar tables from /usr/lib/python2.7/lib2to3/PatternGrammar.txt
root: Generating grammar tables from /usr/lib/python2.7/lib2to3/PatternGrammar.txt
root: Generating grammar tables from /usr/lib/python2.7/lib2to3/PatternGrammar.txt
root: Generating grammar tables from /usr/lib/python2.7/lib2to3/PatternGrammar.txt
root: Generating grammar tables from /usr/lib/python2.7/lib2to3/PatternGrammar.txt
root: Generating grammar tables from /usr/lib/python2.7/lib2to3/PatternGrammar.txt
root: Generating grammar tables from /usr/lib/python2.7/lib2to3/PatternGrammar.txt
root: Generating grammar tables from /usr/lib/python2.7/lib2to3/PatternGrammar.txt
RefactoringTool: No changes to <https://builds.apache.org/job/beam_PerformanceTests_WordCountIT_Py27/ws/src/sdks/python/build/srcs/sdks/python/apache_beam/portability/api/beam_artifact_api_pb2.py>
RefactoringTool: Refactored <https://builds.apache.org/job/beam_PerformanceTests_WordCountIT_Py27/ws/src/sdks/python/build/srcs/sdks/python/apache_beam/portability/api/beam_artifact_api_pb2_grpc.py>
RefactoringTool: Refactored <https://builds.apache.org/job/beam_PerformanceTests_WordCountIT_Py27/ws/src/sdks/python/build/srcs/sdks/python/apache_beam/portability/api/beam_expansion_api_pb2.py>
RefactoringTool: Refactored <https://builds.apache.org/job/beam_PerformanceTests_WordCountIT_Py27/ws/src/sdks/python/build/srcs/sdks/python/apache_beam/portability/api/beam_expansion_api_pb2_grpc.py>
RefactoringTool: Refactored <https://builds.apache.org/job/beam_PerformanceTests_WordCountIT_Py27/ws/src/sdks/python/build/srcs/sdks/python/apache_beam/portability/api/beam_fn_api_pb2.py>
RefactoringTool: Refactored <https://builds.apache.org/job/beam_PerformanceTests_WordCountIT_Py27/ws/src/sdks/python/build/srcs/sdks/python/apache_beam/portability/api/beam_fn_api_pb2_grpc.py>
RefactoringTool: Refactored <https://builds.apache.org/job/beam_PerformanceTests_WordCountIT_Py27/ws/src/sdks/python/build/srcs/sdks/python/apache_beam/portability/api/beam_job_api_pb2.py>
RefactoringTool: Refactored <https://builds.apache.org/job/beam_PerformanceTests_WordCountIT_Py27/ws/src/sdks/python/build/srcs/sdks/python/apache_beam/portability/api/beam_job_api_pb2_grpc.py>
RefactoringTool: No changes to <https://builds.apache.org/job/beam_PerformanceTests_WordCountIT_Py27/ws/src/sdks/python/build/srcs/sdks/python/apache_beam/portability/api/beam_provision_api_pb2.py>
RefactoringTool: Refactored <https://builds.apache.org/job/beam_PerformanceTests_WordCountIT_Py27/ws/src/sdks/python/build/srcs/sdks/python/apache_beam/portability/api/beam_provision_api_pb2_grpc.py>
RefactoringTool: Refactored <https://builds.apache.org/job/beam_PerformanceTests_WordCountIT_Py27/ws/src/sdks/python/build/srcs/sdks/python/apache_beam/portability/api/beam_runner_api_pb2.py>
RefactoringTool: No changes to <https://builds.apache.org/job/beam_PerformanceTests_WordCountIT_Py27/ws/src/sdks/python/build/srcs/sdks/python/apache_beam/portability/api/endpoints_pb2.py>
RefactoringTool: Refactored <https://builds.apache.org/job/beam_PerformanceTests_WordCountIT_Py27/ws/src/sdks/python/build/srcs/sdks/python/apache_beam/portability/api/external_transforms_pb2.py>
RefactoringTool: Refactored <https://builds.apache.org/job/beam_PerformanceTests_WordCountIT_Py27/ws/src/sdks/python/build/srcs/sdks/python/apache_beam/portability/api/metrics_pb2.py>
RefactoringTool: Refactored <https://builds.apache.org/job/beam_PerformanceTests_WordCountIT_Py27/ws/src/sdks/python/build/srcs/sdks/python/apache_beam/portability/api/standard_window_fns_pb2.py>
RefactoringTool: Files that were modified:
RefactoringTool: <https://builds.apache.org/job/beam_PerformanceTests_WordCountIT_Py27/ws/src/sdks/python/build/srcs/sdks/python/apache_beam/portability/api/beam_artifact_api_pb2.py>
RefactoringTool: <https://builds.apache.org/job/beam_PerformanceTests_WordCountIT_Py27/ws/src/sdks/python/build/srcs/sdks/python/apache_beam/portability/api/beam_artifact_api_pb2_grpc.py>
RefactoringTool: <https://builds.apache.org/job/beam_PerformanceTests_WordCountIT_Py27/ws/src/sdks/python/build/srcs/sdks/python/apache_beam/portability/api/beam_expansion_api_pb2.py>
RefactoringTool: <https://builds.apache.org/job/beam_PerformanceTests_WordCountIT_Py27/ws/src/sdks/python/build/srcs/sdks/python/apache_beam/portability/api/beam_expansion_api_pb2_grpc.py>
RefactoringTool: <https://builds.apache.org/job/beam_PerformanceTests_WordCountIT_Py27/ws/src/sdks/python/build/srcs/sdks/python/apache_beam/portability/api/beam_fn_api_pb2.py>
RefactoringTool: <https://builds.apache.org/job/beam_PerformanceTests_WordCountIT_Py27/ws/src/sdks/python/build/srcs/sdks/python/apache_beam/portability/api/beam_fn_api_pb2_grpc.py>
RefactoringTool: <https://builds.apache.org/job/beam_PerformanceTests_WordCountIT_Py27/ws/src/sdks/python/build/srcs/sdks/python/apache_beam/portability/api/beam_job_api_pb2.py>
RefactoringTool: <https://builds.apache.org/job/beam_PerformanceTests_WordCountIT_Py27/ws/src/sdks/python/build/srcs/sdks/python/apache_beam/portability/api/beam_job_api_pb2_grpc.py>
RefactoringTool: <https://builds.apache.org/job/beam_PerformanceTests_WordCountIT_Py27/ws/src/sdks/python/build/srcs/sdks/python/apache_beam/portability/api/beam_provision_api_pb2.py>
RefactoringTool: <https://builds.apache.org/job/beam_PerformanceTests_WordCountIT_Py27/ws/src/sdks/python/build/srcs/sdks/python/apache_beam/portability/api/beam_provision_api_pb2_grpc.py>
RefactoringTool: <https://builds.apache.org/job/beam_PerformanceTests_WordCountIT_Py27/ws/src/sdks/python/build/srcs/sdks/python/apache_beam/portability/api/beam_runner_api_pb2.py>
RefactoringTool: <https://builds.apache.org/job/beam_PerformanceTests_WordCountIT_Py27/ws/src/sdks/python/build/srcs/sdks/python/apache_beam/portability/api/endpoints_pb2.py>
RefactoringTool: <https://builds.apache.org/job/beam_PerformanceTests_WordCountIT_Py27/ws/src/sdks/python/build/srcs/sdks/python/apache_beam/portability/api/external_transforms_pb2.py>
RefactoringTool: <https://builds.apache.org/job/beam_PerformanceTests_WordCountIT_Py27/ws/src/sdks/python/build/srcs/sdks/python/apache_beam/portability/api/metrics_pb2.py>
RefactoringTool: <https://builds.apache.org/job/beam_PerformanceTests_WordCountIT_Py27/ws/src/sdks/python/build/srcs/sdks/python/apache_beam/portability/api/standard_window_fns_pb2.py>
warning: no files found matching 'README.md'
warning: no files found matching 'NOTICE'
warning: no files found matching 'LICENSE'
warning: cmd: standard file not found: should have one of README, README.rst, README.txt,
README.md

DEPRECATION: Python 2.7 will reach the end of its life on January 1st, 2020. Please upgrade
your Python as Python 2.7 won't be maintained after that date. A future version of pip will
drop support for Python 2.7.
<https://builds.apache.org/job/beam_PerformanceTests_WordCountIT_Py27/ws/src/build/gradleenv/1922375555/local/lib/python2.7/site-packages/setuptools/dist.py>:472:
UserWarning: Normalizing '2.15.0.dev' to '2.15.0.dev0'
  normalized_version,
warning: no files found matching 'README.md'
warning: no files found matching 'NOTICE'
warning: no files found matching 'LICENSE'
test_wordcount_it (apache_beam.examples.wordcount_it_test.WordCountIT) ... <https://builds.apache.org/job/beam_PerformanceTests_WordCountIT_Py27/ws/src/sdks/python/scripts/run_integration_test.sh>:
line 231: 23416 Terminated              python setup.py nosetests --test-pipeline-options="$PIPELINE_OPTS"
$TEST_OPTS

FAILURE: Build failed with an exception.

* What went wrong:
Execution failed for task ':sdks:python:integrationTest'.
> Process 'command 'sh'' finished with non-zero exit value 143

* Try:
Run with --stacktrace option to get the stack trace. Run with --debug option to get more log
output. Run with --scan to get full insights.

* Get more help at https://help.gradle.org

BUILD FAILED in 6m 47s
The message received from the daemon indicates that the daemon has disappeared.
Build request sent: Build{id=6c9ea667-0c32-4f1c-96ee-da85fed8e610, currentDir=<https://builds.apache.org/job/beam_PerformanceTests_WordCountIT_Py27/ws/src}>
Attempting to read last messages from the daemon log...
Daemon pid: 15645
  log file: /home/jenkins/.gradle/daemon/5.2.1/daemon-15645.out.log
----- Last  20 lines from daemon log file - daemon-15645.out.log -----
:sdks:python:integrationTest (Thread[Execution worker for ':',5,main]) completed. Took 6 mins
5.995 secs.

FAILURE: Build failed with an exception.

* What went wrong:
Execution failed for task ':sdks:python:integrationTest'.
> Process 'command 'sh'' finished with non-zero exit value 143

* Try:
Run with --stacktrace option to get the stack trace. Run with --debug option to get more log
output. Run with --scan to get full insights.

* Get more help at https://help.gradle.org

Deprecated Gradle features were used in this build, making it incompatible with Gradle 6.0.
Use '--warning-mode all' to show the individual deprecation warnings.
See https://docs.gradle.org/5.2.1/userguide/command_line_interface.html#sec:command_line_warnings

BUILD FAILED in 6m 47s
4 actionable tasks: 4 executed
Daemon vm is shutting down... The daemon has exited normally or was terminated in response
to a user interrupt.
----- End of the daemon log -----


FAILURE: Build failed with an exception.

* What went wrong:
Gradle build daemon disappeared unexpectedly (it may have been killed or may have crashed)

* Try:
Run with --stacktrace option to get the stack trace. Run with --debug option to get more log
output. Run with --scan to get full insights.

* Get more help at https://help.gradle.org

2019-07-01 06:22:02,264 b6328796 MainThread beam_integration_benchmark(1/1) ERROR    Error
during benchmark beam_integration_benchmark
Traceback (most recent call last):
  File "<https://builds.apache.org/job/beam_PerformanceTests_WordCountIT_Py27/ws/PerfKitBenchmarker/perfkitbenchmarker/pkb.py",>
line 760, in RunBenchmark
    DoRunPhase(spec, collector, detailed_timer)
  File "<https://builds.apache.org/job/beam_PerformanceTests_WordCountIT_Py27/ws/PerfKitBenchmarker/perfkitbenchmarker/pkb.py",>
line 609, in DoRunPhase
    samples = spec.BenchmarkRun(spec)
  File "<https://builds.apache.org/job/beam_PerformanceTests_WordCountIT_Py27/ws/PerfKitBenchmarker/perfkitbenchmarker/linux_benchmarks/beam_integration_benchmark.py",>
line 160, in Run
    job_type=job_type)
  File "<https://builds.apache.org/job/beam_PerformanceTests_WordCountIT_Py27/ws/PerfKitBenchmarker/perfkitbenchmarker/providers/gcp/gcp_dpb_dataflow.py",>
line 90, in SubmitJob
    assert retcode == 0, "Integration Test Failed."
AssertionError: Integration Test Failed.
2019-07-01 06:22:02,265 b6328796 MainThread beam_integration_benchmark(1/1) INFO     Cleaning
up benchmark beam_integration_benchmark
2019-07-01 06:22:02,268 b6328796 MainThread beam_integration_benchmark(1/1) ERROR    Exception
running benchmark
Traceback (most recent call last):
  File "<https://builds.apache.org/job/beam_PerformanceTests_WordCountIT_Py27/ws/PerfKitBenchmarker/perfkitbenchmarker/pkb.py",>
line 903, in RunBenchmarkTask
    RunBenchmark(spec, collector)
  File "<https://builds.apache.org/job/beam_PerformanceTests_WordCountIT_Py27/ws/PerfKitBenchmarker/perfkitbenchmarker/pkb.py",>
line 760, in RunBenchmark
    DoRunPhase(spec, collector, detailed_timer)
  File "<https://builds.apache.org/job/beam_PerformanceTests_WordCountIT_Py27/ws/PerfKitBenchmarker/perfkitbenchmarker/pkb.py",>
line 609, in DoRunPhase
    samples = spec.BenchmarkRun(spec)
  File "<https://builds.apache.org/job/beam_PerformanceTests_WordCountIT_Py27/ws/PerfKitBenchmarker/perfkitbenchmarker/linux_benchmarks/beam_integration_benchmark.py",>
line 160, in Run
    job_type=job_type)
  File "<https://builds.apache.org/job/beam_PerformanceTests_WordCountIT_Py27/ws/PerfKitBenchmarker/perfkitbenchmarker/providers/gcp/gcp_dpb_dataflow.py",>
line 90, in SubmitJob
    assert retcode == 0, "Integration Test Failed."
AssertionError: Integration Test Failed.
2019-07-01 06:22:02,268 b6328796 MainThread beam_integration_benchmark(1/1) ERROR    Benchmark
1/1 beam_integration_benchmark (UID: beam_integration_benchmark0) failed. Execution will continue.
2019-07-01 06:22:02,269 b6328796 MainThread beam_integration_benchmark(1/1) INFO     Benchmark
run statuses:
---------------------------------------------------------------------------------
Name                        UID                          Status  Failed Substatus
---------------------------------------------------------------------------------
beam_integration_benchmark  beam_integration_benchmark0  FAILED                  
---------------------------------------------------------------------------------
Success rate: 0.00% (0/1)
2019-07-01 06:22:02,269 b6328796 MainThread beam_integration_benchmark(1/1) INFO     Complete
logs can be found at: <https://builds.apache.org/job/beam_PerformanceTests_WordCountIT_Py27/ws/runs/b6328796/pkb.log>
2019-07-01 06:22:02,269 b6328796 MainThread beam_integration_benchmark(1/1) INFO     Completion
statuses can be found at: <https://builds.apache.org/job/beam_PerformanceTests_WordCountIT_Py27/ws/runs/b6328796/completion_statuses.json>
Build step 'Execute shell' marked build as failure

---------------------------------------------------------------------
To unsubscribe, e-mail: builds-unsubscribe@beam.apache.org
For additional commands, e-mail: builds-help@beam.apache.org


Mime
View raw message