beam-builds mailing list archives

Site index · List index
Message view « Date » · « Thread »
Top « Date » · « Thread »
From Apache Jenkins Server <jenk...@builds.apache.org>
Subject Build failed in Jenkins: beam_PostCommit_Java11_ValidatesRunner_PortabilityApi_Dataflow #736
Date Tue, 09 Jul 2019 02:32:55 GMT
See <https://builds.apache.org/job/beam_PostCommit_Java11_ValidatesRunner_PortabilityApi_Dataflow/736/display/redirect?page=changes>

Changes:

[boyuanz] Fix RestrictionTracker docstring

------------------------------------------
[...truncated 73.00 KB...]
f4aaad5a2844: Waiting
f0fa4eb58fbc: Waiting
64c151dd84f6: Waiting
cad0181e2290: Waiting
2c719774c1e1: Waiting
4230ff7f2288: Waiting
f94641f1fe1f: Waiting
ec62f19bb3aa: Waiting
9f13f036a949: Pushed
6b4c6db09ced: Pushed
e0a8c0ce90f4: Pushed
cad0181e2290: Layer already exists
a8122da79081: Layer already exists
483b6afcd302: Layer already exists
f4aaad5a2844: Layer already exists
f0fa4eb58fbc: Layer already exists
4230ff7f2288: Layer already exists
2c719774c1e1: Layer already exists
ec62f19bb3aa: Layer already exists
f94641f1fe1f: Layer already exists
64c151dd84f6: Pushed
9258aa13626e: Pushed
6f3ba8071fa1: Pushed
20190708233740: digest: sha256:12ef9b823f19f26f06451e5d86ab3e805ab4ce3f4020f0a49e3987373dafda9d
size: 3469

> Task :runners:google-cloud-dataflow-java:validatesRunnerFnApiWorkerTest

org.apache.beam.sdk.transforms.CreateTest > testCreateEmpty FAILED
    java.lang.RuntimeException at CreateTest.java:101

org.apache.beam.sdk.PipelineTest > testTupleInjectionTransform FAILED
    java.lang.RuntimeException at PipelineTest.java:344

org.apache.beam.sdk.transforms.ParDoTest$BasicTests > testParDo FAILED
    java.lang.RuntimeException at ParDoTest.java:347

org.apache.beam.sdk.transforms.ParDoTest$TimestampTests > testParDoShiftTimestamp FAILED
    java.lang.RuntimeException at ParDoTest.java:1304

org.apache.beam.sdk.transforms.CombineTest$WindowingTests > testGlobalCombineWithDefaultsAndTriggers
FAILED
    java.lang.RuntimeException at CombineTest.java:1241

org.apache.beam.sdk.transforms.ParDoTest$MultipleInputsAndOutputTests > testParDoWithOnlyTaggedOutput
FAILED
    java.lang.RuntimeException at ParDoTest.java:688

org.apache.beam.sdk.values.PCollectionTupleTest > testComposePCollectionTuple FAILED
    java.lang.RuntimeException at PCollectionTupleTest.java:106

org.apache.beam.sdk.transforms.FlattenTest > testFlattenIterablesCollections FAILED
    java.lang.RuntimeException at FlattenTest.java:297

org.apache.beam.sdk.transforms.ReifyTimestampsTest > extractFromValuesWhenValueTimestampedLaterSucceeds
FAILED
    java.lang.RuntimeException at ReifyTimestampsTest.java:128

org.apache.beam.sdk.transforms.windowing.WindowingTest > testMergingWindowing FAILED
    java.lang.RuntimeException at WindowingTest.java:168

org.apache.beam.sdk.transforms.windowing.WindowTest > testTimestampCombinerEndOfWindow
FAILED
    java.lang.RuntimeException at WindowTest.java:498

org.apache.beam.sdk.transforms.KvSwapTest > testKvSwap FAILED
    java.lang.RuntimeException at KvSwapTest.java:77

org.apache.beam.sdk.transforms.KeysTest > testKeys FAILED
    java.lang.RuntimeException at KeysTest.java:60

org.apache.beam.sdk.transforms.WithTimestampsTest > withTimestampsShouldApplyTimestamps
FAILED
    java.lang.RuntimeException at WithTimestampsTest.java:78

org.apache.beam.sdk.transforms.ImpulseTest > testImpulse FAILED
    java.lang.RuntimeException at ImpulseTest.java:47

org.apache.beam.sdk.transforms.ReshuffleTest > testReshuffleAfterSessionsAndGroupByKey
FAILED
    java.lang.RuntimeException at ReshuffleTest.java:169

org.apache.beam.sdk.transforms.ParDoTest$StateTests > testCombiningState FAILED
    java.lang.RuntimeException at ParDoTest.java:1925

org.apache.beam.sdk.transforms.ViewTest > testMapAsEntrySetSideInput FAILED
    java.lang.RuntimeException at ViewTest.java:977

org.apache.beam.sdk.transforms.ParDoTest$LifecycleTests > testWindowingInStartAndFinishBundle
FAILED
    java.lang.RuntimeException at ParDoTest.java:1221

org.apache.beam.sdk.testing.PAssertTest > testAssertionSiteIsCapturedWithMessage FAILED
    java.lang.AssertionError at PAssertTest.java:527

org.apache.beam.sdk.transforms.GroupByKeyTest$BasicTests > testLargeKeys1MB FAILED
    java.lang.RuntimeException at GroupByKeyTest.java:365

org.apache.beam.sdk.transforms.ParDoTest$StateCoderInferenceTests > testCombiningStateCoderInference
FAILED
    java.lang.RuntimeException at ParDoTest.java:2369

org.apache.beam.sdk.transforms.join.CoGroupByKeyTest > testCoGroupByKey FAILED
    java.lang.RuntimeException at CoGroupByKeyTest.java:296

org.apache.beam.sdk.transforms.GroupByKeyTest$WindowTests > testGroupByKeyMergingWindows
FAILED
    java.lang.RuntimeException at GroupByKeyTest.java:480

org.apache.beam.sdk.transforms.CombineTest$CombineWithContextTests > testSimpleCombineWithContext
FAILED
    java.lang.RuntimeException at CombineTest.java:997

org.apache.beam.sdk.transforms.ParDoTest$BasicTests > testPipelineOptionsParameter FAILED
    java.lang.RuntimeException at ParDoTest.java:545

org.apache.beam.sdk.transforms.ParDoTest$TimestampTests > testParDoShiftTimestampUnlimited
FAILED
    java.lang.RuntimeException at ParDoTest.java:1393

org.apache.beam.sdk.transforms.CreateTest > testCreateWithKVVoidType FAILED
    java.lang.RuntimeException at CreateTest.java:337

org.apache.beam.sdk.PipelineTest > testIdentityTransform FAILED
    java.lang.RuntimeException at PipelineTest.java:294

org.apache.beam.sdk.transforms.ReifyTimestampsTest > extractFromValuesSucceeds FAILED
    java.lang.RuntimeException at ReifyTimestampsTest.java:92

org.apache.beam.sdk.transforms.windowing.WindowTest > testTimestampCombinerDefault FAILED
    java.lang.RuntimeException at WindowTest.java:468

org.apache.beam.sdk.transforms.windowing.WindowingTest > testWindowPreservation FAILED
    java.lang.RuntimeException at WindowingTest.java:197

org.apache.beam.sdk.transforms.WithTimestampsTest > withTimestampsBackwardsInTimeAndWithAllowedTimestampSkewShouldSucceed
FAILED
    java.lang.RuntimeException at WithTimestampsTest.java:142

org.apache.beam.sdk.transforms.ReshuffleTest > testReshuffleAfterFixedWindows FAILED
    java.lang.RuntimeException at ReshuffleTest.java:231

org.apache.beam.sdk.testing.PAssertTest > testEmptyFalse FAILED
    java.lang.AssertionError at PAssertTest.java:487

org.apache.beam.sdk.transforms.join.CoGroupByKeyTest > testCoGroupByKeyGetOnly FAILED
    java.lang.RuntimeException at CoGroupByKeyTest.java:139

org.apache.beam.sdk.transforms.ParDoTest$StateTests > testValueStateSameId FAILED
    java.lang.RuntimeException at ParDoTest.java:1671

org.apache.beam.sdk.transforms.KeysTest > testKeysEmpty FAILED
    java.lang.RuntimeException at KeysTest.java:73

org.apache.beam.sdk.transforms.CombineTest$CombineWithContextTests > testSimpleCombineWithContextEmpty
FAILED
    java.lang.RuntimeException at CombineTest.java:1007

org.apache.beam.sdk.transforms.GroupByKeyTest$BasicTests > testTimestampCombinerLatest
FAILED
    java.lang.RuntimeException at GroupByKeyTest.java:290

org.apache.beam.sdk.transforms.ViewTest > testMultimapSideInput FAILED
    java.lang.RuntimeException at ViewTest.java:543

org.apache.beam.sdk.transforms.GroupByKeyTest$WindowTests > testGroupByKeyMultipleWindows
FAILED
    java.lang.RuntimeException at GroupByKeyTest.java:452

org.apache.beam.sdk.transforms.ParDoTest$BasicTests > testParDoEmpty FAILED
    java.lang.RuntimeException at ParDoTest.java:363

org.apache.beam.sdk.transforms.CreateTest > testCreateWithNullsAndValues FAILED
    java.lang.RuntimeException at CreateTest.java:161

org.apache.beam.sdk.PipelineTest > testTupleProjectionTransform FAILED
    java.lang.RuntimeException at PipelineTest.java:316

org.apache.beam.sdk.transforms.ReshuffleTest > testReshuffleAfterFixedWindowsAndGroupByKey
FAILED
    java.lang.RuntimeException at ReshuffleTest.java:190

org.apache.beam.sdk.transforms.windowing.WindowingTest > testNonPartitioningWindowing FAILED
    java.lang.RuntimeException at WindowingTest.java:150

org.apache.beam.sdk.testing.PAssertTest > testIsEqualTo FAILED
    java.lang.RuntimeException at PAssertTest.java:309

org.apache.beam.sdk.transforms.WithTimestampsTest > withTimestampsLambdaShouldApplyTimestamps
FAILED
    java.lang.RuntimeException at WithTimestampsTest.java:205

org.apache.beam.sdk.transforms.join.CoGroupByKeyTest > testCoGroupByKeyHandleResults FAILED
    java.lang.RuntimeException at CoGroupByKeyTest.java:466

org.apache.beam.sdk.transforms.ReifyTimestampsTest > inValuesSucceeds FAILED
    java.lang.RuntimeException at ReifyTimestampsTest.java:60

org.apache.beam.sdk.transforms.ParDoTest$StateTests > testValueStateSimple FAILED
    java.lang.RuntimeException at ParDoTest.java:1427

org.apache.beam.sdk.transforms.FlattenTest > testEmptyFlattenAsSideInput FAILED
    java.lang.RuntimeException at FlattenTest.java:211

org.apache.beam.sdk.transforms.CombineTest$WindowingTests > testCombineGloballyLambda FAILED
    java.lang.RuntimeException at CombineTest.java:1423

org.apache.beam.sdk.transforms.ParDoTest$MultipleInputsAndOutputTests > testMultiOutputParDoWithSideInputs
FAILED
    java.lang.RuntimeException at ParDoTest.java:810

org.apache.beam.sdk.transforms.ParDoTest$MultipleInputsAndOutputTests > testSideInputsWithMultipleWindows
FAILED
    java.lang.RuntimeException at ParDoTest.java:896

org.apache.beam.sdk.transforms.ParDoTest$MultipleInputsAndOutputTests > testParDoEmptyWithTaggedOutput
FAILED
    java.lang.RuntimeException at ParDoTest.java:635

org.apache.beam.sdk.transforms.CombineTest$WindowingTests > testCombineGloballyAsSingletonView
FAILED
    java.lang.RuntimeException at CombineTest.java:1358

org.apache.beam.sdk.transforms.ParDoTest$StateTests > testBagStateSideInput FAILED
    java.lang.RuntimeException at ParDoTest.java:2012

org.apache.beam.sdk.testing.PAssertTest > testNotEqualTo FAILED
    java.lang.RuntimeException at PAssertTest.java:356

org.apache.beam.sdk.transforms.ViewTest > testWindowedIterableSideInput FAILED
    java.lang.RuntimeException at ViewTest.java:442

156 tests completed, 61 failed, 2 skipped

> Task :runners:google-cloud-dataflow-java:validatesRunnerFnApiWorkerTest FAILED

> Task :runners:google-cloud-dataflow-java:cleanUpDockerImages
Untagged: us.gcr.io/apache-beam-testing/java-postcommit-it/java:20190708233740
Untagged: us.gcr.io/apache-beam-testing/java-postcommit-it/java@sha256:12ef9b823f19f26f06451e5d86ab3e805ab4ce3f4020f0a49e3987373dafda9d
Digests:
- us.gcr.io/apache-beam-testing/java-postcommit-it/java@sha256:12ef9b823f19f26f06451e5d86ab3e805ab4ce3f4020f0a49e3987373dafda9d
  Associated tags:
 - 20190708233740
Tags:
- us.gcr.io/apache-beam-testing/java-postcommit-it/java:20190708233740
Deleted [us.gcr.io/apache-beam-testing/java-postcommit-it/java:20190708233740].
Deleted [us.gcr.io/apache-beam-testing/java-postcommit-it/java@sha256:12ef9b823f19f26f06451e5d86ab3e805ab4ce3f4020f0a49e3987373dafda9d].

FAILURE: Build failed with an exception.

* What went wrong:
Execution failed for task ':runners:google-cloud-dataflow-java:validatesRunnerFnApiWorkerTest'.
> There were failing tests. See the report at: file://<https://builds.apache.org/job/beam_PostCommit_Java11_ValidatesRunner_PortabilityApi_Dataflow/ws/src/runners/google-cloud-dataflow-java/build/reports/tests/validatesRunnerFnApiWorkerTest/index.html>

* Try:
Run with --stacktrace option to get the stack trace. Run with --info or --debug option to
get more log output. Run with --scan to get full insights.

* Get more help at https://help.gradle.org

Deprecated Gradle features were used in this build, making it incompatible with Gradle 6.0.
Use '--warning-mode all' to show the individual deprecation warnings.
See https://docs.gradle.org/5.2.1/userguide/command_line_interface.html#sec:command_line_warnings

BUILD FAILED in 2h 55m 24s
79 actionable tasks: 59 executed, 19 from cache, 1 up-to-date

Publishing build scan...
https://gradle.com/s/iwuhl4gmxr322

Build step 'Invoke Gradle script' changed build result to FAILURE
Build step 'Invoke Gradle script' marked build as failure

---------------------------------------------------------------------
To unsubscribe, e-mail: builds-unsubscribe@beam.apache.org
For additional commands, e-mail: builds-help@beam.apache.org


Mime
View raw message