beam-builds mailing list archives

Site index · List index
Message view « Date » · « Thread »
Top « Date » · « Thread »
From Apache Jenkins Server <jenk...@builds.apache.org>
Subject Build failed in Jenkins: beam_PostCommit_Java_ValidatesRunner_PortabilityApi_Dataflow #1742
Date Tue, 23 Jul 2019 09:58:14 GMT
See <https://builds.apache.org/job/beam_PostCommit_Java_ValidatesRunner_PortabilityApi_Dataflow/1742/display/redirect>

------------------------------------------
[...truncated 49.08 KB...]

See: https://cloud.google.com/container-registry/docs/support/deprecation-notices#gcloud-docker

The push refers to repository [us.gcr.io/apache-beam-testing/java-postcommit-it/java]
940b4fb09470: Preparing
1313e4a1bd19: Preparing
8d0c7489f10f: Preparing
150134b77bf0: Preparing
f7d12d471667: Preparing
f350d0146bb3: Preparing
e38df31d449c: Preparing
af5ae4841776: Preparing
b17cc31e431b: Preparing
12cb127eee44: Preparing
604829a174eb: Preparing
fbb641a8b943: Preparing
f350d0146bb3: Waiting
fbb641a8b943: Waiting
e38df31d449c: Waiting
af5ae4841776: Waiting
604829a174eb: Waiting
b17cc31e431b: Waiting
12cb127eee44: Waiting
150134b77bf0: Layer already exists
8d0c7489f10f: Layer already exists
f7d12d471667: Layer already exists
940b4fb09470: Layer already exists
1313e4a1bd19: Layer already exists
e38df31d449c: Layer already exists
af5ae4841776: Layer already exists
b17cc31e431b: Layer already exists
f350d0146bb3: Layer already exists
12cb127eee44: Layer already exists
fbb641a8b943: Layer already exists
604829a174eb: Layer already exists
20190403225916: digest: sha256:113fa82e6d8fced5253734660525f85a82b72d7b5313e19474602d26be100c80
size: 2841
390c371de3d5: Preparing
307bb83b3ba0: Preparing
ac8285d40836: Preparing
dfd8c5ea34c4: Preparing
59a9ca5606e4: Preparing
05c39d326d02: Preparing
cad0181e2290: Preparing
a8122da79081: Preparing
483b6afcd302: Preparing
f4aaad5a2844: Preparing
f0fa4eb58fbc: Preparing
4230ff7f2288: Preparing
2c719774c1e1: Preparing
ec62f19bb3aa: Preparing
f94641f1fe1f: Preparing
f94641f1fe1f: Waiting
05c39d326d02: Waiting
cad0181e2290: Waiting
a8122da79081: Waiting
483b6afcd302: Waiting
2c719774c1e1: Waiting
ec62f19bb3aa: Waiting
f0fa4eb58fbc: Waiting
f4aaad5a2844: Waiting
4230ff7f2288: Waiting
390c371de3d5: Layer already exists
dfd8c5ea34c4: Layer already exists
307bb83b3ba0: Layer already exists
59a9ca5606e4: Layer already exists
ac8285d40836: Layer already exists
05c39d326d02: Layer already exists
cad0181e2290: Layer already exists
a8122da79081: Layer already exists
f4aaad5a2844: Layer already exists
483b6afcd302: Layer already exists
4230ff7f2288: Layer already exists
f0fa4eb58fbc: Layer already exists
2c719774c1e1: Layer already exists
ec62f19bb3aa: Layer already exists
f94641f1fe1f: Layer already exists
20190523000039: digest: sha256:498c15976a3790d5c9b8177f63ffaeff26640edccd005aa933276431cdc1ab72
size: 3469
41191def6d57: Preparing
8cd0d37a39f7: Preparing
0b2c1838dc45: Preparing
f466e5e60db1: Preparing
11ce9cef4c3e: Preparing
67b7f0d76e49: Preparing
cad0181e2290: Preparing
a8122da79081: Preparing
483b6afcd302: Preparing
f4aaad5a2844: Preparing
f0fa4eb58fbc: Preparing
4230ff7f2288: Preparing
2c719774c1e1: Preparing
ec62f19bb3aa: Preparing
f94641f1fe1f: Preparing
a8122da79081: Waiting
ec62f19bb3aa: Waiting
483b6afcd302: Waiting
4230ff7f2288: Waiting
f0fa4eb58fbc: Waiting
67b7f0d76e49: Waiting
f94641f1fe1f: Waiting
f4aaad5a2844: Waiting
2c719774c1e1: Waiting
cad0181e2290: Waiting
0b2c1838dc45: Layer already exists
f466e5e60db1: Layer already exists
11ce9cef4c3e: Layer already exists
41191def6d57: Layer already exists
8cd0d37a39f7: Layer already exists
cad0181e2290: Layer already exists
67b7f0d76e49: Layer already exists
f4aaad5a2844: Layer already exists
483b6afcd302: Layer already exists
a8122da79081: Layer already exists
f0fa4eb58fbc: Layer already exists
4230ff7f2288: Layer already exists
f94641f1fe1f: Layer already exists
2c719774c1e1: Layer already exists
ec62f19bb3aa: Layer already exists
20190718210530: digest: sha256:ff0614309e21f203170b5aa1f271cfb02737f188a4ae9d0114ac1eca89583df2
size: 3469
5597852b8848: Preparing
fb128239d3f7: Preparing
8906a6817a2a: Preparing
5196840c2b8c: Preparing
a29ad0a9a798: Preparing
8798237f2977: Preparing
cad0181e2290: Preparing
a8122da79081: Preparing
483b6afcd302: Preparing
f4aaad5a2844: Preparing
f0fa4eb58fbc: Preparing
4230ff7f2288: Preparing
2c719774c1e1: Preparing
8798237f2977: Waiting
ec62f19bb3aa: Preparing
f94641f1fe1f: Preparing
cad0181e2290: Waiting
a8122da79081: Waiting
f4aaad5a2844: Waiting
f0fa4eb58fbc: Waiting
4230ff7f2288: Waiting
f94641f1fe1f: Waiting
2c719774c1e1: Waiting
ec62f19bb3aa: Waiting
483b6afcd302: Waiting
5597852b8848: Layer already exists
a29ad0a9a798: Layer already exists
483b6afcd302: Layer already exists
4230ff7f2288: Layer already exists
cad0181e2290: Layer already exists
f4aaad5a2844: Layer already exists
8906a6817a2a: Layer already exists
ec62f19bb3aa: Layer already exists
a8122da79081: Layer already exists
f0fa4eb58fbc: Layer already exists
2c719774c1e1: Layer already exists
f94641f1fe1f: Layer already exists
fb128239d3f7: Layer already exists
5196840c2b8c: Layer already exists
8798237f2977: Layer already exists
20190720120025: digest: sha256:26d0c97694a414f548d123b32d9809caf880bff70d20a8b83057dfa9ace22632
size: 3469
ea00e6195ff1: Preparing
5ec91e360a7b: Preparing
daa0fe02bb1c: Preparing
fe33b28c118c: Preparing
e93da872888b: Preparing
a0861bbb1ae5: Preparing
f7d12d471667: Preparing
f350d0146bb3: Preparing
e38df31d449c: Preparing
af5ae4841776: Preparing
b17cc31e431b: Preparing
12cb127eee44: Preparing
604829a174eb: Preparing
fbb641a8b943: Preparing
fbb641a8b943: Waiting
f350d0146bb3: Waiting
e38df31d449c: Waiting
a0861bbb1ae5: Waiting
f7d12d471667: Waiting
af5ae4841776: Waiting
12cb127eee44: Waiting
604829a174eb: Waiting
b17cc31e431b: Waiting
e93da872888b: Pushed
5ec91e360a7b: Pushed
daa0fe02bb1c: Pushed
e38df31d449c: Layer already exists
f7d12d471667: Layer already exists
af5ae4841776: Layer already exists
b17cc31e431b: Layer already exists
12cb127eee44: Layer already exists
604829a174eb: Layer already exists
f350d0146bb3: Layer already exists
fbb641a8b943: Layer already exists
a0861bbb1ae5: Pushed
ea00e6195ff1: Pushed
fe33b28c118c: Pushed
20190723060031: digest: sha256:db91115813f3528a91164c93f7ac2ed571be1282a8886a8b4e6a5e5e592154bc
size: 3262

> Task :runners:google-cloud-dataflow-java:validatesRunnerFnApiWorkerTest

org.apache.beam.sdk.transforms.ViewTest > testSingletonSideInput FAILED
    java.lang.RuntimeException at ViewTest.java:113

156 tests completed, 1 failed, 2 skipped

> Task :runners:google-cloud-dataflow-java:validatesRunnerFnApiWorkerTest FAILED

> Task :runners:google-cloud-dataflow-java:cleanUpDockerImages FAILED
Error: No such image: us.gcr.io/apache-beam-testing/java-postcommit-it/java:20190723060031

FAILURE: Build completed with 2 failures.

1: Task failed with an exception.
-----------
* What went wrong:
Execution failed for task ':runners:google-cloud-dataflow-java:validatesRunnerFnApiWorkerTest'.
> There were failing tests. See the report at: file://<https://builds.apache.org/job/beam_PostCommit_Java_ValidatesRunner_PortabilityApi_Dataflow/ws/src/runners/google-cloud-dataflow-java/build/reports/tests/validatesRunnerFnApiWorkerTest/index.html>

* Try:
Run with --stacktrace option to get the stack trace. Run with --info or --debug option to
get more log output. Run with --scan to get full insights.
==============================================================================

2: Task failed with an exception.
-----------
* Where:
Build file '<https://builds.apache.org/job/beam_PostCommit_Java_ValidatesRunner_PortabilityApi_Dataflow/ws/src/runners/google-cloud-dataflow-java/build.gradle'>
line: 511

* What went wrong:
Execution failed for task ':runners:google-cloud-dataflow-java:cleanUpDockerImages'.
> Process 'command 'docker'' finished with non-zero exit value 1

* Try:
Run with --stacktrace option to get the stack trace. Run with --info or --debug option to
get more log output. Run with --scan to get full insights.
==============================================================================

* Get more help at https://help.gradle.org

Deprecated Gradle features were used in this build, making it incompatible with Gradle 6.0.
Use '--warning-mode all' to show the individual deprecation warnings.
See https://docs.gradle.org/5.2.1/userguide/command_line_interface.html#sec:command_line_warnings

BUILD FAILED in 3h 57m 58s
79 actionable tasks: 59 executed, 19 from cache, 1 up-to-date

Publishing build scan...
https://gradle.com/s/rmh3a4euzxtr4

Build step 'Invoke Gradle script' changed build result to FAILURE
Build step 'Invoke Gradle script' marked build as failure

---------------------------------------------------------------------
To unsubscribe, e-mail: builds-unsubscribe@beam.apache.org
For additional commands, e-mail: builds-help@beam.apache.org


Mime
View raw message