beam-builds mailing list archives

Site index · List index
Message view « Date » · « Thread »
Top « Date » · « Thread »
From Apache Jenkins Server <jenk...@builds.apache.org>
Subject Build failed in Jenkins: beam_PostCommit_Java11_ValidatesRunner_Dataflow #721
Date Mon, 08 Jul 2019 20:42:49 GMT
See <https://builds.apache.org/job/beam_PostCommit_Java11_ValidatesRunner_Dataflow/721/display/redirect>

------------------------------------------
[...truncated 18.98 KB...]
> Task :sdks:java:core:shadowJar
> Task :sdks:java:extensions:protobuf:extractIncludeProto
> Task :sdks:java:extensions:protobuf:generateProto NO-SOURCE
> Task :vendor:sdks-java-extensions-protobuf:compileJava FROM-CACHE
> Task :vendor:sdks-java-extensions-protobuf:classes UP-TO-DATE
> Task :sdks:java:fn-execution:compileJava FROM-CACHE
> Task :sdks:java:fn-execution:classes UP-TO-DATE
> Task :sdks:java:fn-execution:jar
> Task :sdks:java:extensions:protobuf:compileJava FROM-CACHE
> Task :sdks:java:extensions:protobuf:classes UP-TO-DATE
> Task :sdks:java:extensions:protobuf:jar
> Task :sdks:java:extensions:google-cloud-platform-core:compileJava FROM-CACHE
> Task :sdks:java:extensions:google-cloud-platform-core:classes UP-TO-DATE
> Task :sdks:java:extensions:google-cloud-platform-core:jar
> Task :runners:core-construction-java:compileJava FROM-CACHE
> Task :runners:core-construction-java:classes UP-TO-DATE
> Task :runners:core-construction-java:jar
> Task :sdks:java:io:google-cloud-platform:compileJava FROM-CACHE
> Task :sdks:java:io:google-cloud-platform:classes UP-TO-DATE
> Task :sdks:java:io:google-cloud-platform:jar
> Task :runners:core-java:compileJava FROM-CACHE
> Task :runners:core-java:classes UP-TO-DATE
> Task :runners:google-cloud-dataflow-java:compileJava FROM-CACHE
> Task :runners:google-cloud-dataflow-java:classes
> Task :runners:google-cloud-dataflow-java:jar
> Task :runners:core-java:jar
> Task :vendor:sdks-java-extensions-protobuf:shadowJar
> Task :sdks:java:harness:compileJava FROM-CACHE
> Task :sdks:java:harness:classes UP-TO-DATE
> Task :sdks:java:core:compileTestJava FROM-CACHE
> Task :sdks:java:harness:jar
> Task :sdks:java:core:testClasses
> Task :sdks:java:core:shadowTestJar
> Task :sdks:java:harness:shadowJar
> Task :runners:java-fn-execution:compileJava FROM-CACHE
> Task :runners:java-fn-execution:classes UP-TO-DATE
> Task :runners:java-fn-execution:jar
> Task :runners:google-cloud-dataflow-java:worker:legacy-worker:compileJava FROM-CACHE
> Task :runners:google-cloud-dataflow-java:worker:legacy-worker:classes UP-TO-DATE
> Task :runners:google-cloud-dataflow-java:worker:legacy-worker:shadowJar
> Task :runners:google-cloud-dataflow-java:validatesRunnerLegacyWorkerJava11Test

org.apache.beam.sdk.PipelineTest > testTupleProjectionTransform FAILED
    java.lang.RuntimeException at PipelineTest.java:316

org.apache.beam.sdk.PipelineTest > testMultipleApply FAILED
    java.lang.RuntimeException at PipelineTest.java:228

org.apache.beam.sdk.transforms.CombineTest$BasicTests > testBinaryCombinePerKeyInstanceMethodReference
FAILED
    java.lang.RuntimeException at CombineTest.java:953

org.apache.beam.sdk.transforms.ParDoTest$StateTests > testValueStateSameId FAILED
    java.lang.RuntimeException at ParDoTest.java:1671

org.apache.beam.sdk.transforms.ParDoTest$BasicTests > testParDoEmpty FAILED
    java.lang.RuntimeException at ParDoTest.java:363

org.apache.beam.sdk.transforms.CombineFnsTest > testComposedCombineWithContext FAILED
    java.lang.RuntimeException at CombineFnsTest.java:208

org.apache.beam.sdk.transforms.CombineTest$BasicTests > testCombinePerKeyInstanceMethodReference
FAILED
    java.lang.RuntimeException at CombineTest.java:939

org.apache.beam.sdk.transforms.GroupByKeyTest$BasicTests > testGroupByKeyEmpty FAILED
    java.lang.RuntimeException at GroupByKeyTest.java:145

org.apache.beam.sdk.transforms.ReifyTimestampsTest > inValuesSucceeds FAILED
    java.lang.RuntimeException at ReifyTimestampsTest.java:60

org.apache.beam.sdk.transforms.CombineTest$WindowingTests > testCombineGloballyAsSingletonView
FAILED
    java.lang.RuntimeException at CombineTest.java:1358

org.apache.beam.sdk.transforms.ReshuffleTest > testReshuffleAfterFixedWindowsAndGroupByKey
FAILED
    java.lang.RuntimeException at ReshuffleTest.java:190

org.apache.beam.sdk.transforms.GroupByKeyTest$BasicTests > testTimestampCombinerEarliest
FAILED
    java.lang.RuntimeException at GroupByKeyTest.java:270

org.apache.beam.sdk.transforms.GroupByKeyTest$BasicTests > testGroupByKey FAILED
    java.lang.RuntimeException at GroupByKeyTest.java:128

org.apache.beam.sdk.transforms.ViewTest > testEmptyIterableSideInput FAILED
    java.lang.RuntimeException at ViewTest.java:470

org.apache.beam.sdk.transforms.ParDoTest$TimerTests > testTimerReceivedInOriginalWindow
FAILED
    java.lang.RuntimeException at ParDoTest.java:2669

org.apache.beam.sdk.transforms.windowing.WindowTest > testMergingCustomWindows FAILED
    java.lang.RuntimeException at WindowTest.java:632

org.apache.beam.sdk.testing.PAssertTest > testIsEqualTo FAILED
    java.lang.RuntimeException at PAssertTest.java:309

org.apache.beam.sdk.transforms.ParDoSchemaTest > testSchemaFieldSelectionNested FAILED
    java.lang.RuntimeException at ParDoSchemaTest.java:624

org.apache.beam.sdk.transforms.CombineTest$WindowingTests > testWindowedCombineEmpty FAILED
    java.lang.RuntimeException at CombineTest.java:1332

org.apache.beam.sdk.transforms.join.CoGroupByKeyTest > testCoGroupByKeyHandleResults FAILED
    java.lang.RuntimeException at CoGroupByKeyTest.java:466

org.apache.beam.sdk.transforms.ViewTest > testSideInputWithNestedIterables FAILED
    java.lang.RuntimeException at ViewTest.java:1539

org.apache.beam.sdk.transforms.ParDoTest$TimerTests > testEventTimeTimerBounded FAILED
    java.lang.RuntimeException at ParDoTest.java:2537

org.apache.beam.sdk.transforms.windowing.WindowTest > testNoWindowFnDoesNotReassignWindows
FAILED
    java.lang.RuntimeException at WindowTest.java:434

org.apache.beam.sdk.testing.PAssertTest > testEmpty FAILED
    java.lang.RuntimeException at PAssertTest.java:452

org.apache.beam.sdk.transforms.GroupByKeyTest$WindowTests > testGroupByKeyAndWindows FAILED
    java.lang.RuntimeException at GroupByKeyTest.java:422

org.apache.beam.sdk.transforms.ParDoTest$TimerTests > testEventTimeTimerAlignBounded FAILED
    java.lang.RuntimeException at ParDoTest.java:2620

org.apache.beam.sdk.transforms.windowing.WindowTest > testMergingCustomWindowsKeyedCollection
FAILED
    java.lang.RuntimeException at WindowTest.java:659

org.apache.beam.sdk.testing.PAssertTest > testWindowedContainsInAnyOrder FAILED
    java.lang.RuntimeException at PAssertTest.java:442

org.apache.beam.sdk.transforms.ParDoTest$MultipleInputsAndOutputTests > testSideInputsWithMultipleWindows
FAILED
    java.lang.RuntimeException at ParDoTest.java:896

org.apache.beam.sdk.transforms.FlattenTest > testFlattenIterablesEmpty FAILED
    java.lang.RuntimeException at FlattenTest.java:312

org.apache.beam.sdk.transforms.WithTimestampsTest > withTimestampsLambdaShouldApplyTimestamps
FAILED
    java.lang.RuntimeException at WithTimestampsTest.java:205

org.apache.beam.sdk.transforms.CombineTest$WindowingTests > testSlidingWindowsCombine FAILED
    java.lang.RuntimeException at CombineTest.java:1163

org.apache.beam.sdk.transforms.ParDoSchemaTest > testSchemaFieldSelectionUnboxing FAILED
    java.lang.RuntimeException at ParDoSchemaTest.java:533

org.apache.beam.sdk.transforms.ViewTest > testListSideInput FAILED
    java.lang.RuntimeException at ViewTest.java:241

org.apache.beam.sdk.transforms.join.CoGroupByKeyTest > testCoGroupByKeyWithWindowing FAILED
    java.lang.RuntimeException at CoGroupByKeyTest.java:494

org.apache.beam.sdk.transforms.FlattenTest > testFlattenIterablesLists FAILED
    java.lang.RuntimeException at FlattenTest.java:265

org.apache.beam.sdk.transforms.CombineTest$WindowingTests > testSessionsCombine FAILED
    java.lang.RuntimeException at CombineTest.java:1267

org.apache.beam.sdk.transforms.ParDoSchemaTest > testSchemaFieldDescriptorSelectionUnboxing
FAILED
    java.lang.RuntimeException at ParDoSchemaTest.java:574

org.apache.beam.sdk.transforms.CombineTest$BasicTests > testBasicCombine FAILED
    java.lang.RuntimeException at CombineTest.java:680

org.apache.beam.sdk.transforms.ParDoSchemaTest > testInferredSchemaPipeline FAILED
    java.lang.RuntimeException at ParDoSchemaTest.java:396

org.apache.beam.sdk.testing.PAssertTest > testPAssertEqualsSingletonFalse FAILED
    java.lang.AssertionError at PAssertTest.java:370

org.apache.beam.sdk.transforms.CombineTest$BasicTests > testCombinePerKeyLambda FAILED
    java.lang.RuntimeException at CombineTest.java:911

org.apache.beam.sdk.transforms.ParDoTest$TimerTests > testGbkFollowedByUserTimers FAILED
    java.lang.RuntimeException at ParDoTest.java:2580

org.apache.beam.sdk.transforms.FlattenTest > testFlattenInputMultipleCopies FAILED
    java.lang.RuntimeException at FlattenTest.java:162

org.apache.beam.sdk.transforms.ViewTest > testMapSideInput FAILED
    java.lang.RuntimeException at ViewTest.java:945

org.apache.beam.sdk.transforms.ParDoSchemaTest > testFieldAccessSchemaPipeline FAILED
    java.lang.RuntimeException at ParDoSchemaTest.java:319

org.apache.beam.sdk.transforms.ParDoTest$TimerTests > testOutOfBoundsEventTimeTimer FAILED
    java.lang.RuntimeException at ParDoTest.java:2907

org.apache.beam.sdk.transforms.ViewTest > testWindowedSideInputFixedToFixedWithDefault
FAILED
    java.lang.RuntimeException at ViewTest.java:1455

org.apache.beam.sdk.transforms.FlattenTest > testFlattenPCollectionsEmpty FAILED
    java.lang.RuntimeException at FlattenTest.java:130

org.apache.beam.sdk.transforms.ParDoSchemaTest > testSchemaConversionPipeline FAILED
    java.lang.RuntimeException at ParDoSchemaTest.java:444

org.apache.beam.sdk.transforms.CombineTest$WindowingTests > testCombineGloballyInstanceMethodReference
FAILED
    java.lang.RuntimeException at CombineTest.java:1435

org.apache.beam.sdk.transforms.ViewTest > testWindowedMapSideInputWithNonDeterministicKeyCoder
FAILED
    java.lang.RuntimeException at ViewTest.java:1144

org.apache.beam.sdk.transforms.ParDoSchemaTest > testReadAndWriteWithSchemaRegistry FAILED
    java.lang.RuntimeException at ParDoSchemaTest.java:285

org.apache.beam.sdk.transforms.ParDoSchemaTest > testReadAndWriteMultiOutput FAILED
    java.lang.RuntimeException at ParDoSchemaTest.java:240

org.apache.beam.sdk.transforms.ParDoTest$TimerTests > testPipelineOptionsParameterOnTimer
FAILED
    java.lang.RuntimeException at ParDoTest.java:3184

org.apache.beam.sdk.transforms.ViewTest > testWindowedSideInputFixedToGlobal FAILED
    java.lang.RuntimeException at ViewTest.java:1416

org.apache.beam.sdk.transforms.CombineTest$WindowingTests > testFixedWindowsCombine FAILED
    java.lang.RuntimeException at CombineTest.java:1062

org.apache.beam.sdk.transforms.ViewTest > testMultimapSideInputWithNonDeterministicKeyCoder
FAILED
    java.lang.RuntimeException at ViewTest.java:650

org.apache.beam.sdk.transforms.CreateTest > testCreate FAILED
    java.lang.RuntimeException at CreateTest.java:90

org.apache.beam.sdk.transforms.ParDoSchemaTest > testNestedSchema FAILED
    java.lang.RuntimeException at ParDoSchemaTest.java:483

221 tests completed, 60 failed, 2 skipped

> Task :runners:google-cloud-dataflow-java:validatesRunnerLegacyWorkerJava11Test FAILED

FAILURE: Build failed with an exception.

* What went wrong:
Execution failed for task ':runners:google-cloud-dataflow-java:validatesRunnerLegacyWorkerJava11Test'.
> There were failing tests. See the report at: file://<https://builds.apache.org/job/beam_PostCommit_Java11_ValidatesRunner_Dataflow/ws/src/runners/google-cloud-dataflow-java/build/reports/tests/validatesRunnerLegacyWorkerJava11Test/index.html>

* Try:
Run with --stacktrace option to get the stack trace. Run with --info or --debug option to
get more log output. Run with --scan to get full insights.

* Get more help at https://help.gradle.org

Deprecated Gradle features were used in this build, making it incompatible with Gradle 6.0.
Use '--warning-mode all' to show the individual deprecation warnings.
See https://docs.gradle.org/5.2.1/userguide/command_line_interface.html#sec:command_line_warnings

BUILD FAILED in 2h 42m 30s
60 actionable tasks: 42 executed, 18 from cache

Publishing build scan...
https://gradle.com/s/koh2jabymh3xm

Build step 'Invoke Gradle script' changed build result to FAILURE
Build step 'Invoke Gradle script' marked build as failure

---------------------------------------------------------------------
To unsubscribe, e-mail: builds-unsubscribe@beam.apache.org
For additional commands, e-mail: builds-help@beam.apache.org


Mime
View raw message