beam-builds mailing list archives

Site index · List index
Message view « Date » · « Thread »
Top « Date » · « Thread »
From Apache Jenkins Server <jenk...@builds.apache.org>
Subject Build failed in Jenkins: beam_LoadTests_Java_Combine_Dataflow_Streaming #71
Date Mon, 15 Jul 2019 13:27:33 GMT
See <https://builds.apache.org/job/beam_LoadTests_Java_Combine_Dataflow_Streaming/71/display/redirect?page=changes>

Changes:

[github] Some trivial typos

------------------------------------------
[...truncated 99.75 KB...]
> Task :sdks:java:harness:classes UP-TO-DATE
> Task :sdks:java:harness:jar UP-TO-DATE
> Task :sdks:java:io:google-cloud-platform:compileJava UP-TO-DATE
> Task :sdks:java:io:google-cloud-platform:classes UP-TO-DATE
> Task :sdks:java:io:google-cloud-platform:jar UP-TO-DATE
> Task :sdks:java:harness:shadowJar UP-TO-DATE
> Task :runners:java-fn-execution:compileJava UP-TO-DATE
> Task :runners:java-fn-execution:classes UP-TO-DATE
> Task :runners:java-fn-execution:jar UP-TO-DATE
> Task :runners:google-cloud-dataflow-java:compileJava UP-TO-DATE
> Task :runners:google-cloud-dataflow-java:classes UP-TO-DATE
> Task :runners:google-cloud-dataflow-java:jar UP-TO-DATE
> Task :runners:direct-java:compileJava UP-TO-DATE
> Task :runners:direct-java:classes UP-TO-DATE
> Task :runners:direct-java:shadowJar UP-TO-DATE
> Task :sdks:java:testing:load-tests:compileJava UP-TO-DATE
> Task :sdks:java:testing:load-tests:classes UP-TO-DATE
> Task :sdks:java:testing:load-tests:jar UP-TO-DATE
> Task :runners:google-cloud-dataflow-java:worker:legacy-worker:compileJava UP-TO-DATE
> Task :runners:google-cloud-dataflow-java:worker:legacy-worker:classes UP-TO-DATE
> Task :runners:google-cloud-dataflow-java:worker:legacy-worker:shadowJar UP-TO-DATE

> Task :sdks:java:testing:load-tests:run
SLF4J: Failed to load class "org.slf4j.impl.StaticLoggerBinder".
SLF4J: Defaulting to no-operation (NOP) logger implementation
SLF4J: See http://www.slf4j.org/codes.html#StaticLoggerBinder for further details.
Dataflow SDK version: 2.15.0-SNAPSHOT
Submitted job: 2019-07-15_06_09_57-17077112085056488376
Load test results for test (ID): 8bd90d50-6c61-4611-ac55-58394bb9f6b9 and timestamp: 2019-07-15T13:09:55.741000000Z:
                 Metric:                    Value:
             runtime_sec                    18.642
       total_bytes_count                    1.98E9

Deprecated Gradle features were used in this build, making it incompatible with Gradle 6.0.
Use '--warning-mode all' to show the individual deprecation warnings.
See https://docs.gradle.org/5.2.1/userguide/command_line_interface.html#sec:command_line_warnings

BUILD SUCCESSFUL in 8m 18s
70 actionable tasks: 1 executed, 69 up-to-date

Publishing build scan...
https://gradle.com/s/witx5xpsrey2m

[beam_LoadTests_Java_Combine_Dataflow_Streaming] $ /bin/bash -xe /tmp/jenkins8437647176573810312.sh
+ echo src Load test: fanout 4 times with 2GB 10-byte records total src
src Load test: fanout 4 times with 2GB 10-byte records total src
[Gradle] - Launching build.
[src] $ <https://builds.apache.org/job/beam_LoadTests_Java_Combine_Dataflow_Streaming/ws/src/gradlew>
--continue --max-workers=12 -Dorg.gradle.jvmargs=-Xms2g -Dorg.gradle.jvmargs=-Xmx4g -PloadTest.mainClass=org.apache.beam.sdk.loadtests.CombineLoadTest
-Prunner=:runners:google-cloud-dataflow-java '-PloadTest.args=--project=apache-beam-testing
--appName=load_tests_Java_Dataflow_streaming_Combine_4 --tempLocation=gs://temp-storage-for-perf-tests/loadtests
--publishToBigQuery=true --bigQueryDataset=load_test --bigQueryTable=java_dataflow_streaming_Combine_4
--sourceOptions={"numRecords":5000000,"keySizeBytes":10,"valueSizeBytes":90} --fanout=4 --iterations=1
--topCount=20 --maxNumWorkers=16 --numWorkers=16 --autoscalingAlgorithm=NONE --perKeyCombiner=TOP_LARGEST
--streaming=true --inputWindowDurationSec=1200 --runner=DataflowRunner' :sdks:java:testing:load-tests:run
> Task :buildSrc:compileJava NO-SOURCE
> Task :buildSrc:compileGroovy UP-TO-DATE
> Task :buildSrc:pluginDescriptors UP-TO-DATE
> Task :buildSrc:processResources UP-TO-DATE
> Task :buildSrc:classes UP-TO-DATE
> Task :buildSrc:jar UP-TO-DATE
> Task :buildSrc:assemble UP-TO-DATE
> Task :buildSrc:spotlessGroovy UP-TO-DATE
> Task :buildSrc:spotlessGroovyCheck UP-TO-DATE
> Task :buildSrc:spotlessGroovyGradle UP-TO-DATE
> Task :buildSrc:spotlessGroovyGradleCheck UP-TO-DATE
> Task :buildSrc:spotlessCheck UP-TO-DATE
> Task :buildSrc:pluginUnderTestMetadata UP-TO-DATE
> Task :buildSrc:compileTestJava NO-SOURCE
> Task :buildSrc:compileTestGroovy NO-SOURCE
> Task :buildSrc:processTestResources NO-SOURCE
> Task :buildSrc:testClasses UP-TO-DATE
> Task :buildSrc:test NO-SOURCE
> Task :buildSrc:validateTaskProperties UP-TO-DATE
> Task :buildSrc:check UP-TO-DATE
> Task :buildSrc:build UP-TO-DATE
Configuration on demand is an incubating feature.
> Task :sdks:java:core:generateAvroProtocol NO-SOURCE
> Task :runners:core-java:processResources NO-SOURCE
> Task :runners:core-construction-java:processResources NO-SOURCE
> Task :sdks:java:fn-execution:processResources NO-SOURCE
> Task :vendor:sdks-java-extensions-protobuf:processResources NO-SOURCE
> Task :sdks:java:extensions:google-cloud-platform-core:processResources NO-SOURCE
> Task :sdks:java:harness:processResources NO-SOURCE
> Task :runners:java-fn-execution:processResources NO-SOURCE
> Task :model:job-management:extractProto UP-TO-DATE
> Task :model:fn-execution:extractProto UP-TO-DATE
> Task :runners:local-java:processResources NO-SOURCE
> Task :runners:direct-java:processResources NO-SOURCE
> Task :sdks:java:io:google-cloud-platform:processResources NO-SOURCE
> Task :sdks:java:extensions:protobuf:extractProto UP-TO-DATE
> Task :model:job-management:processResources UP-TO-DATE
> Task :model:fn-execution:processResources UP-TO-DATE
> Task :runners:google-cloud-dataflow-java:worker:legacy-worker:processResources NO-SOURCE
> Task :sdks:java:io:kafka:processResources NO-SOURCE
> Task :sdks:java:io:kinesis:processResources NO-SOURCE
> Task :runners:google-cloud-dataflow-java:processResources UP-TO-DATE
> Task :sdks:java:testing:test-utils:processResources NO-SOURCE
> Task :sdks:java:io:synthetic:processResources NO-SOURCE
> Task :sdks:java:core:generateAvroJava NO-SOURCE
> Task :sdks:java:extensions:protobuf:processResources NO-SOURCE
> Task :sdks:java:testing:load-tests:processResources NO-SOURCE
> Task :sdks:java:core:generateGrammarSource UP-TO-DATE
> Task :sdks:java:core:processResources UP-TO-DATE
> Task :runners:google-cloud-dataflow-java:worker:windmill:extractIncludeProto UP-TO-DATE
> Task :model:pipeline:extractIncludeProto UP-TO-DATE
> Task :runners:google-cloud-dataflow-java:worker:windmill:extractProto UP-TO-DATE
> Task :model:pipeline:extractProto UP-TO-DATE
> Task :runners:google-cloud-dataflow-java:worker:windmill:generateProto UP-TO-DATE
> Task :model:pipeline:generateProto UP-TO-DATE
> Task :model:pipeline:compileJava UP-TO-DATE
> Task :runners:google-cloud-dataflow-java:worker:windmill:compileJava UP-TO-DATE
> Task :runners:google-cloud-dataflow-java:worker:windmill:processResources UP-TO-DATE
> Task :model:pipeline:processResources UP-TO-DATE
> Task :runners:google-cloud-dataflow-java:worker:windmill:classes UP-TO-DATE
> Task :model:pipeline:classes UP-TO-DATE
> Task :runners:google-cloud-dataflow-java:worker:windmill:shadowJar UP-TO-DATE
> Task :model:pipeline:jar UP-TO-DATE
> Task :model:pipeline:shadowJar UP-TO-DATE
> Task :model:job-management:extractIncludeProto UP-TO-DATE
> Task :model:fn-execution:extractIncludeProto UP-TO-DATE
> Task :model:job-management:generateProto UP-TO-DATE
> Task :model:fn-execution:generateProto UP-TO-DATE
> Task :model:job-management:compileJava UP-TO-DATE
> Task :model:job-management:classes UP-TO-DATE
> Task :model:fn-execution:compileJava UP-TO-DATE
> Task :model:fn-execution:classes UP-TO-DATE
> Task :model:job-management:shadowJar UP-TO-DATE
> Task :model:fn-execution:shadowJar UP-TO-DATE
> Task :sdks:java:core:compileJava UP-TO-DATE
> Task :sdks:java:core:classes UP-TO-DATE
> Task :sdks:java:core:shadowJar UP-TO-DATE
> Task :vendor:sdks-java-extensions-protobuf:compileJava UP-TO-DATE
> Task :vendor:sdks-java-extensions-protobuf:classes UP-TO-DATE
> Task :runners:local-java:compileJava UP-TO-DATE
> Task :sdks:java:extensions:protobuf:extractIncludeProto UP-TO-DATE
> Task :runners:local-java:classes UP-TO-DATE
> Task :sdks:java:extensions:protobuf:generateProto NO-SOURCE
> Task :sdks:java:fn-execution:compileJava UP-TO-DATE
> Task :sdks:java:fn-execution:classes UP-TO-DATE
> Task :runners:local-java:jar UP-TO-DATE
> Task :runners:core-construction-java:compileJava UP-TO-DATE
> Task :runners:core-construction-java:classes UP-TO-DATE
> Task :sdks:java:fn-execution:jar UP-TO-DATE
> Task :sdks:java:io:synthetic:compileJava UP-TO-DATE
> Task :sdks:java:io:synthetic:classes UP-TO-DATE
> Task :sdks:java:extensions:protobuf:compileJava UP-TO-DATE
> Task :sdks:java:extensions:protobuf:classes UP-TO-DATE
> Task :sdks:java:io:synthetic:jar UP-TO-DATE
> Task :sdks:java:extensions:google-cloud-platform-core:compileJava UP-TO-DATE
> Task :vendor:sdks-java-extensions-protobuf:shadowJar UP-TO-DATE
> Task :sdks:java:extensions:google-cloud-platform-core:classes UP-TO-DATE
> Task :sdks:java:io:kafka:compileJava UP-TO-DATE
> Task :sdks:java:io:kafka:classes UP-TO-DATE
> Task :runners:core-construction-java:jar UP-TO-DATE
> Task :sdks:java:extensions:protobuf:jar UP-TO-DATE
> Task :sdks:java:extensions:google-cloud-platform-core:jar UP-TO-DATE
> Task :sdks:java:io:kinesis:compileJava UP-TO-DATE
> Task :sdks:java:io:kafka:jar UP-TO-DATE
> Task :sdks:java:io:kinesis:classes UP-TO-DATE
> Task :sdks:java:io:kinesis:jar UP-TO-DATE
> Task :runners:core-java:compileJava UP-TO-DATE
> Task :runners:core-java:classes UP-TO-DATE
> Task :runners:core-java:jar UP-TO-DATE
> Task :sdks:java:testing:test-utils:compileJava UP-TO-DATE
> Task :sdks:java:testing:test-utils:classes UP-TO-DATE
> Task :sdks:java:testing:test-utils:jar UP-TO-DATE
> Task :sdks:java:harness:compileJava UP-TO-DATE
> Task :sdks:java:harness:classes UP-TO-DATE
> Task :sdks:java:harness:jar UP-TO-DATE
> Task :sdks:java:harness:shadowJar UP-TO-DATE
> Task :sdks:java:io:google-cloud-platform:compileJava UP-TO-DATE
> Task :runners:java-fn-execution:compileJava UP-TO-DATE
> Task :sdks:java:io:google-cloud-platform:classes UP-TO-DATE
> Task :runners:java-fn-execution:classes UP-TO-DATE
> Task :sdks:java:io:google-cloud-platform:jar UP-TO-DATE
> Task :runners:java-fn-execution:jar UP-TO-DATE
> Task :runners:direct-java:compileJava UP-TO-DATE
> Task :runners:direct-java:classes UP-TO-DATE
> Task :runners:direct-java:shadowJar UP-TO-DATE
> Task :runners:google-cloud-dataflow-java:compileJava UP-TO-DATE
> Task :runners:google-cloud-dataflow-java:classes UP-TO-DATE
> Task :runners:google-cloud-dataflow-java:jar UP-TO-DATE
> Task :sdks:java:testing:load-tests:compileJava UP-TO-DATE
> Task :sdks:java:testing:load-tests:classes UP-TO-DATE
> Task :sdks:java:testing:load-tests:jar UP-TO-DATE
> Task :runners:google-cloud-dataflow-java:worker:legacy-worker:compileJava UP-TO-DATE
> Task :runners:google-cloud-dataflow-java:worker:legacy-worker:classes UP-TO-DATE
> Task :runners:google-cloud-dataflow-java:worker:legacy-worker:shadowJar UP-TO-DATE

> Task :sdks:java:testing:load-tests:run
SLF4J: Failed to load class "org.slf4j.impl.StaticLoggerBinder".
SLF4J: Defaulting to no-operation (NOP) logger implementation
SLF4J: See http://www.slf4j.org/codes.html#StaticLoggerBinder for further details.
Dataflow SDK version: 2.15.0-SNAPSHOT
Submitted job: 2019-07-15_06_18_14-1702697458586132380

> Task :sdks:java:testing:load-tests:run FAILED

FAILURE: Build failed with an exception.

* What went wrong:
Execution failed for task ':sdks:java:testing:load-tests:run'.
> Process 'command '/usr/lib/jvm/java-8-openjdk-amd64/bin/java'' finished with non-zero
exit value 143

* Try:
Run with --stacktrace option to get the stack trace. Run with --info or --debug option to
get more log output. Run with --scan to get full insights.

* Get more help at https://help.gradle.org

Deprecated Gradle features were used in this build, making it incompatible with Gradle 6.0.
Use '--warning-mode all' to show the individual deprecation warnings.
See https://docs.gradle.org/5.2.1/userguide/command_line_interface.html#sec:command_line_warnings

BUILD FAILED in 9m 23s
70 actionable tasks: 1 executed, 69 up-to-date
The message received from the daemon indicates that the daemon has disappeared.
Build request sent: Build{id=a515de39-22a7-45f3-9aa8-06aeebb663c3, currentDir=<https://builds.apache.org/job/beam_LoadTests_Java_Combine_Dataflow_Streaming/ws/src}>
Attempting to read last messages from the daemon log...
Daemon pid: 5551
  log file: /home/jenkins/.gradle/daemon/5.2.1/daemon-5551.out.log
----- Last  20 lines from daemon log file - daemon-5551.out.log -----
Submitted job: 2019-07-15_06_18_14-1702697458586132380

FAILURE: Build failed with an exception.

* What went wrong:
Execution failed for task ':sdks:java:testing:load-tests:run'.
> Process 'command '/usr/lib/jvm/java-8-openjdk-amd64/bin/java'' finished with non-zero
exit value 143

* Try:
Run with --stacktrace option to get the stack trace. Run with --info or --debug option to
get more log output. Run with --scan to get full insights.

* Get more help at https://help.gradle.org

Deprecated Gradle features were used in this build, making it incompatible with Gradle 6.0.
Use '--warning-mode all' to show the individual deprecation warnings.
See https://docs.gradle.org/5.2.1/userguide/command_line_interface.html#sec:command_line_warnings

BUILD FAILED in 9m 23s
70 actionable tasks: 1 executed, 69 up-to-date
Daemon vm is shutting down... The daemon has exited normally or was terminated in response
to a user interrupt.
----- End of the daemon log -----


FAILURE: Build failed with an exception.

* What went wrong:
Gradle build daemon disappeared unexpectedly (it may have been killed or may have crashed)

* Try:
Run with --stacktrace option to get the stack trace. Run with --info or --debug option to
get more log output. Run with --scan to get full insights.

* Get more help at https://help.gradle.org
Build step 'Invoke Gradle script' changed build result to FAILURE
Build step 'Invoke Gradle script' marked build as failure

---------------------------------------------------------------------
To unsubscribe, e-mail: builds-unsubscribe@beam.apache.org
For additional commands, e-mail: builds-help@beam.apache.org


Mime
View raw message