beam-builds mailing list archives

Site index · List index
Message view « Date » · « Thread »
Top « Date » · « Thread »
From Apache Jenkins Server <jenk...@builds.apache.org>
Subject Build failed in Jenkins: beam_PostCommit_Java_Nexmark_Dataflow #6855
Date Sun, 31 Jan 2021 06:38:32 GMT
See <https://ci-beam.apache.org/job/beam_PostCommit_Java_Nexmark_Dataflow/6855/display/redirect>

Changes:


------------------------------------------
[...truncated 1.22 MB...]
  0005  *** not run ***
  0006  *** not run ***
  0007  *** not run ***
  0008  *** not run ***
  0009  *** not run ***
  0010  *** not run ***
  0011  *** not run ***
  0012  *** not run ***
  0013          38.9                    256779.0                     9200000             

  0014  *** not run ***
==========================================================================================

2021-01-31T06:28:05.334Z RUNNING SqlQuery7
2021-01-31T06:28:06.168Z 2 samples not enough to calculate steady-state event rate
Jan 31, 2021 6:28:06 AM org.apache.beam.sdk.testutils.metrics.MetricsReader getCounterMetric
SEVERE: Failed to get metric fatal, from namespace SqlQuery7
2021-01-31T06:28:06.245Z new perf {"snapshots":null,"runtimeSec":156.168,"numEvents":3527318,"eventsPerSec":22586.68869422673,"eventBytesPerSec":2899357.9542543925,"numResults":7,"resultsPerSec":0.044823523385072485,"resultBytesPerSec":4.456738896572921,"startupDelaySec":-149.358,"processingDelaySec":124.551,"shutdownDelaySec":14.185,"timeDilation":0.384201629014907,"errors":null,"jobId":null}
2021-01-31T06:28:21.336Z RUNNING SqlQuery7
2021-01-31T06:28:22.178Z 3 samples not enough to calculate steady-state event rate
Jan 31, 2021 6:28:22 AM org.apache.beam.sdk.testutils.metrics.MetricsReader getCounterMetric
SEVERE: Failed to get metric fatal, from namespace SqlQuery7
2021-01-31T06:28:22.240Z new perf {"snapshots":null,"runtimeSec":166.149,"numEvents":3588747,"eventsPerSec":21599.57026524385,"eventBytesPerSec":2772716.5134909027,"numResults":9,"resultsPerSec":0.0541682465738584,"resultBytesPerSec":5.458955515832175,"startupDelaySec":-149.358,"processingDelaySec":124.551,"shutdownDelaySec":20.42,"timeDilation":0.4814955251009636,"errors":null,"jobId":null}
2021-01-31T06:28:37.355Z RUNNING SqlQuery7
2021-01-31T06:28:38.212Z 4 samples not enough to calculate steady-state event rate
Jan 31, 2021 6:28:38 AM org.apache.beam.sdk.testutils.metrics.MetricsReader getCounterMetric
SEVERE: Failed to get metric fatal, from namespace SqlQuery7
2021-01-31T06:28:38.300Z new perf {"snapshots":null,"runtimeSec":172.499,"numEvents":4234894,"eventsPerSec":24550.252465231682,"eventBytesPerSec":3151300.1118847067,"numResults":9,"resultsPerSec":0.052174215502698566,"resultBytesPerSec":5.258001495660845,"startupDelaySec":-149.358,"processingDelaySec":124.551,"shutdownDelaySec":36.414,"timeDilation":0.4637708044684317,"errors":null,"jobId":null}
2021-01-31T06:28:53.342Z RUNNING SqlQuery7
2021-01-31T06:28:54.168Z 4 samples not enough to calculate steady-state event rate
Jan 31, 2021 6:28:54 AM org.apache.beam.sdk.testutils.metrics.MetricsReader getCounterMetric
2021-01-31T06:28:54.278Z no activitySEVERE: Failed to get metric fatal, from namespace SqlQuery7

2021-01-31T06:29:09.324Z RUNNING SqlQuery7
2021-01-31T06:29:10.268Z 6 samples not enough to calculate steady-state event rate
Jan 31, 2021 6:29:10 AM org.apache.beam.sdk.testutils.metrics.MetricsReader getCounterMetric
SEVERE: Failed to get metric fatal, from namespace SqlQuery7
2021-01-31T06:29:10.350Z new perf {"snapshots":null,"runtimeSec":207.111,"numEvents":4484894,"eventsPerSec":21654.542733123784,"eventBytesPerSec":2779588.2497791043,"numResults":9,"resultsPerSec":0.043454958935063806,"resultBytesPerSec":4.37929419490032,"startupDelaySec":-149.358,"processingDelaySec":124.551,"shutdownDelaySec":68.452,"timeDilation":0.38626630164501163,"errors":null,"jobId":null}
2021-01-31T06:29:25.396Z RUNNING SqlQuery7
2021-01-31T06:29:26.242Z 7 samples not enough to calculate steady-state event rate
Jan 31, 2021 6:29:26 AM org.apache.beam.sdk.testutils.metrics.MetricsReader getCounterMetric
SEVERE: Failed to get metric fatal, from namespace SqlQuery7
2021-01-31T06:29:26.319Z new perf {"snapshots":null,"runtimeSec":223.698,"numEvents":4768474,"eventsPerSec":21316.56966088208,"eventBytesPerSec":2736234.0476892954,"numResults":10,"resultsPerSec":0.044703126536669975,"resultBytesPerSec":4.456901715705996,"startupDelaySec":-149.358,"processingDelaySec":124.551,"shutdownDelaySec":29.877,"timeDilation":0.40232813883002977,"errors":null,"jobId":null}
2021-01-31T06:29:41.363Z RUNNING SqlQuery7
2021-01-31T06:29:42.268Z 8 samples not enough to calculate steady-state event rate
Jan 31, 2021 6:29:42 AM org.apache.beam.sdk.testutils.metrics.MetricsReader getCounterMetric
SEVERE: Failed to get metric fatal, from namespace SqlQuery7
2021-01-31T06:29:42.368Z new perf {"snapshots":null,"runtimeSec":236.185,"numEvents":5234894,"eventsPerSec":22164.37961767259,"eventBytesPerSec":2844979.7785634142,"numResults":10,"resultsPerSec":0.04233969134365011,"resultBytesPerSec":4.221267226961915,"startupDelaySec":-149.358,"processingDelaySec":124.551,"shutdownDelaySec":45.845,"timeDilation":0.3810572220928509,"errors":null,"jobId":null}
2021-01-31T06:29:57.509Z RUNNING SqlQuery7
2021-01-31T06:29:58.498Z sample of 32.0 sec not long enough to calculate steady-state event
rate
Jan 31, 2021 6:29:58 AM org.apache.beam.sdk.testutils.metrics.MetricsReader getCounterMetric
SEVERE: Failed to get metric fatal, from namespace SqlQuery7
2021-01-31T06:29:58.566Z new perf {"snapshots":null,"runtimeSec":274.549,"numEvents":5234894,"eventsPerSec":19067.248469307848,"eventBytesPerSec":2447437.612229511,"numResults":10,"resultsPerSec":0.03642337069157054,"resultBytesPerSec":3.631410057949583,"startupDelaySec":-149.358,"processingDelaySec":124.551,"shutdownDelaySec":2.843,"timeDilation":0.400657077607276,"errors":null,"jobId":null}
2021-01-31T06:30:13.617Z RUNNING SqlQuery7
2021-01-31T06:30:14.546Z sample of 48.1 sec not long enough to calculate steady-state event
rate
Jan 31, 2021 6:30:14 AM org.apache.beam.sdk.testutils.metrics.MetricsReader getCounterMetric
SEVERE: Failed to get metric fatal, from namespace SqlQuery7
2021-01-31T06:30:14.619Z new perf {"snapshots":null,"runtimeSec":283.815,"numEvents":5234894,"eventsPerSec":18444.740411888026,"eventBytesPerSec":2367533.6011134014,"numResults":14,"resultsPerSec":0.049327907263534344,"resultBytesPerSec":4.922220460511249,"startupDelaySec":-149.358,"processingDelaySec":124.551,"shutdownDelaySec":9.774,"timeDilation":0.4580448531613903,"errors":null,"jobId":null}
2021-01-31T06:30:29.708Z RUNNING SqlQuery7
2021-01-31T06:30:30.639Z sample of 64.1 sec not long enough to calculate steady-state event
rate
Jan 31, 2021 6:30:30 AM org.apache.beam.sdk.testutils.metrics.MetricsReader getCounterMetric
SEVERE: Failed to get metric fatal, from namespace SqlQuery7
2021-01-31T06:30:30.726Z new perf {"snapshots":null,"runtimeSec":300.363,"numEvents":5234894,"eventsPerSec":17428.55811135193,"eventBytesPerSec":2237098.2744212835,"numResults":17,"resultsPerSec":0.056598182865399534,"resultBytesPerSec":5.703099249907612,"startupDelaySec":-149.358,"processingDelaySec":124.551,"shutdownDelaySec":9.28,"timeDilation":0.5326887799096427,"errors":null,"jobId":null}
2021-01-31T06:30:45.769Z RUNNING SqlQuery7
2021-01-31T06:30:46.619Z sample of 48.0 sec not long enough to calculate steady-state event
rate
Jan 31, 2021 6:30:46 AM org.apache.beam.sdk.testutils.metrics.MetricsReader getCounterMetric
SEVERE: Failed to get metric fatal, from namespace SqlQuery7
2021-01-31T06:30:46.679Z new perf {"snapshots":null,"runtimeSec":306.942,"numEvents":5234894,"eventsPerSec":17054.994103120458,"eventBytesPerSec":2189148.272312033,"numResults":18,"resultsPerSec":0.05864300095783568,"resultBytesPerSec":5.867558040281225,"startupDelaySec":-149.358,"processingDelaySec":124.551,"shutdownDelaySec":18.808,"timeDilation":0.5538505646017814,"errors":null,"jobId":null}
2021-01-31T06:31:01.784Z RUNNING SqlQuery7
2021-01-31T06:31:02.675Z sample of 64.1 sec not long enough to calculate steady-state event
rate
Jan 31, 2021 6:31:02 AM org.apache.beam.sdk.testutils.metrics.MetricsReader getCounterMetric
SEVERE: Failed to get metric fatal, from namespace SqlQuery7
2021-01-31T06:31:02.743Z new perf {"snapshots":null,"runtimeSec":329.164,"numEvents":5734894,"eventsPerSec":17422.60392995589,"eventBytesPerSec":2236363.259651724,"numResults":20,"resultsPerSec":0.06075998590368327,"resultBytesPerSec":6.12156857979609,"startupDelaySec":-149.358,"processingDelaySec":124.551,"shutdownDelaySec":12.538,"timeDilation":0.5772198660849911,"errors":null,"jobId":null}
2021-01-31T06:31:17.803Z RUNNING SqlQuery7
2021-01-31T06:31:18.731Z sample of 80.3 sec not long enough to calculate steady-state event
rate
Jan 31, 2021 6:31:18 AM org.apache.beam.sdk.testutils.metrics.MetricsReader getCounterMetric
SEVERE: Failed to get metric fatal, from namespace SqlQuery7
2021-01-31T06:31:18.798Z new perf {"snapshots":null,"runtimeSec":339.974,"numEvents":6554894,"eventsPerSec":19280.574396865642,"eventBytesPerSec":2474797.0050650933,"numResults":20,"resultsPerSec":0.05882802802567255,"resultBytesPerSec":5.92692382358651,"startupDelaySec":-149.358,"processingDelaySec":124.551,"shutdownDelaySec":28.602,"timeDilation":0.5588662662438892,"errors":null,"jobId":null}
2021-01-31T06:31:33.879Z RUNNING SqlQuery7
2021-01-31T06:31:34.705Z sample of 64.3 sec not long enough to calculate steady-state event
rate
Jan 31, 2021 6:31:34 AM org.apache.beam.sdk.testutils.metrics.MetricsReader getCounterMetric
SEVERE: Failed to get metric fatal, from namespace SqlQuery7
2021-01-31T06:31:34.837Z new perf {"snapshots":null,"runtimeSec":360.696,"numEvents":6767172,"eventsPerSec":18761.427906048306,"eventBytesPerSec":2408178.9152083746,"numResults":20,"resultsPerSec":0.05544835540177878,"resultBytesPerSec":5.586421806729212,"startupDelaySec":-149.358,"processingDelaySec":124.551,"shutdownDelaySec":44.657,"timeDilation":0.5267593763168984,"errors":null,"jobId":null}
2021-01-31T06:31:49.918Z RUNNING SqlQuery7
2021-01-31T06:31:50.812Z sample of 80.3 sec not long enough to calculate steady-state event
rate
Jan 31, 2021 6:31:50 AM org.apache.beam.sdk.testutils.metrics.MetricsReader getCounterMetric
SEVERE: Failed to get metric fatal, from namespace SqlQuery7
2021-01-31T06:31:50.877Z new perf {"snapshots":null,"runtimeSec":376.124,"numEvents":7064894,"eventsPerSec":18783.41717093299,"eventBytesPerSec":2410975.954738331,"numResults":20,"resultsPerSec":0.053173953270729865,"resultBytesPerSec":5.357275792026034,"startupDelaySec":-149.358,"processingDelaySec":124.551,"shutdownDelaySec":60.697,"timeDilation":0.5051525560719337,"errors":null,"jobId":null}
2021-01-31T06:32:05.950Z RUNNING SqlQuery7
2021-01-31T06:32:06.959Z sample of 96.4 sec not long enough to calculate steady-state event
rate
Jan 31, 2021 6:32:07 AM org.apache.beam.sdk.testutils.metrics.MetricsReader getCounterMetric
SEVERE: Failed to get metric fatal, from namespace SqlQuery7
2021-01-31T06:32:07.045Z new perf {"snapshots":null,"runtimeSec":397.766,"numEvents":7064894,"eventsPerSec":17761.432601077013,"eventBytesPerSec":2279797.468863603,"numResults":21,"resultsPerSec":0.05279485928912979,"resultBytesPerSec":5.322224624527989,"startupDelaySec":-149.358,"processingDelaySec":124.551,"shutdownDelaySec":8.134,"timeDilation":0.502808183705998,"errors":null,"jobId":null}
2021-01-31T06:32:22.119Z RUNNING SqlQuery7
2021-01-31T06:32:23.040Z sample of 80.4 sec not long enough to calculate steady-state event
rate
Jan 31, 2021 6:32:23 AM org.apache.beam.sdk.testutils.metrics.MetricsReader getCounterMetric
SEVERE: Failed to get metric fatal, from namespace SqlQuery7
2021-01-31T06:32:23.115Z new perf {"snapshots":null,"runtimeSec":406.238,"numEvents":7064894,"eventsPerSec":17391.022011727116,"eventBytesPerSec":2232252.817313988,"numResults":24,"resultsPerSec":0.059078668169890554,"resultBytesPerSec":5.927559706379019,"startupDelaySec":-149.358,"processingDelaySec":124.551,"shutdownDelaySec":15.83,"timeDilation":0.5661705699614512,"errors":null,"jobId":null}
2021-01-31T06:32:38.221Z RUNNING SqlQuery7
2021-01-31T06:32:39.148Z sample of 96.3 sec not long enough to calculate steady-state event
rate
Jan 31, 2021 6:32:39 AM org.apache.beam.sdk.testutils.metrics.MetricsReader getCounterMetric
SEVERE: Failed to get metric fatal, from namespace SqlQuery7
2021-01-31T06:32:39.225Z new perf {"snapshots":null,"runtimeSec":421.252,"numEvents":7064894,"eventsPerSec":16771.182095277887,"eventBytesPerSec":2152692.2602147884,"numResults":27,"resultsPerSec":0.06409465118266501,"resultBytesPerSec":6.407091242296772,"startupDelaySec":-149.358,"processingDelaySec":124.551,"shutdownDelaySec":16.886,"timeDilation":0.6172077521293667,"errors":null,"jobId":null}
2021-01-31T06:32:54.387Z RUNNING SqlQuery7
2021-01-31T06:32:55.366Z sample of 112.4 sec not long enough to calculate steady-state event
rate
Jan 31, 2021 6:32:55 AM org.apache.beam.sdk.testutils.metrics.MetricsReader getCounterMetric
SEVERE: Failed to get metric fatal, from namespace SqlQuery7
2021-01-31T06:32:55.444Z new perf {"snapshots":null,"runtimeSec":438.441,"numEvents":7064894,"eventsPerSec":16113.67093862116,"eventBytesPerSec":2068296.35002201,"numResults":29,"resultsPerSec":0.06614344917560173,"resultBytesPerSec":6.669084323774465,"startupDelaySec":-149.358,"processingDelaySec":124.551,"shutdownDelaySec":15.808,"timeDilation":0.6386264058333961,"errors":null,"jobId":null}
2021-01-31T06:33:10.523Z RUNNING SqlQuery7
2021-01-31T06:33:11.527Z sample of 96.4 sec not long enough to calculate steady-state event
rate
Jan 31, 2021 6:33:11 AM org.apache.beam.sdk.testutils.metrics.MetricsReader getCounterMetric
SEVERE: Failed to get metric fatal, from namespace SqlQuery7
2021-01-31T06:33:11.625Z new perf {"snapshots":null,"runtimeSec":452.107,"numEvents":7574894,"eventsPerSec":16754.648788892893,"eventBytesPerSec":2150563.6276368205,"numResults":30,"resultsPerSec":0.06635597325411904,"resultBytesPerSec":6.697529567115748,"startupDelaySec":-149.358,"processingDelaySec":124.551,"shutdownDelaySec":22.005,"timeDilation":0.6414410747898174,"errors":null,"jobId":null}
2021-01-31T06:33:26.735Z RUNNING SqlQuery7
2021-01-31T06:33:27.766Z sample of 112.5 sec not long enough to calculate steady-state event
rate
Jan 31, 2021 6:33:27 AM org.apache.beam.sdk.testutils.metrics.MetricsReader getCounterMetric
SEVERE: Failed to get metric fatal, from namespace SqlQuery7
2021-01-31T06:33:27.847Z new perf {"snapshots":null,"runtimeSec":469.531,"numEvents":7834894,"eventsPerSec":16686.63836892559,"eventBytesPerSec":2141843.3372876337,"numResults":31,"resultsPerSec":0.06602332966300414,"resultBytesPerSec":6.689654144241807,"startupDelaySec":-149.358,"processingDelaySec":124.551,"shutdownDelaySec":29.743,"timeDilation":0.6389354483516531,"errors":null,"jobId":null}
2021-01-31T06:33:42.966Z RUNNING SqlQuery7
2021-01-31T06:33:44.068Z revising events/sec from 15784.3 to 18957.1
Jan 31, 2021 6:33:44 AM org.apache.beam.sdk.testutils.metrics.MetricsReader getCounterMetric
SEVERE: Failed to get metric fatal, from namespace SqlQuery7
2021-01-31T06:33:44.146Z new perf {"snapshots":null,"runtimeSec":496.373,"numEvents":7834894,"eventsPerSec":18957.121187387587,"eventBytesPerSec":2026020.4402737457,"numResults":31,"resultsPerSec":0.062453034310891206,"resultBytesPerSec":6.3279026055003,"startupDelaySec":-149.358,"processingDelaySec":124.551,"shutdownDelaySec":45.963,"timeDilation":0.6043842030086246,"errors":null,"jobId":null}
2021-01-31T06:33:59.245Z RUNNING SqlQuery7
2021-01-31T06:34:00.267Z sample of 112.5 sec not long enough to calculate steady-state event
rate
Jan 31, 2021 6:34:00 AM org.apache.beam.sdk.testutils.metrics.MetricsReader getCounterMetric
SEVERE: Failed to get metric fatal, from namespace SqlQuery7
2021-01-31T06:34:00.364Z new perf {"snapshots":null,"runtimeSec":507.679,"numEvents":8344894,"eventsPerSec":16437.343281876936,"eventBytesPerSec":2109828.155192553,"numResults":31,"resultsPerSec":0.061062206630567745,"resultBytesPerSec":6.1869803556972025,"startupDelaySec":-149.358,"processingDelaySec":124.551,"shutdownDelaySec":62.262,"timeDilation":0.5909245802958168,"errors":null,"jobId":null}
2021-01-31T06:34:15.460Z RUNNING SqlQuery7
2021-01-31T06:34:16.486Z sample of 112.5 sec not long enough to calculate steady-state event
rate
Jan 31, 2021 6:34:16 AM org.apache.beam.sdk.testutils.metrics.MetricsReader getCounterMetric
2021-01-31T06:34:16.551Z no activity
SEVERE: Failed to get metric fatal, from namespace SqlQuery7
2021-01-31T06:34:31.635Z RUNNING SqlQuery7
2021-01-31T06:34:32.640Z revising events/sec from 16097.6 to 18658.3
Jan 31, 2021 6:34:32 AM org.apache.beam.sdk.testutils.metrics.MetricsReader getCounterMetric
SEVERE: Failed to get metric fatal, from namespace SqlQuery7
2021-01-31T06:34:32.723Z new perf {"snapshots":null,"runtimeSec":541.999,"numEvents":8724894,"eventsPerSec":18658.265443567027,"eventBytesPerSec":2066203.7623685652,"numResults":31,"resultsPerSec":0.05719567748279978,"resultBytesPerSec":5.795213644305616,"startupDelaySec":-149.358,"processingDelaySec":124.551,"shutdownDelaySec":94.667,"timeDilation":0.5535065562851592,"errors":null,"jobId":null}
2021-01-31T06:34:47.765Z RUNNING SqlQuery7
2021-01-31T06:34:48.798Z revising events/sec from 15750.8 to 18574.9
Jan 31, 2021 6:34:48 AM org.apache.beam.sdk.testutils.metrics.MetricsReader getCounterMetric
SEVERE: Failed to get metric fatal, from namespace SqlQuery7
2021-01-31T06:34:48.871Z new perf {"snapshots":null,"runtimeSec":553.933,"numEvents":8724894,"eventsPerSec":18574.891839888256,"eventBytesPerSec":2021689.2169269568,"numResults":35,"resultsPerSec":0.06318453675805558,"resultBytesPerSec":6.370806577690804,"startupDelaySec":-149.358,"processingDelaySec":124.551,"shutdownDelaySec":13.814,"timeDilation":0.6137926427925399,"errors":null,"jobId":null}
2021-01-31T06:35:03.942Z RUNNING SqlQuery7
2021-01-31T06:35:05.494Z revising events/sec from 15305.4 to 18574.9
Jan 31, 2021 6:35:05 AM org.apache.beam.sdk.testutils.metrics.MetricsReader getCounterMetric
SEVERE: Failed to get metric fatal, from namespace SqlQuery7
2021-01-31T06:35:05.585Z new perf {"snapshots":null,"runtimeSec":570.052,"numEvents":8724894,"eventsPerSec":18574.891839888256,"eventBytesPerSec":1964523.189112572,"numResults":37,"resultsPerSec":0.0649063594198424,"resultBytesPerSec":6.546771171752752,"startupDelaySec":-149.358,"processingDelaySec":124.551,"shutdownDelaySec":13.843,"timeDilation":0.6315213348957639,"errors":null,"jobId":null}
2021-01-31T06:35:20.644Z RUNNING SqlQuery7
2021-01-31T06:35:21.657Z revising events/sec from 15215.5 to 18574.9
Jan 31, 2021 6:35:21 AM org.apache.beam.sdk.testutils.metrics.MetricsReader getCounterMetric
SEVERE: Failed to get metric fatal, from namespace SqlQuery7
2021-01-31T06:35:21.730Z new perf {"snapshots":null,"runtimeSec":573.421,"numEvents":8724894,"eventsPerSec":18574.891839888256,"eventBytesPerSec":1952981.0959138223,"numResults":38,"resultsPerSec":0.06626893678466605,"resultBytesPerSec":6.6739795019715,"startupDelaySec":-149.358,"processingDelaySec":124.551,"shutdownDelaySec":27.187,"timeDilation":0.645250173955959,"errors":null,"jobId":null}
2021-01-31T06:35:36.823Z RUNNING SqlQuery7
2021-01-31T06:35:37.729Z revising events/sec from 14798.3 to 18416.2
Jan 31, 2021 6:35:37 AM org.apache.beam.sdk.testutils.metrics.MetricsReader getCounterMetric
SEVERE: Failed to get metric fatal, from namespace SqlQuery7
2021-01-31T06:35:37.812Z new perf {"snapshots":null,"runtimeSec":601.753,"numEvents":8904894,"eventsPerSec":18416.22212226924,"eventBytesPerSec":1899425.37220421,"numResults":40,"resultsPerSec":0.06647245630682357,"resultBytesPerSec":6.695438161504803,"startupDelaySec":-149.358,"processingDelaySec":124.551,"shutdownDelaySec":15.001,"timeDilation":0.6481064489915297,"errors":null,"jobId":null}
2021-01-31T06:35:52.903Z RUNNING SqlQuery7
2021-01-31T06:35:53.927Z revising events/sec from 14757.2 to 17986.4
Jan 31, 2021 6:35:54 AM org.apache.beam.sdk.testutils.metrics.MetricsReader getCounterMetric
SEVERE: Failed to get metric fatal, from namespace SqlQuery7
2021-01-31T06:35:54.266Z new perf {"snapshots":null,"runtimeSec":608.847,"numEvents":8984894,"eventsPerSec":17986.38048463563,"eventBytesPerSec":1894161.8616828201,"numResults":40,"resultsPerSec":0.06569795038819276,"resultBytesPerSec":6.617426052850717,"startupDelaySec":-149.358,"processingDelaySec":124.551,"shutdownDelaySec":31.082,"timeDilation":0.6405550162848794,"errors":null,"jobId":null}
2021-01-31T06:36:09.384Z RUNNING SqlQuery7
2021-01-31T06:36:10.882Z revising events/sec from 14757.2 to 17986.4
Jan 31, 2021 6:36:10 AM org.apache.beam.sdk.testutils.metrics.MetricsReader getCounterMetric
2021-01-31T06:36:10.971Z no activity
SEVERE: Failed to get metric fatal, from namespace SqlQuery7
2021-01-31T06:36:26.041Z RUNNING SqlQuery7
2021-01-31T06:36:27.665Z revising events/sec from 14429.5 to 17667.1
Jan 31, 2021 6:36:27 AM org.apache.beam.sdk.testutils.metrics.MetricsReader getCounterMetric
SEVERE: Failed to get metric fatal, from namespace SqlQuery7
2021-01-31T06:36:27.777Z new perf {"snapshots":null,"runtimeSec":639.999,"numEvents":9234894,"eventsPerSec":17667.070816619947,"eventBytesPerSec":1852120.1720627688,"numResults":40,"resultsPerSec":0.06250009765640259,"resultBytesPerSec":6.29532233644115,"startupDelaySec":-149.358,"processingDelaySec":124.551,"shutdownDelaySec":64.241,"timeDilation":0.6093759521499252,"errors":null,"jobId":null}
2021-01-31T06:36:42.836Z RUNNING SqlQuery7
2021-01-31T06:36:43.942Z revising events/sec from 13605.4 to 17667.1
Jan 31, 2021 6:36:44 AM org.apache.beam.sdk.testutils.metrics.MetricsReader getCounterMetric
SEVERE: Failed to get metric fatal, from namespace SqlQuery7
2021-01-31T06:36:44.023Z new perf {"snapshots":null,"runtimeSec":678.765,"numEvents":9234894,"eventsPerSec":17667.070816619947,"eventBytesPerSec":1746340.866131872,"numResults":43,"resultsPerSec":0.06335034953187038,"resultBytesPerSec":6.393965510891104,"startupDelaySec":-149.358,"processingDelaySec":124.551,"shutdownDelaySec":4.035,"timeDilation":0.6335034953187039,"errors":null,"jobId":null}
2021-01-31T06:36:59.156Z RUNNING SqlQuery7
2021-01-31T06:37:00.159Z revising events/sec from 13375.8 to 17418.0
Jan 31, 2021 6:37:00 AM org.apache.beam.sdk.testutils.metrics.MetricsReader getCounterMetric
SEVERE: Failed to get metric fatal, from namespace SqlQuery7
2021-01-31T06:37:00.259Z new perf {"snapshots":null,"runtimeSec":690.419,"numEvents":9234894,"eventsPerSec":17417.959686697985,"eventBytesPerSec":1716863.3221275776,"numResults":47,"resultsPerSec":0.0680746039723704,"resultBytesPerSec":6.861051042917417,"startupDelaySec":-149.358,"processingDelaySec":124.551,"shutdownDelaySec":8.627,"timeDilation":0.6662620814317103,"errors":null,"jobId":null}
2021-01-31T06:37:15.315Z RUNNING SqlQuery7
2021-01-31T06:37:16.707Z revising events/sec from 13043.7 to 17447.0
Jan 31, 2021 6:37:16 AM org.apache.beam.sdk.testutils.metrics.MetricsReader getCounterMetric
SEVERE: Failed to get metric fatal, from namespace SqlQuery7
2021-01-31T06:37:16.796Z new perf {"snapshots":null,"runtimeSec":707.994,"numEvents":9234894,"eventsPerSec":17446.986265894542,"eventBytesPerSec":1674244.496422286,"numResults":49,"resultsPerSec":0.06920962607027743,"resultBytesPerSec":6.983110026356155,"startupDelaySec":-149.358,"processingDelaySec":124.551,"shutdownDelaySec":7.289,"timeDilation":0.6779718472190442,"errors":null,"jobId":null}
2021-01-31T06:37:31.881Z RUNNING SqlQuery7
2021-01-31T06:37:32.956Z revising events/sec from 12842.4 to 17447.0
Jan 31, 2021 6:37:33 AM org.apache.beam.sdk.testutils.metrics.MetricsReader getCounterMetric
SEVERE: Failed to get metric fatal, from namespace SqlQuery7
2021-01-31T06:37:33.046Z new perf {"snapshots":null,"runtimeSec":719.093,"numEvents":9234894,"eventsPerSec":17446.986265894542,"eventBytesPerSec":1648402.9993338832,"numResults":50,"resultsPerSec":0.06953203549471348,"resultBytesPerSec":7.00604789644733,"startupDelaySec":-149.358,"processingDelaySec":124.551,"shutdownDelaySec":12.726,"timeDilation":0.6814139478481921,"errors":null,"jobId":null}
2021-01-31T06:37:48.158Z RUNNING SqlQuery7
2021-01-31T06:37:49.071Z revising events/sec from 12729.2 to 17177.7
Jan 31, 2021 6:37:49 AM org.apache.beam.sdk.testutils.metrics.MetricsReader getCounterMetric
SEVERE: Failed to get metric fatal, from namespace SqlQuery7
2021-01-31T06:37:49.182Z new perf {"snapshots":null,"runtimeSec":725.491,"numEvents":9234894,"eventsPerSec":17177.671996687717,"eventBytesPerSec":1633865.9721485174,"numResults":51,"resultsPerSec":0.0702972194003785,"resultBytesPerSec":7.08623539092835,"startupDelaySec":-149.358,"processingDelaySec":124.551,"shutdownDelaySec":22.578,"timeDilation":0.6891884254939069,"errors":null,"jobId":null}
2021-01-31T06:38:04.290Z RUNNING SqlQuery7
2021-01-31T06:38:05.545Z revising events/sec from 12729.2 to 17177.7
Jan 31, 2021 6:38:05 AM org.apache.beam.sdk.testutils.metrics.MetricsReader getCounterMetric
2021-01-31T06:38:05.633Z no activity
SEVERE: Failed to get metric fatal, from namespace SqlQuery7
2021-01-31T06:38:20.778Z RUNNING SqlQuery7
2021-01-31T06:38:21.824Z revising events/sec from 12426.5 to 17158.2
Jan 31, 2021 6:38:21 AM org.apache.beam.sdk.testutils.metrics.MetricsReader getCounterMetric
SEVERE: Failed to get metric fatal, from namespace SqlQuery7
2021-01-31T06:38:21.909Z new perf {"snapshots":null,"runtimeSec":763.278,"numEvents":9484894,"eventsPerSec":17158.20896825916,"eventBytesPerSec":1595035.378983804,"numResults":51,"resultsPerSec":0.06681707058240903,"resultBytesPerSec":6.735422742434604,"startupDelaySec":-149.358,"processingDelaySec":124.551,"shutdownDelaySec":55.165,"timeDilation":0.6550693194353826,"errors":null,"jobId":null}

> Task :sdks:java:testing:nexmark:run FAILED
The message received from the daemon indicates that the daemon has disappeared.
Build request sent: Build{id=913b2809-c1f0-495f-b8af-8ab7317955a4, currentDir=<https://ci-beam.apache.org/job/beam_PostCommit_Java_Nexmark_Dataflow/ws/src}>
Attempting to read last messages from the daemon log...
Daemon pid: 12959
  log file: /home/jenkins/.gradle/daemon/6.8/daemon-12959.out.log
----- Last  20 lines from daemon log file - daemon-12959.out.log -----
2021-01-31T06:37:32.956Z revising events/sec from 12842.4 to 17447.0
Jan 31, 2021 6:37:33 AM org.apache.beam.sdk.testutils.metrics.MetricsReader getCounterMetric
SEVERE: Failed to get metric fatal, from namespace SqlQuery7
2021-01-31T06:37:33.046Z new perf {"snapshots":null,"runtimeSec":719.093,"numEvents":9234894,"eventsPerSec":17446.986265894542,"eventBytesPerSec":1648402.9993338832,"numResults":50,"resultsPerSec":0.06953203549471348,"resultBytesPerSec":7.00604789644733,"startupDelaySec":-149.358,"processingDelaySec":124.551,"shutdownDelaySec":12.726,"timeDilation":0.6814139478481921,"errors":null,"jobId":null}
2021-01-31T06:37:48.158Z RUNNING SqlQuery7
2021-01-31T06:37:49.071Z revising events/sec from 12729.2 to 17177.7
Jan 31, 2021 6:37:49 AM org.apache.beam.sdk.testutils.metrics.MetricsReader getCounterMetric
SEVERE: Failed to get metric fatal, from namespace SqlQuery7
2021-01-31T06:37:49.182Z new perf {"snapshots":null,"runtimeSec":725.491,"numEvents":9234894,"eventsPerSec":17177.671996687717,"eventBytesPerSec":1633865.9721485174,"numResults":51,"resultsPerSec":0.0702972194003785,"resultBytesPerSec":7.08623539092835,"startupDelaySec":-149.358,"processingDelaySec":124.551,"shutdownDelaySec":22.578,"timeDilation":0.6891884254939069,"errors":null,"jobId":null}
2021-01-31T06:38:04.290Z RUNNING SqlQuery7
2021-01-31T06:38:05.545Z revising events/sec from 12729.2 to 17177.7
Jan 31, 2021 6:38:05 AM org.apache.beam.sdk.testutils.metrics.MetricsReader getCounterMetric
2021-01-31T06:38:05.633Z no activity
SEVERE: Failed to get metric fatal, from namespace SqlQuery7
2021-01-31T06:38:20.778Z RUNNING SqlQuery7
2021-01-31T06:38:21.824Z revising events/sec from 12426.5 to 17158.2
Jan 31, 2021 6:38:21 AM org.apache.beam.sdk.testutils.metrics.MetricsReader getCounterMetric
SEVERE: Failed to get metric fatal, from namespace SqlQuery7
2021-01-31T06:38:21.909Z new perf {"snapshots":null,"runtimeSec":763.278,"numEvents":9484894,"eventsPerSec":17158.20896825916,"eventBytesPerSec":1595035.378983804,"numResults":51,"resultsPerSec":0.06681707058240903,"resultBytesPerSec":6.735422742434604,"startupDelaySec":-149.358,"processingDelaySec":124.551,"shutdownDelaySec":55.165,"timeDilation":0.6550693194353826,"errors":null,"jobId":null}
Daemon vm is shutting down... The daemon has exited normally or was terminated in response
to a user interrupt.
----- End of the daemon log -----


FAILURE: Build failed with an exception.

* What went wrong:
Gradle build daemon disappeared unexpectedly (it may have been killed or may have crashed)

* Try:
Run with --stacktrace option to get the stack trace. Run with --info or --debug option to
get more log output. Run with --scan to get full insights.

* Get more help at https://help.gradle.org
Build step 'Invoke Gradle script' changed build result to FAILURE
Build step 'Invoke Gradle script' marked build as failure

---------------------------------------------------------------------
To unsubscribe, e-mail: builds-unsubscribe@beam.apache.org
For additional commands, e-mail: builds-help@beam.apache.org


Mime
View raw message